You are viewing a plain text version of this content. The canonical link for it is here.
Posted to builds@beam.apache.org by Apache Jenkins Server <je...@builds.apache.org> on 2023/07/31 04:16:02 UTC
Build failed in Jenkins: beam_PreCommit_Go_Cron #7403
See <https://ci-beam.apache.org/job/beam_PreCommit_Go_Cron/7403/display/redirect>
Changes:
------------------------------------------
[...truncated 6.23 KB...]
> Task :buildSrc:pluginUnderTestMetadata
> Task :buildSrc:processTestResources NO-SOURCE
> Task :buildSrc:testClasses UP-TO-DATE
> Task :buildSrc:test NO-SOURCE
> Task :buildSrc:validatePlugins FROM-CACHE
> Task :buildSrc:check UP-TO-DATE
> Task :buildSrc:build
> Configure project :sdks:go:container
docker-pull-licenses set, running go-licenses
System Go installation: /snap/bin/go is go version go1.16.15 linux/amd64; Preparing to use /home/jenkins/go/bin/go1.20.6
go1.20.6: already downloaded in /home/jenkins/sdk/go1.20.6
GOCMD=/home/jenkins/go/bin/go1.20.6
System Go installation: /snap/bin/go is go version go1.16.15 linux/amd64; Preparing to use /home/jenkins/go/bin/go1.20.6
go1.20.6: already downloaded in /home/jenkins/sdk/go1.20.6
GOCMD=/home/jenkins/go/bin/go1.20.6
System Go installation: /snap/bin/go is go version go1.16.15 linux/amd64; Preparing to use /home/jenkins/go/bin/go1.20.6
go1.20.6: already downloaded in /home/jenkins/sdk/go1.20.6
GOCMD=/home/jenkins/go/bin/go1.20.6
System Go installation: /snap/bin/go is go version go1.16.15 linux/amd64; Preparing to use /home/jenkins/go/bin/go1.20.6
go1.20.6: already downloaded in /home/jenkins/sdk/go1.20.6
GOCMD=/home/jenkins/go/bin/go1.20.6
System Go installation: /snap/bin/go is go version go1.16.15 linux/amd64; Preparing to use /home/jenkins/go/bin/go1.20.6
go1.20.6: already downloaded in /home/jenkins/sdk/go1.20.6
GOCMD=/home/jenkins/go/bin/go1.20.6
System Go installation: /snap/bin/go is go version go1.16.15 linux/amd64; Preparing to use /home/jenkins/go/bin/go1.20.6
go1.20.6: already downloaded in /home/jenkins/sdk/go1.20.6
GOCMD=/home/jenkins/go/bin/go1.20.6
> Task :sdks:go:examples:goPrepare UP-TO-DATE
> Task :sdks:go:container:goPrepare UP-TO-DATE
> Task :sdks:java:container:goPrepare UP-TO-DATE
> Task :sdks:go:goPrepare UP-TO-DATE
> Task :sdks:python:container:goPrepare UP-TO-DATE
> Task :sdks:go:test:goPrepare UP-TO-DATE
> Task :sdks:go:container:goBuild
/home/jenkins/go/bin/go1.20.6 build -o ./build/target/linux_amd64/boot boot.go boot_test.go
> Task :sdks:java:container:goBuild
/home/jenkins/go/bin/go1.20.6 build -o ./build/target/linux_amd64/boot boot.go boot_test.go pathingjar.go pathingjar_test.go
> Task :sdks:go:test:goBuild
/home/jenkins/go/bin/go1.20.6 build -o ./build/bin/linux_amd64/ ./...
> Task :sdks:python:container:goBuild
/home/jenkins/go/bin/go1.20.6 build -o ./build/target/launcher/linux_amd64/boot boot.go piputil.go
> Task :sdks:go:examples:goBuild
/home/jenkins/go/bin/go1.20.6 build -o ./build/bin/linux_amd64/ ./...
# github.com/apache/beam/sdks/v2/go/examples/complete/autocomplete
/home/jenkins/sdk/go1.20.6/pkg/tool/linux_amd64/link: mapping output file failed: no space left on device
> Task :sdks:go:goBuild
/home/jenkins/go/bin/go1.20.6 build -o ./build/bin/linux_amd64/ ./...
# github.com/apache/beam/sdks/v2/go/examples/cookbook/join
/home/jenkins/sdk/go1.20.6/pkg/tool/linux_amd64/link: mapping output file failed: no space left on device
# github.com/apache/beam/sdks/v2/go/examples/kafka
compile: writing output: write $WORK/b617/_pkg_.a: no space left on device
> Task :sdks:go:test:goBuild
# github.com/apache/beam/sdks/v2/go/test/load/pardo
/home/jenkins/sdk/go1.20.6/pkg/tool/linux_amd64/link: mapping output file failed: no space left on device
# github.com/apache/beam/sdks/v2/go/test/load/combine
/home/jenkins/sdk/go1.20.6/pkg/tool/linux_amd64/link: mapping output file failed: no space left on device
# github.com/apache/beam/sdks/v2/go/test/load/cogbk
/home/jenkins/sdk/go1.20.6/pkg/tool/linux_amd64/link: mapping output file failed: no space left on device
# github.com/apache/beam/sdks/v2/go/test/load/sideinput
/home/jenkins/sdk/go1.20.6/pkg/tool/linux_amd64/link: mapping output file failed: no space left on device
# github.com/apache/beam/sdks/v2/go/test/load/group_by_key
/home/jenkins/sdk/go1.20.6/pkg/tool/linux_amd64/link: mapping output file failed: no space left on device
> Task :sdks:go:test:goBuild FAILED
> Task :sdks:go:examples:goBuild
# github.com/apache/beam/sdks/v2/go/examples/cookbook/join
/home/jenkins/sdk/go1.20.6/pkg/tool/linux_amd64/link: mapping output file failed: no space left on device
# github.com/apache/beam/sdks/v2/go/examples/stringsplit
compile: writing output: write $WORK/b585/_pkg_.a: no space left on device
# github.com/apache/beam/sdks/v2/go/examples/cookbook/combine
/home/jenkins/sdk/go1.20.6/pkg/tool/linux_amd64/link: mapping output file failed: no space left on device
# github.com/apache/beam/sdks/v2/go/examples/cookbook/filter
/home/jenkins/sdk/go1.20.6/pkg/tool/linux_amd64/link: mapping output file failed: no space left on device
# github.com/apache/beam/sdks/v2/go/examples/kafka
compile: writing output: write $WORK/b572/_pkg_.a: no space left on device
# github.com/apache/beam/sdks/v2/go/examples/multiout
/home/jenkins/sdk/go1.20.6/pkg/tool/linux_amd64/link: mapping output file failed: no space left on device
# github.com/apache/beam/sdks/v2/go/examples/fhirio/import
/home/jenkins/sdk/go1.20.6/pkg/tool/linux_amd64/link: mapping output file failed: no space left on device
# github.com/apache/beam/sdks/v2/go/examples/contains
/home/jenkins/sdk/go1.20.6/pkg/tool/linux_amd64/link: mapping output file failed: no space left on device
# github.com/apache/beam/sdks/v2/go/examples/pingpong
/home/jenkins/sdk/go1.20.6/pkg/tool/linux_amd64/link: mapping output file failed: no space left on device
# github.com/apache/beam/sdks/v2/go/examples/readavro
/home/jenkins/sdk/go1.20.6/pkg/tool/linux_amd64/link: mapping output file failed: no space left on device
# github.com/apache/beam/sdks/v2/go/examples/streaming_wordcap
/home/jenkins/sdk/go1.20.6/pkg/tool/linux_amd64/link: mapping output file failed: no space left on device
# github.com/apache/beam/sdks/v2/go/examples/native_wordcap
/home/jenkins/sdk/go1.20.6/pkg/tool/linux_amd64/link: mapping output file failed: no space left on device
github.com/apache/beam/sdks/v2/go/examples/xlang/multi_input_output: write /tmp/go-build2345969077/b630/importcfg.link: no space left on device
github.com/apache/beam/sdks/v2/go/examples/xlang/sql: mkdir /tmp/go-build2345969077/b632/: no space left on device
github.com/apache/beam/sdks/v2/go/examples/xlang/wordcount: mkdir /tmp/go-build2345969077/b635/: no space left on device
github.com/apache/beam/sdks/v2/go/examples/yatzy: mkdir /tmp/go-build2345969077/b636/: no space left on device
# github.com/apache/beam/sdks/v2/go/examples/timer_wordcap
/home/jenkins/sdk/go1.20.6/pkg/tool/linux_amd64/link: mapping output file failed: no space left on device
# github.com/apache/beam/sdks/v2/go/examples/fhirio/read_write_pubsub
/home/jenkins/sdk/go1.20.6/pkg/tool/linux_amd64/link: mapping output file failed: no space left on device
# github.com/apache/beam/sdks/v2/go/examples/windowed_wordcount
compile: writing output: write $WORK/b618/_pkg_.a: no space left on device
# github.com/apache/beam/sdks/v2/go/examples/debugging_wordcount
/home/jenkins/sdk/go1.20.6/pkg/tool/linux_amd64/link: mapping output file failed: no space left on device
# github.com/apache/beam/sdks/v2/go/examples/wasm
compile: writing output: write $WORK/b587/_pkg_.a: no space left on device
# github.com/apache/beam/sdks/v2/go/examples/xlang/bigquery
/home/jenkins/sdk/go1.20.6/pkg/tool/linux_amd64/link: mapping output file failed: no space left on device
# github.com/apache/beam/sdks/v2/go/examples/wordcount
compile: writing output: write $WORK/b620/_pkg_.a: no space left on device
# github.com/apache/beam/sdks/v2/go/examples/xlang/cogroup_by
/home/jenkins/sdk/go1.20.6/pkg/tool/linux_amd64/link: mapping output file failed: no space left on device
# github.com/apache/beam/sdks/v2/go/examples/xlang/combine
/home/jenkins/sdk/go1.20.6/pkg/tool/linux_amd64/link: mapping output file failed: no space left on device
# github.com/apache/beam/sdks/v2/go/examples/xlang/group_by
/home/jenkins/sdk/go1.20.6/pkg/tool/linux_amd64/link: mapping output file failed: no space left on device
# github.com/apache/beam/sdks/v2/go/examples/xlang/flatten
/home/jenkins/sdk/go1.20.6/pkg/tool/linux_amd64/link: mapping output file failed: no space left on device
# github.com/apache/beam/sdks/v2/go/examples/xlang/partition
/home/jenkins/sdk/go1.20.6/pkg/tool/linux_amd64/link: mapping output file failed: no space left on device
# github.com/apache/beam/sdks/v2/go/examples/large_wordcount
compile: writing output: write $WORK/b574/_pkg_.a: no space left on device
> Task :sdks:go:examples:goBuild FAILED
> Task :sdks:go:goBuild
# github.com/apache/beam/sdks/v2/go/examples/multiout
/home/jenkins/sdk/go1.20.6/pkg/tool/linux_amd64/link: mapping output file failed: no space left on device
# github.com/apache/beam/sdks/v2/go/examples/minimal_wordcount
/home/jenkins/sdk/go1.20.6/pkg/tool/linux_amd64/link: mapping output file failed: no space left on device
# github.com/apache/beam/sdks/v2/go/examples/slowly_updating_side_input
/home/jenkins/sdk/go1.20.6/pkg/tool/linux_amd64/link: mapping output file failed: no space left on device
# github.com/apache/beam/sdks/v2/go/examples/streaming_wordcap
/home/jenkins/sdk/go1.20.6/pkg/tool/linux_amd64/link: mapping output file failed: no space left on device
# github.com/apache/beam/sdks/v2/go/examples/fhirio/import
/home/jenkins/sdk/go1.20.6/pkg/tool/linux_amd64/link: mapping output file failed: no space left on device
# github.com/apache/beam/sdks/v2/go/examples/native_wordcap
/home/jenkins/sdk/go1.20.6/pkg/tool/linux_amd64/link: mapping output file failed: no space left on device
# github.com/apache/beam/sdks/v2/go/examples/debugging_wordcount
compile: writing output: write $WORK/b597/_pkg_.a: no space left on device
# github.com/apache/beam/sdks/v2/go/examples/cookbook/combine
/home/jenkins/sdk/go1.20.6/pkg/tool/linux_amd64/link: mapping output file failed: no space left on device
# github.com/apache/beam/sdks/v2/go/examples/pingpong
/home/jenkins/sdk/go1.20.6/pkg/tool/linux_amd64/link: mapping output file failed: no space left on device
# github.com/apache/beam/sdks/v2/go/examples/fhirio/read_write_pubsub
/home/jenkins/sdk/go1.20.6/pkg/tool/linux_amd64/link: mapping output file failed: no space left on device
# github.com/apache/beam/sdks/v2/go/examples/timer_wordcap
/home/jenkins/sdk/go1.20.6/pkg/tool/linux_amd64/link: mapping output file failed: no space left on device
# github.com/apache/beam/sdks/v2/go/examples/xlang/bigquery
/home/jenkins/sdk/go1.20.6/pkg/tool/linux_amd64/link: mapping output file failed: no space left on device
# github.com/apache/beam/sdks/v2/go/examples/xlang/cogroup_by
/home/jenkins/sdk/go1.20.6/pkg/tool/linux_amd64/link: mapping output file failed: no space left on device
# github.com/apache/beam/sdks/v2/go/examples/readavro
/home/jenkins/sdk/go1.20.6/pkg/tool/linux_amd64/link: mapping output file failed: no space left on device
# github.com/apache/beam/sdks/v2/go/examples/windowed_wordcount
compile: writing output: write $WORK/b663/_pkg_.a: no space left on device
# github.com/apache/beam/sdks/v2/go/examples/wasm
compile: writing output: write $WORK/b632/_pkg_.a: no space left on device
# github.com/apache/beam/sdks/v2/go/examples/xlang/flatten
/home/jenkins/sdk/go1.20.6/pkg/tool/linux_amd64/link: mapping output file failed: no space left on device
# github.com/apache/beam/sdks/v2/go/examples/xlang/combine
/home/jenkins/sdk/go1.20.6/pkg/tool/linux_amd64/link: mapping output file failed: no space left on device
# github.com/apache/beam/sdks/v2/go/examples/xlang/combine_globally
/home/jenkins/sdk/go1.20.6/pkg/tool/linux_amd64/link: mapping output file failed: no space left on device
# github.com/apache/beam/sdks/v2/go/examples/wordcount
compile: writing output: write $WORK/b665/_pkg_.a: no space left on device
# github.com/apache/beam/sdks/v2/go/examples/stringsplit
compile: writing output: write $WORK/b630/_pkg_.a: no space left on device
# github.com/apache/beam/sdks/v2/go/examples/xlang/group_by
/home/jenkins/sdk/go1.20.6/pkg/tool/linux_amd64/link: mapping output file failed: no space left on device
# github.com/apache/beam/sdks/v2/go/examples/xlang/partition
/home/jenkins/sdk/go1.20.6/pkg/tool/linux_amd64/link: mapping output file failed: no space left on device
# github.com/apache/beam/sdks/v2/go/examples/xlang/wordcount
/home/jenkins/sdk/go1.20.6/pkg/tool/linux_amd64/link: mapping output file failed: no space left on device
# github.com/apache/beam/sdks/v2/go/examples/xlang/multi_input_output
/home/jenkins/sdk/go1.20.6/pkg/tool/linux_amd64/link: mapping output file failed: no space left on device
# github.com/apache/beam/sdks/v2/go/examples/xlang/sql
/home/jenkins/sdk/go1.20.6/pkg/tool/linux_amd64/link: mapping output file failed: no space left on device
# github.com/apache/beam/sdks/v2/go/examples/yatzy
compile: writing output: write $WORK/b681/_pkg_.a: no space left on device
# github.com/apache/beam/sdks/v2/go/test/load/combine
/home/jenkins/sdk/go1.20.6/pkg/tool/linux_amd64/link: mapping output file failed: no space left on device
# github.com/apache/beam/sdks/v2/go/test/load/group_by_key
/home/jenkins/sdk/go1.20.6/pkg/tool/linux_amd64/link: mapping output file failed: no space left on device
# github.com/apache/beam/sdks/v2/go/test/load/cogbk
/home/jenkins/sdk/go1.20.6/pkg/tool/linux_amd64/link: mapping output file failed: no space left on device
# github.com/apache/beam/sdks/v2/go/examples/large_wordcount
compile: writing output: write $WORK/b619/_pkg_.a: no space left on device
> Task :sdks:go:goBuild FAILED
FAILURE: Build completed with 3 failures.
1: Task failed with an exception.
-----------
* What went wrong:
Execution failed for task ':sdks:go:test:goBuild'.
> Process 'command 'sh'' finished with non-zero exit value 1
* Try:
> Run with --stacktrace option to get the stack trace.
> Run with --info or --debug option to get more log output.
==============================================================================
2: Task failed with an exception.
-----------
* What went wrong:
Execution failed for task ':sdks:go:examples:goBuild'.
> Process 'command 'sh'' finished with non-zero exit value 1
* Try:
> Run with --stacktrace option to get the stack trace.
> Run with --info or --debug option to get more log output.
==============================================================================
3: Task failed with an exception.
-----------
* What went wrong:
Execution failed for task ':sdks:go:goBuild'.
> Process 'command 'sh'' finished with non-zero exit value 1
* Try:
> Run with --stacktrace option to get the stack trace.
> Run with --info or --debug option to get more log output.
==============================================================================
* Get more help at https://help.gradle.org
Deprecated Gradle features were used in this build, making it incompatible with Gradle 8.0.
You can use '--warning-mode all' to show the individual deprecation warnings and determine if they come from your own scripts or plugins.
See https://docs.gradle.org/7.6.2/userguide/command_line_interface.html#sec:command_line_warnings
BUILD FAILED in 1m 32s
16 actionable tasks: 10 executed, 4 from cache, 2 up-to-date
Publishing build scan...
https://ge.apache.org/s/vunl6xgvubwbi
Build step 'Invoke Gradle script' changed build result to FAILURE
Build step 'Invoke Gradle script' marked build as failure
---------------------------------------------------------------------
To unsubscribe, e-mail: builds-unsubscribe@beam.apache.org
For additional commands, e-mail: builds-help@beam.apache.org
Jenkins build is back to normal : beam_PreCommit_Go_Cron #7404
Posted by Apache Jenkins Server <je...@builds.apache.org>.
See <https://ci-beam.apache.org/job/beam_PreCommit_Go_Cron/7404/display/redirect>
---------------------------------------------------------------------
To unsubscribe, e-mail: builds-unsubscribe@beam.apache.org
For additional commands, e-mail: builds-help@beam.apache.org