You are viewing a plain text version of this content. The canonical link for it is here.
Posted to commits@sling.apache.org by Apache Jenkins Server <je...@builds.apache.org> on 2018/09/19 17:25:16 UTC
Build failed in Jenkins: sling-org-apache-sling-commons-testing-1.8
#47
See <https://builds.apache.org/job/sling-org-apache-sling-commons-testing-1.8/47/display/redirect>
------------------------------------------
Started by an SCM change
[EnvInject] - Loading node environment variables.
Building remotely on H27 (ubuntu xenial) in workspace <https://builds.apache.org/job/sling-org-apache-sling-commons-testing-1.8/ws/>
Also: hudson.remoting.Channel$CallSiteStackTrace: Remote call to H27
at hudson.remoting.Channel.attachCallSiteStackTrace(Channel.java:1741)
at hudson.remoting.UserRequest$ExceptionResponse.retrieve(UserRequest.java:357)
at hudson.remoting.Channel.call(Channel.java:955)
at hudson.FilePath.act(FilePath.java:1036)
at hudson.FilePath.act(FilePath.java:1025)
at hudson.FilePath.mkdirs(FilePath.java:1213)
at hudson.model.AbstractProject.checkout(AbstractProject.java:1202)
at hudson.model.AbstractBuild$AbstractBuildExecution.defaultCheckout(AbstractBuild.java:574)
at jenkins.scm.SCMCheckoutStrategy.checkout(SCMCheckoutStrategy.java:86)
at hudson.model.AbstractBuild$AbstractBuildExecution.run(AbstractBuild.java:499)
at hudson.model.Run.execute(Run.java:1794)
at hudson.maven.MavenModuleSetBuild.run(MavenModuleSetBuild.java:543)
at hudson.model.ResourceController.execute(ResourceController.java:97)
at hudson.model.Executor.run(Executor.java:429)
java.nio.file.FileSystemException: <https://builds.apache.org/job/sling-org-apache-sling-commons-testing-1.8/ws/>: No space left on device
at sun.nio.fs.UnixException.translateToIOException(UnixException.java:91)
at sun.nio.fs.UnixException.rethrowAsIOException(UnixException.java:102)
at sun.nio.fs.UnixException.rethrowAsIOException(UnixException.java:107)
at sun.nio.fs.UnixFileSystemProvider.createDirectory(UnixFileSystemProvider.java:384)
at java.nio.file.Files.createDirectory(Files.java:674)
at java.nio.file.Files.createAndCheckIsDirectory(Files.java:781)
at java.nio.file.Files.createDirectories(Files.java:767)
at hudson.FilePath.mkdirs(FilePath.java:3103)
at hudson.FilePath.access$900(FilePath.java:209)
at hudson.FilePath$Mkdirs.invoke(FilePath.java:1221)
at hudson.FilePath$Mkdirs.invoke(FilePath.java:1217)
at hudson.FilePath$FileCallableWrapper.call(FilePath.java:2918)
at hudson.remoting.UserRequest.perform(UserRequest.java:212)
at hudson.remoting.UserRequest.perform(UserRequest.java:54)
at hudson.remoting.Request$2.run(Request.java:369)
at hudson.remoting.InterceptingExecutorService$1.call(InterceptingExecutorService.java:72)
at java.util.concurrent.FutureTask.run(FutureTask.java:266)
at java.util.concurrent.ThreadPoolExecutor.runWorker(ThreadPoolExecutor.java:1142)
at java.util.concurrent.ThreadPoolExecutor$Worker.run(ThreadPoolExecutor.java:617)
at java.lang.Thread.run(Thread.java:748)
Caused: java.io.IOException: remote file operation failed: <https://builds.apache.org/job/sling-org-apache-sling-commons-testing-1.8/ws/> at hudson.remoting.Channel@f03fce5:H27
at hudson.FilePath.act(FilePath.java:1043)
at hudson.FilePath.act(FilePath.java:1025)
at hudson.FilePath.mkdirs(FilePath.java:1213)
at hudson.model.AbstractProject.checkout(AbstractProject.java:1202)
at hudson.model.AbstractBuild$AbstractBuildExecution.defaultCheckout(AbstractBuild.java:574)
at jenkins.scm.SCMCheckoutStrategy.checkout(SCMCheckoutStrategy.java:86)
at hudson.model.AbstractBuild$AbstractBuildExecution.run(AbstractBuild.java:499)
at hudson.model.Run.execute(Run.java:1794)
at hudson.maven.MavenModuleSetBuild.run(MavenModuleSetBuild.java:543)
at hudson.model.ResourceController.execute(ResourceController.java:97)
at hudson.model.Executor.run(Executor.java:429)
Retrying after 10 seconds
Also: hudson.remoting.Channel$CallSiteStackTrace: Remote call to H27
at hudson.remoting.Channel.attachCallSiteStackTrace(Channel.java:1741)
at hudson.remoting.UserRequest$ExceptionResponse.retrieve(UserRequest.java:357)
at hudson.remoting.Channel.call(Channel.java:955)
at hudson.FilePath.act(FilePath.java:1036)
at hudson.FilePath.act(FilePath.java:1025)
at hudson.FilePath.mkdirs(FilePath.java:1213)
at hudson.model.AbstractProject.checkout(AbstractProject.java:1202)
at hudson.model.AbstractBuild$AbstractBuildExecution.defaultCheckout(AbstractBuild.java:574)
at jenkins.scm.SCMCheckoutStrategy.checkout(SCMCheckoutStrategy.java:86)
at hudson.model.AbstractBuild$AbstractBuildExecution.run(AbstractBuild.java:499)
at hudson.model.Run.execute(Run.java:1794)
at hudson.maven.MavenModuleSetBuild.run(MavenModuleSetBuild.java:543)
at hudson.model.ResourceController.execute(ResourceController.java:97)
at hudson.model.Executor.run(Executor.java:429)
java.nio.file.FileSystemException: <https://builds.apache.org/job/sling-org-apache-sling-commons-testing-1.8/ws/>: No space left on device
at sun.nio.fs.UnixException.translateToIOException(UnixException.java:91)
at sun.nio.fs.UnixException.rethrowAsIOException(UnixException.java:102)
at sun.nio.fs.UnixException.rethrowAsIOException(UnixException.java:107)
at sun.nio.fs.UnixFileSystemProvider.createDirectory(UnixFileSystemProvider.java:384)
at java.nio.file.Files.createDirectory(Files.java:674)
at java.nio.file.Files.createAndCheckIsDirectory(Files.java:781)
at java.nio.file.Files.createDirectories(Files.java:767)
at hudson.FilePath.mkdirs(FilePath.java:3103)
at hudson.FilePath.access$900(FilePath.java:209)
at hudson.FilePath$Mkdirs.invoke(FilePath.java:1221)
at hudson.FilePath$Mkdirs.invoke(FilePath.java:1217)
at hudson.FilePath$FileCallableWrapper.call(FilePath.java:2918)
at hudson.remoting.UserRequest.perform(UserRequest.java:212)
at hudson.remoting.UserRequest.perform(UserRequest.java:54)
at hudson.remoting.Request$2.run(Request.java:369)
at hudson.remoting.InterceptingExecutorService$1.call(InterceptingExecutorService.java:72)
at java.util.concurrent.FutureTask.run(FutureTask.java:266)
at java.util.concurrent.ThreadPoolExecutor.runWorker(ThreadPoolExecutor.java:1142)
at java.util.concurrent.ThreadPoolExecutor$Worker.run(ThreadPoolExecutor.java:617)
at java.lang.Thread.run(Thread.java:748)
Caused: java.io.IOException: remote file operation failed: <https://builds.apache.org/job/sling-org-apache-sling-commons-testing-1.8/ws/> at hudson.remoting.Channel@f03fce5:H27
at hudson.FilePath.act(FilePath.java:1043)
at hudson.FilePath.act(FilePath.java:1025)
at hudson.FilePath.mkdirs(FilePath.java:1213)
at hudson.model.AbstractProject.checkout(AbstractProject.java:1202)
at hudson.model.AbstractBuild$AbstractBuildExecution.defaultCheckout(AbstractBuild.java:574)
at jenkins.scm.SCMCheckoutStrategy.checkout(SCMCheckoutStrategy.java:86)
at hudson.model.AbstractBuild$AbstractBuildExecution.run(AbstractBuild.java:499)
at hudson.model.Run.execute(Run.java:1794)
at hudson.maven.MavenModuleSetBuild.run(MavenModuleSetBuild.java:543)
at hudson.model.ResourceController.execute(ResourceController.java:97)
at hudson.model.Executor.run(Executor.java:429)
Retrying after 10 seconds
Also: hudson.remoting.Channel$CallSiteStackTrace: Remote call to H27
at hudson.remoting.Channel.attachCallSiteStackTrace(Channel.java:1741)
at hudson.remoting.UserRequest$ExceptionResponse.retrieve(UserRequest.java:357)
at hudson.remoting.Channel.call(Channel.java:955)
at hudson.FilePath.act(FilePath.java:1036)
at hudson.FilePath.act(FilePath.java:1025)
at hudson.FilePath.mkdirs(FilePath.java:1213)
at hudson.model.AbstractProject.checkout(AbstractProject.java:1202)
at hudson.model.AbstractBuild$AbstractBuildExecution.defaultCheckout(AbstractBuild.java:574)
at jenkins.scm.SCMCheckoutStrategy.checkout(SCMCheckoutStrategy.java:86)
at hudson.model.AbstractBuild$AbstractBuildExecution.run(AbstractBuild.java:499)
at hudson.model.Run.execute(Run.java:1794)
at hudson.maven.MavenModuleSetBuild.run(MavenModuleSetBuild.java:543)
at hudson.model.ResourceController.execute(ResourceController.java:97)
at hudson.model.Executor.run(Executor.java:429)
java.nio.file.FileSystemException: <https://builds.apache.org/job/sling-org-apache-sling-commons-testing-1.8/ws/>: No space left on device
at sun.nio.fs.UnixException.translateToIOException(UnixException.java:91)
at sun.nio.fs.UnixException.rethrowAsIOException(UnixException.java:102)
at sun.nio.fs.UnixException.rethrowAsIOException(UnixException.java:107)
at sun.nio.fs.UnixFileSystemProvider.createDirectory(UnixFileSystemProvider.java:384)
at java.nio.file.Files.createDirectory(Files.java:674)
at java.nio.file.Files.createAndCheckIsDirectory(Files.java:781)
at java.nio.file.Files.createDirectories(Files.java:767)
at hudson.FilePath.mkdirs(FilePath.java:3103)
at hudson.FilePath.access$900(FilePath.java:209)
at hudson.FilePath$Mkdirs.invoke(FilePath.java:1221)
at hudson.FilePath$Mkdirs.invoke(FilePath.java:1217)
at hudson.FilePath$FileCallableWrapper.call(FilePath.java:2918)
at hudson.remoting.UserRequest.perform(UserRequest.java:212)
at hudson.remoting.UserRequest.perform(UserRequest.java:54)
at hudson.remoting.Request$2.run(Request.java:369)
at hudson.remoting.InterceptingExecutorService$1.call(InterceptingExecutorService.java:72)
at java.util.concurrent.FutureTask.run(FutureTask.java:266)
at java.util.concurrent.ThreadPoolExecutor.runWorker(ThreadPoolExecutor.java:1142)
at java.util.concurrent.ThreadPoolExecutor$Worker.run(ThreadPoolExecutor.java:617)
at java.lang.Thread.run(Thread.java:748)
Caused: java.io.IOException: remote file operation failed: <https://builds.apache.org/job/sling-org-apache-sling-commons-testing-1.8/ws/> at hudson.remoting.Channel@f03fce5:H27
at hudson.FilePath.act(FilePath.java:1043)
at hudson.FilePath.act(FilePath.java:1025)
at hudson.FilePath.mkdirs(FilePath.java:1213)
at hudson.model.AbstractProject.checkout(AbstractProject.java:1202)
at hudson.model.AbstractBuild$AbstractBuildExecution.defaultCheckout(AbstractBuild.java:574)
at jenkins.scm.SCMCheckoutStrategy.checkout(SCMCheckoutStrategy.java:86)
at hudson.model.AbstractBuild$AbstractBuildExecution.run(AbstractBuild.java:499)
at hudson.model.Run.execute(Run.java:1794)
at hudson.maven.MavenModuleSetBuild.run(MavenModuleSetBuild.java:543)
at hudson.model.ResourceController.execute(ResourceController.java:97)
at hudson.model.Executor.run(Executor.java:429)
Recording test results
ERROR: Build step failed with exception
Also: hudson.remoting.Channel$CallSiteStackTrace: Remote call to H27
at hudson.remoting.Channel.attachCallSiteStackTrace(Channel.java:1741)
at hudson.remoting.UserRequest$ExceptionResponse.retrieve(UserRequest.java:357)
at hudson.remoting.Channel.call(Channel.java:955)
at hudson.FilePath.act(FilePath.java:1036)
at hudson.FilePath.act(FilePath.java:1025)
at hudson.tasks.junit.JUnitParser.parseResult(JUnitParser.java:114)
at hudson.tasks.junit.JUnitResultArchiver.parse(JUnitResultArchiver.java:136)
at hudson.tasks.junit.JUnitResultArchiver.parseAndAttach(JUnitResultArchiver.java:166)
at hudson.tasks.junit.JUnitResultArchiver.perform(JUnitResultArchiver.java:153)
at hudson.tasks.BuildStepCompatibilityLayer.perform(BuildStepCompatibilityLayer.java:81)
at hudson.tasks.BuildStepMonitor$1.perform(BuildStepMonitor.java:20)
at hudson.model.AbstractBuild$AbstractBuildExecution.perform(AbstractBuild.java:744)
at hudson.model.AbstractBuild$AbstractBuildExecution.performAllBuildSteps(AbstractBuild.java:690)
at hudson.maven.MavenModuleSetBuild$MavenModuleSetBuildExecution.post2(MavenModuleSetBuild.java:1073)
at hudson.model.AbstractBuild$AbstractBuildExecution.post(AbstractBuild.java:635)
at hudson.model.Run.execute(Run.java:1819)
at hudson.maven.MavenModuleSetBuild.run(MavenModuleSetBuild.java:543)
at hudson.model.ResourceController.execute(ResourceController.java:97)
at hudson.model.Executor.run(Executor.java:429)
<https://builds.apache.org/job/sling-org-apache-sling-commons-testing-1.8/ws/> does not exist.
at org.apache.tools.ant.types.AbstractFileSet.getDirectoryScanner(AbstractFileSet.java:484)
at org.apache.tools.ant.types.AbstractFileSet.getDirectoryScanner(AbstractFileSet.java:461)
at hudson.tasks.junit.JUnitParser$ParseResultCallable.invoke(JUnitParser.java:141)
at hudson.tasks.junit.JUnitParser$ParseResultCallable.invoke(JUnitParser.java:118)
at hudson.FilePath$FileCallableWrapper.call(FilePath.java:2918)
at hudson.remoting.UserRequest.perform(UserRequest.java:212)
at hudson.remoting.UserRequest.perform(UserRequest.java:54)
at hudson.remoting.Request$2.run(Request.java:369)
at hudson.remoting.InterceptingExecutorService$1.call(InterceptingExecutorService.java:72)
at java.util.concurrent.FutureTask.run(FutureTask.java:266)
at java.util.concurrent.ThreadPoolExecutor.runWorker(ThreadPoolExecutor.java:1142)
at java.util.concurrent.ThreadPoolExecutor$Worker.run(ThreadPoolExecutor.java:617)
at java.lang.Thread.run(Thread.java:748)
Build step 'Publish JUnit test result report' marked build as failure
Not sending mail to unregistered user cotescu@adobe.com
Jenkins build is back to normal :
sling-org-apache-sling-commons-testing-1.8 #50
Posted by Apache Jenkins Server <je...@builds.apache.org>.
See <https://builds.apache.org/job/sling-org-apache-sling-commons-testing-1.8/50/display/redirect?page=changes>
Build failed in Jenkins: sling-org-apache-sling-commons-testing-1.8
#49
Posted by Apache Jenkins Server <je...@builds.apache.org>.
See <https://builds.apache.org/job/sling-org-apache-sling-commons-testing-1.8/49/display/redirect>
------------------------------------------
Started by an SCM change
[EnvInject] - Loading node environment variables.
Building remotely on H27 (ubuntu xenial) in workspace <https://builds.apache.org/job/sling-org-apache-sling-commons-testing-1.8/ws/>
Also: hudson.remoting.Channel$CallSiteStackTrace: Remote call to H27
at hudson.remoting.Channel.attachCallSiteStackTrace(Channel.java:1741)
at hudson.remoting.UserRequest$ExceptionResponse.retrieve(UserRequest.java:357)
at hudson.remoting.Channel.call(Channel.java:955)
at hudson.FilePath.act(FilePath.java:1036)
at hudson.FilePath.act(FilePath.java:1025)
at hudson.FilePath.mkdirs(FilePath.java:1213)
at hudson.model.AbstractProject.checkout(AbstractProject.java:1202)
at hudson.model.AbstractBuild$AbstractBuildExecution.defaultCheckout(AbstractBuild.java:574)
at jenkins.scm.SCMCheckoutStrategy.checkout(SCMCheckoutStrategy.java:86)
at hudson.model.AbstractBuild$AbstractBuildExecution.run(AbstractBuild.java:499)
at hudson.model.Run.execute(Run.java:1794)
at hudson.maven.MavenModuleSetBuild.run(MavenModuleSetBuild.java:543)
at hudson.model.ResourceController.execute(ResourceController.java:97)
at hudson.model.Executor.run(Executor.java:429)
java.nio.file.FileSystemException: <https://builds.apache.org/job/sling-org-apache-sling-commons-testing-1.8/ws/>: No space left on device
at sun.nio.fs.UnixException.translateToIOException(UnixException.java:91)
at sun.nio.fs.UnixException.rethrowAsIOException(UnixException.java:102)
at sun.nio.fs.UnixException.rethrowAsIOException(UnixException.java:107)
at sun.nio.fs.UnixFileSystemProvider.createDirectory(UnixFileSystemProvider.java:384)
at java.nio.file.Files.createDirectory(Files.java:674)
at java.nio.file.Files.createAndCheckIsDirectory(Files.java:781)
at java.nio.file.Files.createDirectories(Files.java:767)
at hudson.FilePath.mkdirs(FilePath.java:3103)
at hudson.FilePath.access$900(FilePath.java:209)
at hudson.FilePath$Mkdirs.invoke(FilePath.java:1221)
at hudson.FilePath$Mkdirs.invoke(FilePath.java:1217)
at hudson.FilePath$FileCallableWrapper.call(FilePath.java:2918)
at hudson.remoting.UserRequest.perform(UserRequest.java:212)
at hudson.remoting.UserRequest.perform(UserRequest.java:54)
at hudson.remoting.Request$2.run(Request.java:369)
at hudson.remoting.InterceptingExecutorService$1.call(InterceptingExecutorService.java:72)
at java.util.concurrent.FutureTask.run(FutureTask.java:266)
at java.util.concurrent.ThreadPoolExecutor.runWorker(ThreadPoolExecutor.java:1142)
at java.util.concurrent.ThreadPoolExecutor$Worker.run(ThreadPoolExecutor.java:617)
at java.lang.Thread.run(Thread.java:748)
Caused: java.io.IOException: remote file operation failed: <https://builds.apache.org/job/sling-org-apache-sling-commons-testing-1.8/ws/> at hudson.remoting.Channel@f03fce5:H27
at hudson.FilePath.act(FilePath.java:1043)
at hudson.FilePath.act(FilePath.java:1025)
at hudson.FilePath.mkdirs(FilePath.java:1213)
at hudson.model.AbstractProject.checkout(AbstractProject.java:1202)
at hudson.model.AbstractBuild$AbstractBuildExecution.defaultCheckout(AbstractBuild.java:574)
at jenkins.scm.SCMCheckoutStrategy.checkout(SCMCheckoutStrategy.java:86)
at hudson.model.AbstractBuild$AbstractBuildExecution.run(AbstractBuild.java:499)
at hudson.model.Run.execute(Run.java:1794)
at hudson.maven.MavenModuleSetBuild.run(MavenModuleSetBuild.java:543)
at hudson.model.ResourceController.execute(ResourceController.java:97)
at hudson.model.Executor.run(Executor.java:429)
Retrying after 10 seconds
Also: hudson.remoting.Channel$CallSiteStackTrace: Remote call to H27
at hudson.remoting.Channel.attachCallSiteStackTrace(Channel.java:1741)
at hudson.remoting.UserRequest$ExceptionResponse.retrieve(UserRequest.java:357)
at hudson.remoting.Channel.call(Channel.java:955)
at hudson.FilePath.act(FilePath.java:1036)
at hudson.FilePath.act(FilePath.java:1025)
at hudson.FilePath.mkdirs(FilePath.java:1213)
at hudson.model.AbstractProject.checkout(AbstractProject.java:1202)
at hudson.model.AbstractBuild$AbstractBuildExecution.defaultCheckout(AbstractBuild.java:574)
at jenkins.scm.SCMCheckoutStrategy.checkout(SCMCheckoutStrategy.java:86)
at hudson.model.AbstractBuild$AbstractBuildExecution.run(AbstractBuild.java:499)
at hudson.model.Run.execute(Run.java:1794)
at hudson.maven.MavenModuleSetBuild.run(MavenModuleSetBuild.java:543)
at hudson.model.ResourceController.execute(ResourceController.java:97)
at hudson.model.Executor.run(Executor.java:429)
java.nio.file.FileSystemException: <https://builds.apache.org/job/sling-org-apache-sling-commons-testing-1.8/ws/>: No space left on device
at sun.nio.fs.UnixException.translateToIOException(UnixException.java:91)
at sun.nio.fs.UnixException.rethrowAsIOException(UnixException.java:102)
at sun.nio.fs.UnixException.rethrowAsIOException(UnixException.java:107)
at sun.nio.fs.UnixFileSystemProvider.createDirectory(UnixFileSystemProvider.java:384)
at java.nio.file.Files.createDirectory(Files.java:674)
at java.nio.file.Files.createAndCheckIsDirectory(Files.java:781)
at java.nio.file.Files.createDirectories(Files.java:767)
at hudson.FilePath.mkdirs(FilePath.java:3103)
at hudson.FilePath.access$900(FilePath.java:209)
at hudson.FilePath$Mkdirs.invoke(FilePath.java:1221)
at hudson.FilePath$Mkdirs.invoke(FilePath.java:1217)
at hudson.FilePath$FileCallableWrapper.call(FilePath.java:2918)
at hudson.remoting.UserRequest.perform(UserRequest.java:212)
at hudson.remoting.UserRequest.perform(UserRequest.java:54)
at hudson.remoting.Request$2.run(Request.java:369)
at hudson.remoting.InterceptingExecutorService$1.call(InterceptingExecutorService.java:72)
at java.util.concurrent.FutureTask.run(FutureTask.java:266)
at java.util.concurrent.ThreadPoolExecutor.runWorker(ThreadPoolExecutor.java:1142)
at java.util.concurrent.ThreadPoolExecutor$Worker.run(ThreadPoolExecutor.java:617)
at java.lang.Thread.run(Thread.java:748)
Caused: java.io.IOException: remote file operation failed: <https://builds.apache.org/job/sling-org-apache-sling-commons-testing-1.8/ws/> at hudson.remoting.Channel@f03fce5:H27
at hudson.FilePath.act(FilePath.java:1043)
at hudson.FilePath.act(FilePath.java:1025)
at hudson.FilePath.mkdirs(FilePath.java:1213)
at hudson.model.AbstractProject.checkout(AbstractProject.java:1202)
at hudson.model.AbstractBuild$AbstractBuildExecution.defaultCheckout(AbstractBuild.java:574)
at jenkins.scm.SCMCheckoutStrategy.checkout(SCMCheckoutStrategy.java:86)
at hudson.model.AbstractBuild$AbstractBuildExecution.run(AbstractBuild.java:499)
at hudson.model.Run.execute(Run.java:1794)
at hudson.maven.MavenModuleSetBuild.run(MavenModuleSetBuild.java:543)
at hudson.model.ResourceController.execute(ResourceController.java:97)
at hudson.model.Executor.run(Executor.java:429)
Retrying after 10 seconds
Also: hudson.remoting.Channel$CallSiteStackTrace: Remote call to H27
at hudson.remoting.Channel.attachCallSiteStackTrace(Channel.java:1741)
at hudson.remoting.UserRequest$ExceptionResponse.retrieve(UserRequest.java:357)
at hudson.remoting.Channel.call(Channel.java:955)
at hudson.FilePath.act(FilePath.java:1036)
at hudson.FilePath.act(FilePath.java:1025)
at hudson.FilePath.mkdirs(FilePath.java:1213)
at hudson.model.AbstractProject.checkout(AbstractProject.java:1202)
at hudson.model.AbstractBuild$AbstractBuildExecution.defaultCheckout(AbstractBuild.java:574)
at jenkins.scm.SCMCheckoutStrategy.checkout(SCMCheckoutStrategy.java:86)
at hudson.model.AbstractBuild$AbstractBuildExecution.run(AbstractBuild.java:499)
at hudson.model.Run.execute(Run.java:1794)
at hudson.maven.MavenModuleSetBuild.run(MavenModuleSetBuild.java:543)
at hudson.model.ResourceController.execute(ResourceController.java:97)
at hudson.model.Executor.run(Executor.java:429)
java.nio.file.FileSystemException: <https://builds.apache.org/job/sling-org-apache-sling-commons-testing-1.8/ws/>: No space left on device
at sun.nio.fs.UnixException.translateToIOException(UnixException.java:91)
at sun.nio.fs.UnixException.rethrowAsIOException(UnixException.java:102)
at sun.nio.fs.UnixException.rethrowAsIOException(UnixException.java:107)
at sun.nio.fs.UnixFileSystemProvider.createDirectory(UnixFileSystemProvider.java:384)
at java.nio.file.Files.createDirectory(Files.java:674)
at java.nio.file.Files.createAndCheckIsDirectory(Files.java:781)
at java.nio.file.Files.createDirectories(Files.java:767)
at hudson.FilePath.mkdirs(FilePath.java:3103)
at hudson.FilePath.access$900(FilePath.java:209)
at hudson.FilePath$Mkdirs.invoke(FilePath.java:1221)
at hudson.FilePath$Mkdirs.invoke(FilePath.java:1217)
at hudson.FilePath$FileCallableWrapper.call(FilePath.java:2918)
at hudson.remoting.UserRequest.perform(UserRequest.java:212)
at hudson.remoting.UserRequest.perform(UserRequest.java:54)
at hudson.remoting.Request$2.run(Request.java:369)
at hudson.remoting.InterceptingExecutorService$1.call(InterceptingExecutorService.java:72)
at java.util.concurrent.FutureTask.run(FutureTask.java:266)
at java.util.concurrent.ThreadPoolExecutor.runWorker(ThreadPoolExecutor.java:1142)
at java.util.concurrent.ThreadPoolExecutor$Worker.run(ThreadPoolExecutor.java:617)
at java.lang.Thread.run(Thread.java:748)
Caused: java.io.IOException: remote file operation failed: <https://builds.apache.org/job/sling-org-apache-sling-commons-testing-1.8/ws/> at hudson.remoting.Channel@f03fce5:H27
at hudson.FilePath.act(FilePath.java:1043)
at hudson.FilePath.act(FilePath.java:1025)
at hudson.FilePath.mkdirs(FilePath.java:1213)
at hudson.model.AbstractProject.checkout(AbstractProject.java:1202)
at hudson.model.AbstractBuild$AbstractBuildExecution.defaultCheckout(AbstractBuild.java:574)
at jenkins.scm.SCMCheckoutStrategy.checkout(SCMCheckoutStrategy.java:86)
at hudson.model.AbstractBuild$AbstractBuildExecution.run(AbstractBuild.java:499)
at hudson.model.Run.execute(Run.java:1794)
at hudson.maven.MavenModuleSetBuild.run(MavenModuleSetBuild.java:543)
at hudson.model.ResourceController.execute(ResourceController.java:97)
at hudson.model.Executor.run(Executor.java:429)
Recording test results
ERROR: Build step failed with exception
Also: hudson.remoting.Channel$CallSiteStackTrace: Remote call to H27
at hudson.remoting.Channel.attachCallSiteStackTrace(Channel.java:1741)
at hudson.remoting.UserRequest$ExceptionResponse.retrieve(UserRequest.java:357)
at hudson.remoting.Channel.call(Channel.java:955)
at hudson.FilePath.act(FilePath.java:1036)
at hudson.FilePath.act(FilePath.java:1025)
at hudson.tasks.junit.JUnitParser.parseResult(JUnitParser.java:114)
at hudson.tasks.junit.JUnitResultArchiver.parse(JUnitResultArchiver.java:136)
at hudson.tasks.junit.JUnitResultArchiver.parseAndAttach(JUnitResultArchiver.java:166)
at hudson.tasks.junit.JUnitResultArchiver.perform(JUnitResultArchiver.java:153)
at hudson.tasks.BuildStepCompatibilityLayer.perform(BuildStepCompatibilityLayer.java:81)
at hudson.tasks.BuildStepMonitor$1.perform(BuildStepMonitor.java:20)
at hudson.model.AbstractBuild$AbstractBuildExecution.perform(AbstractBuild.java:744)
at hudson.model.AbstractBuild$AbstractBuildExecution.performAllBuildSteps(AbstractBuild.java:690)
at hudson.maven.MavenModuleSetBuild$MavenModuleSetBuildExecution.post2(MavenModuleSetBuild.java:1073)
at hudson.model.AbstractBuild$AbstractBuildExecution.post(AbstractBuild.java:635)
at hudson.model.Run.execute(Run.java:1819)
at hudson.maven.MavenModuleSetBuild.run(MavenModuleSetBuild.java:543)
at hudson.model.ResourceController.execute(ResourceController.java:97)
at hudson.model.Executor.run(Executor.java:429)
<https://builds.apache.org/job/sling-org-apache-sling-commons-testing-1.8/ws/> does not exist.
at org.apache.tools.ant.types.AbstractFileSet.getDirectoryScanner(AbstractFileSet.java:484)
at org.apache.tools.ant.types.AbstractFileSet.getDirectoryScanner(AbstractFileSet.java:461)
at hudson.tasks.junit.JUnitParser$ParseResultCallable.invoke(JUnitParser.java:141)
at hudson.tasks.junit.JUnitParser$ParseResultCallable.invoke(JUnitParser.java:118)
at hudson.FilePath$FileCallableWrapper.call(FilePath.java:2918)
at hudson.remoting.UserRequest.perform(UserRequest.java:212)
at hudson.remoting.UserRequest.perform(UserRequest.java:54)
at hudson.remoting.Request$2.run(Request.java:369)
at hudson.remoting.InterceptingExecutorService$1.call(InterceptingExecutorService.java:72)
at java.util.concurrent.FutureTask.run(FutureTask.java:266)
at java.util.concurrent.ThreadPoolExecutor.runWorker(ThreadPoolExecutor.java:1142)
at java.util.concurrent.ThreadPoolExecutor$Worker.run(ThreadPoolExecutor.java:617)
at java.lang.Thread.run(Thread.java:748)
Build step 'Publish JUnit test result report' marked build as failure
Not sending mail to unregistered user cotescu@adobe.com
Build failed in Jenkins: sling-org-apache-sling-commons-testing-1.8
#48
Posted by Apache Jenkins Server <je...@builds.apache.org>.
See <https://builds.apache.org/job/sling-org-apache-sling-commons-testing-1.8/48/display/redirect?page=changes>
Changes:
[cotescu] SLING-7215 - [nice-to-have] Add a CONTRIBUTING file to every module
------------------------------------------
[...truncated 1.57 KB...]
> git config core.sparsecheckout # timeout=10
> git checkout -f f0d00f6844d9f34ffda8118a653dd7c5a773bc48
Commit message: "SLING-7215 - [nice-to-have] Add a CONTRIBUTING file to every module"
> git rev-list --no-walk 84c99f16e8b06c65b374e1223d15c4a3d7755451 # timeout=10
Parsing POMs
Established TCP socket on 40970
maven33-agent.jar already up to date
maven33-interceptor.jar already up to date
maven3-interceptor-commons.jar already up to date
[sling-org-apache-sling-commons-testing-1.8] $ /home/jenkins/tools/java/latest1.8/bin/java -Xmx4g -Xms4g -cp /home/jenkins/jenkins-slave/maven33-agent.jar:/home/jenkins/tools/maven/apache-maven-3.3.9/boot/plexus-classworlds-2.5.2.jar:/home/jenkins/tools/maven/apache-maven-3.3.9/conf/logging jenkins.maven3.agent.Maven33Main /home/jenkins/tools/maven/apache-maven-3.3.9 /home/jenkins/jenkins-slave/slave.jar /home/jenkins/jenkins-slave/maven33-interceptor.jar /home/jenkins/jenkins-slave/maven3-interceptor-commons.jar 40970
<===[JENKINS REMOTING CAPACITY]===> channel started
Executing Maven: -B -f <https://builds.apache.org/job/sling-org-apache-sling-commons-testing-1.8/ws/pom.xml> -Dmaven.repo.local=/home/jenkins/jenkins-slave/maven-repositories/0 -U clean deploy
[INFO] Scanning for projects...
[INFO]
[INFO] ------------------------------------------------------------------------
[INFO] Building Apache Sling Testing Utilities 2.1.3-SNAPSHOT
[INFO] ------------------------------------------------------------------------
[INFO] Downloading: https://repo.maven.apache.org/maven2/org/apache/jackrabbit/jackrabbit-spi/2.14.2/jackrabbit-spi-2.14.2.jar
[INFO] Downloading: https://repo.maven.apache.org/maven2/org/apache/jackrabbit/jackrabbit-spi-commons/2.14.2/jackrabbit-spi-commons-2.14.2.jar
[INFO] Downloading: https://repo.maven.apache.org/maven2/org/apache/jackrabbit/jackrabbit-jcr-commons/2.14.2/jackrabbit-jcr-commons-2.14.2.jar
[INFO] Downloaded: https://repo.maven.apache.org/maven2/org/apache/jackrabbit/jackrabbit-spi/2.14.2/jackrabbit-spi-2.14.2.jar (28 KB at 63.1 KB/sec)
[INFO] Downloaded: https://repo.maven.apache.org/maven2/org/apache/jackrabbit/jackrabbit-jcr-commons/2.14.2/jackrabbit-jcr-commons-2.14.2.jar (394 KB at 804.0 KB/sec)
[INFO] Downloaded: https://repo.maven.apache.org/maven2/org/apache/jackrabbit/jackrabbit-spi-commons/2.14.2/jackrabbit-spi-commons-2.14.2.jar (782 KB at 1497.4 KB/sec)
[INFO]
[INFO] --- maven-clean-plugin:3.0.0:clean (default-clean) @ org.apache.sling.commons.testing ---
[INFO]
[INFO] --- maven-enforcer-plugin:1.4.1:enforce (enforce-java) @ org.apache.sling.commons.testing ---
[INFO]
[INFO] --- maven-antrun-plugin:1.8:run (set-bundle-required-execution-environment) @ org.apache.sling.commons.testing ---
[INFO] Executing tasks
main:
Setting Bundle-RequiredExecutionEnvironment=JavaSE-1.7 from sling.java.version=7
[INFO] Executed tasks
[INFO]
[INFO] --- maven-remote-resources-plugin:1.5:process (process-resource-bundles) @ org.apache.sling.commons.testing ---
[INFO]
[INFO] --- maven-remote-resources-plugin:1.5:process (default) @ org.apache.sling.commons.testing ---
[INFO]
[INFO] --- maven-resources-plugin:2.7:resources (default-resources) @ org.apache.sling.commons.testing ---
[INFO] Using 'UTF-8' encoding to copy filtered resources.
[INFO] Copying 1 resource
[INFO] Copying 3 resources
[INFO] Copying 3 resources
[INFO]
[INFO] --- maven-compiler-plugin:3.5.1:compile (default-compile) @ org.apache.sling.commons.testing ---
[INFO] Changes detected - recompiling the module!
[INFO] Compiling 36 source files to <https://builds.apache.org/job/sling-org-apache-sling-commons-testing-1.8/ws/target/classes>
[INFO] <https://builds.apache.org/job/sling-org-apache-sling-commons-testing-1.8/ws/src/main/java/org/apache/sling/commons/testing/jcr/MockNode.java>: Some input files use or override a deprecated API.
[INFO] <https://builds.apache.org/job/sling-org-apache-sling-commons-testing-1.8/ws/src/main/java/org/apache/sling/commons/testing/jcr/MockNode.java>: Recompile with -Xlint:deprecation for details.
[INFO] <https://builds.apache.org/job/sling-org-apache-sling-commons-testing-1.8/ws/src/main/java/org/apache/sling/commons/testing/osgi/MockBundle.java>: Some input files use unchecked or unsafe operations.
[INFO] <https://builds.apache.org/job/sling-org-apache-sling-commons-testing-1.8/ws/src/main/java/org/apache/sling/commons/testing/osgi/MockBundle.java>: Recompile with -Xlint:unchecked for details.
[INFO]
[INFO] --- maven-resources-plugin:2.7:testResources (default-testResources) @ org.apache.sling.commons.testing ---
[INFO] Using 'UTF-8' encoding to copy filtered resources.
[INFO] skip non existing resourceDirectory <https://builds.apache.org/job/sling-org-apache-sling-commons-testing-1.8/ws/src/test/resources>
[INFO] Copying 3 resources
[INFO] Copying 3 resources
[INFO]
[INFO] --- maven-compiler-plugin:3.5.1:testCompile (default-testCompile) @ org.apache.sling.commons.testing ---
[INFO] Changes detected - recompiling the module!
[INFO] Compiling 7 source files to <https://builds.apache.org/job/sling-org-apache-sling-commons-testing-1.8/ws/target/test-classes>
[INFO]
[INFO] --- maven-surefire-plugin:2.18.1:test (default-test) @ org.apache.sling.commons.testing ---
[INFO] Surefire report directory: <https://builds.apache.org/job/sling-org-apache-sling-commons-testing-1.8/ws/target/surefire-reports>
-------------------------------------------------------
T E S T S
-------------------------------------------------------
Running org.apache.sling.commons.testing.jcr.RepositoryUtilTest
[main] INFO org.apache.jackrabbit.core.RepositoryImpl - Starting repository...
[main] INFO org.apache.jackrabbit.core.fs.local.LocalFileSystem - LocalFileSystem initialized at path <https://builds.apache.org/job/sling-org-apache-sling-commons-testing-1.8/ws/target/repository/repository>
[main] INFO org.apache.jackrabbit.core.nodetype.NodeTypeRegistry - no custom node type definitions found
[main] INFO org.apache.jackrabbit.core.fs.local.LocalFileSystem - LocalFileSystem initialized at path <https://builds.apache.org/job/sling-org-apache-sling-commons-testing-1.8/ws/target/repository/version>
[main] INFO org.apache.jackrabbit.core.RepositoryImpl - initializing workspace 'default'...
[main] INFO org.apache.jackrabbit.core.fs.local.LocalFileSystem - LocalFileSystem initialized at path <https://builds.apache.org/job/sling-org-apache-sling-commons-testing-1.8/ws/target/repository/workspaces/default>
[main] INFO org.apache.jackrabbit.core.query.lucene.MultiIndex - indexing... /jcr:system/jcr:nodeTypes/rep:Token/jcr:propertyDefinition (100)
[main] INFO org.apache.jackrabbit.core.query.lucene.SearchIndex - Index initialized: <https://builds.apache.org/job/sling-org-apache-sling-commons-testing-1.8/ws/target/repository/repository/index> Version: 3
[main] INFO org.apache.jackrabbit.core.query.lucene.SearchIndex - Index initialized: <https://builds.apache.org/job/sling-org-apache-sling-commons-testing-1.8/ws/target/repository/workspaces/default/index> Version: 3
[main] INFO org.apache.jackrabbit.core.RepositoryImpl - workspace 'default' initialized
[main] INFO org.apache.jackrabbit.core.RepositoryImpl - created system workspace: security
[main] INFO org.apache.jackrabbit.core.RepositoryImpl - SecurityManager = class org.apache.jackrabbit.core.DefaultSecurityManager
[main] INFO org.apache.jackrabbit.core.RepositoryImpl - initializing workspace 'security'...
[main] INFO org.apache.jackrabbit.core.fs.local.LocalFileSystem - LocalFileSystem initialized at path <https://builds.apache.org/job/sling-org-apache-sling-commons-testing-1.8/ws/target/repository/workspaces/security>
[main] INFO org.apache.jackrabbit.core.query.lucene.SearchIndex - Index initialized: <https://builds.apache.org/job/sling-org-apache-sling-commons-testing-1.8/ws/target/repository/workspaces/security/index> Version: 3
[main] INFO org.apache.jackrabbit.core.RepositoryImpl - workspace 'security' initialized
[main] INFO org.apache.jackrabbit.core.DefaultSecurityManager - init: use Repository Login-Configuration for Jackrabbit
[main] INFO org.apache.jackrabbit.core.security.user.UserManagerImpl - Admin user does not exist.
[main] INFO org.apache.jackrabbit.core.security.user.UserManagerImpl - ... created admin user with id 'admin' and default pw.
[main] INFO org.apache.jackrabbit.core.DefaultSecurityManager - ... created anonymous user with id 'anonymous' ...
[main] INFO org.apache.jackrabbit.core.RepositoryImpl - Repository started (29616ms)
[main] INFO org.apache.jackrabbit.core.TransientRepository - Transient repository initialized
[main] INFO org.apache.jackrabbit.core.security.authorization.acl.CachingEntryCollector - Creating cache with max size of: 5000
[main] INFO org.apache.jackrabbit.core.security.authorization.acl.CachingEntryCollector - Root is special-cased: true
[main] INFO org.apache.jackrabbit.core.security.authorization.acl.CachingEntryCollector - Cache Update Strategy: T
[main] INFO org.apache.jackrabbit.core.security.authorization.acl.CachingEntryCollector - Caching entries with no ACLs: false
[main] INFO org.apache.jackrabbit.core.TransientRepository - Session opened
[main] INFO org.apache.jackrabbit.core.TransientRepository - Session opened
[main] INFO org.apache.jackrabbit.core.TransientRepository - Session closed
[main] INFO org.apache.jackrabbit.core.TransientRepository - Session opened
[main] INFO org.apache.jackrabbit.core.TransientRepository - Session closed
[main] INFO org.apache.jackrabbit.core.TransientRepository - Session closed
[main] INFO org.apache.jackrabbit.core.RepositoryImpl - Shutting down repository...
[main] INFO org.apache.jackrabbit.core.query.lucene.SearchIndex - Index closed: <https://builds.apache.org/job/sling-org-apache-sling-commons-testing-1.8/ws/target/repository/repository/index>
[main] INFO org.apache.jackrabbit.core.RepositoryImpl - shutting down workspace 'default'...
[main] INFO org.apache.jackrabbit.core.observation.ObservationDispatcher - Notification of EventListeners stopped.
[main] INFO org.apache.jackrabbit.core.query.lucene.SearchIndex - Index closed: <https://builds.apache.org/job/sling-org-apache-sling-commons-testing-1.8/ws/target/repository/workspaces/default/index>
[main] INFO org.apache.jackrabbit.core.util.db.DerbyConnectionHelper - Database '<https://builds.apache.org/job/sling-org-apache-sling-commons-testing-1.8/ws/target/repository/workspaces/default/db'> shutdown.
[main] INFO org.apache.jackrabbit.core.RepositoryImpl - workspace 'default' has been shutdown
[main] INFO org.apache.jackrabbit.core.RepositoryImpl - shutting down workspace 'security'...
[main] INFO org.apache.jackrabbit.core.observation.ObservationDispatcher - Notification of EventListeners stopped.
[main] INFO org.apache.jackrabbit.core.query.lucene.SearchIndex - Index closed: <https://builds.apache.org/job/sling-org-apache-sling-commons-testing-1.8/ws/target/repository/workspaces/security/index>
[main] INFO org.apache.jackrabbit.core.util.db.DerbyConnectionHelper - Database '<https://builds.apache.org/job/sling-org-apache-sling-commons-testing-1.8/ws/target/repository/workspaces/security/db'> shutdown.
[main] INFO org.apache.jackrabbit.core.RepositoryImpl - workspace 'security' has been shutdown
[main] INFO org.apache.jackrabbit.core.util.db.DerbyConnectionHelper - Database '<https://builds.apache.org/job/sling-org-apache-sling-commons-testing-1.8/ws/target/repository/version/db'> shutdown.
[main] INFO org.apache.jackrabbit.core.RepositoryImpl - Repository has been shutdown
[main] INFO org.apache.jackrabbit.core.TransientRepository - Transient repository shut down
Tests run: 1, Failures: 0, Errors: 0, Skipped: 0, Time elapsed: 32.76 sec - in org.apache.sling.commons.testing.jcr.RepositoryUtilTest
Running org.apache.sling.commons.testing.jcr.RepositoryProviderTest
[main] INFO org.apache.jackrabbit.core.RepositoryImpl - Starting repository...
[main] INFO org.apache.jackrabbit.core.fs.local.LocalFileSystem - LocalFileSystem initialized at path <https://builds.apache.org/job/sling-org-apache-sling-commons-testing-1.8/ws/target/repository/repository>
[main] INFO org.apache.jackrabbit.core.nodetype.NodeTypeRegistry - no custom node type definitions found
[main] INFO org.apache.jackrabbit.core.fs.local.LocalFileSystem - LocalFileSystem initialized at path <https://builds.apache.org/job/sling-org-apache-sling-commons-testing-1.8/ws/target/repository/version>
[main] INFO org.apache.jackrabbit.core.RepositoryImpl - initializing workspace 'default'...
[main] INFO org.apache.jackrabbit.core.fs.local.LocalFileSystem - LocalFileSystem initialized at path <https://builds.apache.org/job/sling-org-apache-sling-commons-testing-1.8/ws/target/repository/workspaces/default>
[main] INFO org.apache.jackrabbit.core.query.lucene.SearchIndex - Index initialized: <https://builds.apache.org/job/sling-org-apache-sling-commons-testing-1.8/ws/target/repository/repository/index> Version: 3
[main] INFO org.apache.jackrabbit.core.query.lucene.SearchIndex - Index initialized: <https://builds.apache.org/job/sling-org-apache-sling-commons-testing-1.8/ws/target/repository/workspaces/default/index> Version: 3
[main] INFO org.apache.jackrabbit.core.RepositoryImpl - workspace 'default' initialized
[main] INFO org.apache.jackrabbit.core.RepositoryImpl - SecurityManager = class org.apache.jackrabbit.core.DefaultSecurityManager
[main] INFO org.apache.jackrabbit.core.RepositoryImpl - initializing workspace 'security'...
[main] INFO org.apache.jackrabbit.core.fs.local.LocalFileSystem - LocalFileSystem initialized at path <https://builds.apache.org/job/sling-org-apache-sling-commons-testing-1.8/ws/target/repository/workspaces/security>
[main] INFO org.apache.jackrabbit.core.query.lucene.SearchIndex - Index initialized: <https://builds.apache.org/job/sling-org-apache-sling-commons-testing-1.8/ws/target/repository/workspaces/security/index> Version: 3
[main] INFO org.apache.jackrabbit.core.RepositoryImpl - workspace 'security' initialized
[main] INFO org.apache.jackrabbit.core.DefaultSecurityManager - init: use Repository Login-Configuration for Jackrabbit
[main] INFO org.apache.jackrabbit.core.RepositoryImpl - Repository started (1203ms)
[main] INFO org.apache.jackrabbit.core.TransientRepository - Transient repository initialized
[main] INFO org.apache.jackrabbit.core.security.authorization.acl.CachingEntryCollector - Creating cache with max size of: 5000
[main] INFO org.apache.jackrabbit.core.security.authorization.acl.CachingEntryCollector - Root is special-cased: true
[main] INFO org.apache.jackrabbit.core.security.authorization.acl.CachingEntryCollector - Cache Update Strategy: T
[main] INFO org.apache.jackrabbit.core.security.authorization.acl.CachingEntryCollector - Caching entries with no ACLs: false
[main] INFO org.apache.jackrabbit.core.TransientRepository - Session opened
[main] INFO org.apache.jackrabbit.core.TransientRepository - Session opened
[main] INFO org.apache.jackrabbit.core.TransientRepository - Session closed
Tests run: 2, Failures: 0, Errors: 0, Skipped: 0, Time elapsed: 1.23 sec - in org.apache.sling.commons.testing.jcr.RepositoryProviderTest
Running org.apache.sling.commons.testing.jcr.RepositoryTestBaseTest
[main] INFO org.apache.jackrabbit.core.TransientRepository - Session opened
[main] INFO org.apache.jackrabbit.core.TransientRepository - Session closed
Tests run: 1, Failures: 0, Errors: 0, Skipped: 0, Time elapsed: 0.011 sec - in org.apache.sling.commons.testing.jcr.RepositoryTestBaseTest
Running org.apache.sling.commons.testing.jcr.MockPropertyTest
Tests run: 2, Failures: 0, Errors: 0, Skipped: 0, Time elapsed: 0.001 sec - in org.apache.sling.commons.testing.jcr.MockPropertyTest
Running org.apache.sling.commons.testing.util.JavascriptEngineTest
Tests run: 1, Failures: 0, Errors: 0, Skipped: 0, Time elapsed: 0.137 sec - in org.apache.sling.commons.testing.util.JavascriptEngineTest
Running org.apache.sling.commons.testing.junit.RetryRuleTest
Tests run: 6, Failures: 0, Errors: 0, Skipped: 0, Time elapsed: 2.121 sec - in org.apache.sling.commons.testing.junit.RetryRuleTest
Running org.apache.sling.commons.testing.sling.MockResourceTest
Tests run: 2, Failures: 0, Errors: 0, Skipped: 0, Time elapsed: 0.02 sec - in org.apache.sling.commons.testing.sling.MockResourceTest
[Thread-5] INFO org.apache.jackrabbit.core.TransientRepository - Session closed
[Thread-5] INFO org.apache.jackrabbit.core.RepositoryImpl - Shutting down repository...
[Thread-5] INFO org.apache.jackrabbit.core.query.lucene.SearchIndex - Index closed: <https://builds.apache.org/job/sling-org-apache-sling-commons-testing-1.8/ws/target/repository/repository/index>
[Thread-5] INFO org.apache.jackrabbit.core.RepositoryImpl - shutting down workspace 'default'...
[Thread-5] INFO org.apache.jackrabbit.core.observation.ObservationDispatcher - Notification of EventListeners stopped.
[Thread-5] INFO org.apache.jackrabbit.core.query.lucene.SearchIndex - Index closed: <https://builds.apache.org/job/sling-org-apache-sling-commons-testing-1.8/ws/target/repository/workspaces/default/index>
[Thread-5] INFO org.apache.jackrabbit.core.util.db.DerbyConnectionHelper - Database '<https://builds.apache.org/job/sling-org-apache-sling-commons-testing-1.8/ws/target/repository/workspaces/default/db'> shutdown.
[Thread-5] INFO org.apache.jackrabbit.core.RepositoryImpl - workspace 'default' has been shutdown
[Thread-5] INFO org.apache.jackrabbit.core.RepositoryImpl - shutting down workspace 'security'...
[Thread-5] INFO org.apache.jackrabbit.core.observation.ObservationDispatcher - Notification of EventListeners stopped.
[Thread-5] INFO org.apache.jackrabbit.core.query.lucene.SearchIndex - Index closed: <https://builds.apache.org/job/sling-org-apache-sling-commons-testing-1.8/ws/target/repository/workspaces/security/index>
[Thread-5] INFO org.apache.jackrabbit.core.util.db.DerbyConnectionHelper - Database '<https://builds.apache.org/job/sling-org-apache-sling-commons-testing-1.8/ws/target/repository/workspaces/security/db'> shutdown.
[Thread-5] INFO org.apache.jackrabbit.core.RepositoryImpl - workspace 'security' has been shutdown
[Thread-5] INFO org.apache.jackrabbit.core.util.db.DerbyConnectionHelper - Database '<https://builds.apache.org/job/sling-org-apache-sling-commons-testing-1.8/ws/target/repository/version/db'> shutdown.
[Thread-5] INFO org.apache.jackrabbit.core.RepositoryImpl - Repository has been shutdown
[Thread-5] INFO org.apache.jackrabbit.core.TransientRepository - Transient repository shut down
Results :
Tests run: 15, Failures: 0, Errors: 0, Skipped: 0
[JENKINS] Recording test results
[WARNING] Attempt to (de-)serialize anonymous class hudson.maven.reporters.SurefireArchiver$2; see: https://jenkins.io/redirect/serialization-of-anonymous-classes/
[INFO]
[INFO] --- animal-sniffer-maven-plugin:1.15:check (default) @ org.apache.sling.commons.testing ---
[INFO] Checking unresolved references to org.codehaus.mojo.signature:java17:1.0
[WARNING] Attempt to (de-)serialize anonymous class hudson.maven.reporters.BuildInfoRecorder$1; see: https://jenkins.io/redirect/serialization-of-anonymous-classes/
[INFO]
[INFO] --- maven-jar-plugin:3.0.2:jar (default-jar) @ org.apache.sling.commons.testing ---
[INFO] Building jar: <https://builds.apache.org/job/sling-org-apache-sling-commons-testing-1.8/ws/target/org.apache.sling.commons.testing-2.1.3-SNAPSHOT.jar>
[INFO]
[INFO] >>> maven-source-plugin:3.0.1:jar (attach-sources) > generate-sources @ org.apache.sling.commons.testing >>>
[INFO]
[INFO] --- maven-enforcer-plugin:1.4.1:enforce (enforce-java) @ org.apache.sling.commons.testing ---
[INFO]
[INFO] --- maven-antrun-plugin:1.8:run (set-bundle-required-execution-environment) @ org.apache.sling.commons.testing ---
[INFO] Executing tasks
main:
Setting Bundle-RequiredExecutionEnvironment=JavaSE-1.7 from sling.java.version=7
[INFO] Executed tasks
[WARNING] Failed to getClass for org.apache.maven.plugins.source.SourceJarMojo
[INFO]
[INFO] <<< maven-source-plugin:3.0.1:jar (attach-sources) < generate-sources @ org.apache.sling.commons.testing <<<
[INFO]
[INFO] --- maven-source-plugin:3.0.1:jar (attach-sources) @ org.apache.sling.commons.testing ---
[INFO] Building jar: <https://builds.apache.org/job/sling-org-apache-sling-commons-testing-1.8/ws/target/org.apache.sling.commons.testing-2.1.3-SNAPSHOT-sources.jar>
[INFO]
[INFO] --- maven-site-plugin:3.5.1:attach-descriptor (attach-descriptor) @ org.apache.sling.commons.testing ---
[INFO]
[INFO] --- ianal-maven-plugin:1.0-alpha-1:verify-legal-files (default) @ org.apache.sling.commons.testing ---
[INFO] Checking legal files in: org.apache.sling.commons.testing-2.1.3-SNAPSHOT.jar
[INFO] Checking legal files in: org.apache.sling.commons.testing-2.1.3-SNAPSHOT-sources.jar
[INFO]
[INFO] --- apache-rat-plugin:0.11:check (default) @ org.apache.sling.commons.testing ---
[INFO] 51 implicit excludes (use -debug for more details).
[INFO] Exclude: DEPENDENCIES
[INFO] Exclude: src/main/appended-resources/META-INF/*
[INFO] Exclude: velocity.log
[INFO] Exclude: target/*
[INFO] Exclude: README.md
[INFO] Exclude: maven-eclipse.xml
[INFO] Exclude: .*
[INFO] Exclude: .*/**
[INFO] Exclude: **/*.json
[INFO] Exclude: DEPENDENCIES
[INFO] Exclude: **/*.rej
[INFO] Exclude: hs_err_*.log
[INFO] Exclude: **/repository/index/*/index-details.txt
[INFO] 48 resources included (use -debug for more details)
[INFO] Rat check: Summary of files. Unapproved: 2 unknown: 2 generated: 0 approved: 45 licence.
[WARNING] Attempt to (de-)serialize anonymous class hudson.maven.reporters.MavenArtifactArchiver$2; see: https://jenkins.io/redirect/serialization-of-anonymous-classes/
[JENKINS] Archiving disabled
[WARNING] Attempt to (de-)serialize anonymous class hudson.maven.reporters.MavenFingerprinter$1; see: https://jenkins.io/redirect/serialization-of-anonymous-classes/
[JENKINS] Archiving disabled
[INFO] ------------------------------------------------------------------------
[INFO] BUILD FAILURE
[INFO] ------------------------------------------------------------------------
[INFO] Total time: 02:03 min
[INFO] Finished at: 2018-09-19T17:46:12+00:00
[INFO] Final Memory: 74M/3925M
[INFO] ------------------------------------------------------------------------
Waiting for Jenkins to finish collecting data
[ERROR] Failed to execute goal org.apache.rat:apache-rat-plugin:0.11:check (default) on project org.apache.sling.commons.testing: Too many files with unapproved license: 2 See RAT report in: <https://builds.apache.org/job/sling-org-apache-sling-commons-testing-1.8/ws/target/rat.txt> -> [Help 1]
[ERROR]
[ERROR] To see the full stack trace of the errors, re-run Maven with the -e switch.
[ERROR] Re-run Maven using the -X switch to enable full debug logging.
[ERROR]
[ERROR] For more information about the errors and possible solutions, please read the following articles:
[ERROR] [Help 1] http://cwiki.apache.org/confluence/display/MAVEN/MojoFailureException
channel stopped
Recording test results
Not sending mail to unregistered user cotescu@adobe.com