You are viewing a plain text version of this content. The canonical link for it is here.
Posted to issues@camel.apache.org by "Fabrizio Spataro (JIRA)" <ji...@apache.org> on 2016/11/01 07:38:58 UTC

[jira] [Commented] (CAMEL-10428) Cannot compile master code

    [ https://issues.apache.org/jira/browse/CAMEL-10428?page=com.atlassian.jira.plugin.system.issuetabpanels:comment-tabpanel&focusedCommentId=15624642#comment-15624642 ] 

Fabrizio Spataro commented on CAMEL-10428:
------------------------------------------

There is another compile error:

....................................................
[INFO] Camel :: Olingo2 :: Parent ......................... SUCCESS [  0.117 s]
[INFO] Camel :: Olingo2 :: API ............................ SUCCESS [  4.143 s]
[INFO] Camel :: Olingo2 :: Component ...................... FAILURE [  3.385 s]
[INFO] Camel :: OpenShift (deprecated) .................... SKIPPED
[INFO] Camel :: OptaPlanner ............................... SKIPPED
..............................................................
[INFO] Camel :: Assembly .................................. SKIPPED
[INFO] ------------------------------------------------------------------------
[INFO] BUILD FAILURE
[INFO] ------------------------------------------------------------------------
[INFO] Total time: 03:11 min
[INFO] Finished at: 2016-11-01T08:25:50+01:00
[INFO] Final Memory: 1089M/2929M
[INFO] ------------------------------------------------------------------------
[ERROR] Failed to execute goal org.codehaus.mojo:exec-maven-plugin:1.5.0:exec (generate-sources) on project camel-olingo2: Command execution failed. Process exited with an error: 1 (Exit value: 1) -> [Help 1]
[ERROR]
[ERROR] To see the full stack trace of the errors, re-run Maven with the -e switch.


> Cannot compile master code
> --------------------------
>
>                 Key: CAMEL-10428
>                 URL: https://issues.apache.org/jira/browse/CAMEL-10428
>             Project: Camel
>          Issue Type: Task
>            Reporter: Fabrizio Spataro
>
> mvn clean install -Pfastinstall
> i have this error, i am skipping JMX component to compile master code:
> [INFO] Camel :: Jing ...................................... SUCCESS [  8.585 s]
> [INFO] Camel :: JIRA ...................................... SUCCESS [ 27.211 s]
> [INFO] Camel :: JMX ....................................... FAILURE [  4.836 s]
> [INFO] Camel :: Jolt ...................................... SKIPPED
> [INFO] Camel :: Johnzon ................................... SKIPPED
> ....................................................
> ....................................................
> [INFO] Camel :: Example :: Zipkin :: Service 1 ............ SKIPPED
> [INFO] Camel :: Example :: Zipkin :: Service 2 ............ SKIPPED
> [INFO] Camel :: Assembly .................................. SKIPPED
> [INFO] ------------------------------------------------------------------------
> [INFO] BUILD FAILURE
> [INFO] ------------------------------------------------------------------------
> [INFO] Total time: 29:14 min
> [INFO] Finished at: 2016-11-01T08:10:53+01:00
> [INFO] Final Memory: 1212M/2906M
> [INFO] ------------------------------------------------------------------------
> [ERROR] Failed to execute goal org.jvnet.jaxb2.maven2:maven-jaxb2-plugin:0.8.3:generate (default) on project camel-jmx: Execution default of goal org.jvnet.jaxb2.maven2:maven-jaxb2-plugin:0.8.3:generate failed: Illegal pattern character 'g' -> [Help 1]
> [ERROR]
> [ERROR] To see the full stack trace of the errors, re-run Maven with the -e switch.
> [ERROR] Re-run Maven using the -X switch to enable full debug logging.
> [ERROR]
> [ERROR] For more information about the errors and possible solutions, please read the following articles:
> [ERROR] [Help 1] http://cwiki.apache.org/confluence/display/MAVEN/PluginExecutionException



--
This message was sent by Atlassian JIRA
(v6.3.4#6332)