You are viewing a plain text version of this content. The canonical link for it is here.
Posted to builds@cassandra.apache.org by Apache Jenkins Server <je...@builds.apache.org> on 2023/01/18 23:40:13 UTC

Build complete: Cassandra-4.1 #247 [UNSTABLE] 590d629302a58f399272703b5d8e6bb91444334c

-------------------------------------------------------------------------------
Build Cassandra-4.1 #247 Still Unstable
URL: https://ci-cassandra.apache.org/job/Cassandra-4.1/247/
-------------------------------------------------------------------------------
Changes:
[Stefan Miklosovic] Default role is created with zero timestamp


-------------------------------------------------------------------------------
Failed Tests:
7 tests failed.
FAILED:  dtest-offheap.cdc_test.TestCDC.test_insertion_and_commitlog_behavior_after_reaching_cdc_total_space
FAILED:  dtest-upgrade.upgrade_tests.bootstrap_upgrade_test.TestBootstrapUpgrade.test_simultaneous_bootstrap
FAILED:  org.apache.cassandra.net.ProxyHandlerConnectionsTest.testExpireSome-compression
FAILED:  org.apache.cassandra.net.ConnectionTest.testMessageDeliveryOnReconnect-compression
FAILED:  org.apache.cassandra.net.ConnectionTest.testTimeout-compression
FAILED:  org.apache.cassandra.net.ProxyHandlerConnectionsTest.testExpireSome
FAILED:  org.apache.cassandra.net.ConnectionTest.testMessageDeliveryOnReconnect

-------------------------------------------------------------------------------
For complete test report and logs see https://nightlies.apache.org/cassandra/Cassandra-4.1/247/