You are viewing a plain text version of this content. The canonical link for it is here.
Posted to ci@bigtop.apache.org by Apache Jenkins Server <je...@builds.apache.org> on 2015/01/19 01:01:30 UTC
Build failed in Jenkins: Bigtop-trunk-testartifacts #1592
See <https://builds.apache.org/job/Bigtop-trunk-testartifacts/1592/changes>
Changes:
[jayunit100] BIGTOP-1606. Move the tachyon webapp data under tachyon home
------------------------------------------
[...truncated 565 lines...]
[INFO]
[INFO] --- maven-remote-resources-plugin:1.1:process (default) @ mahout-smoke ---
[INFO]
[INFO] --- maven-resources-plugin:2.4.3:resources (default-resources) @ mahout-smoke ---
[INFO] Using 'UTF-8' encoding to copy filtered resources.
[INFO] skip non existing resourceDirectory <https://builds.apache.org/job/Bigtop-trunk-testartifacts/ws/bigtop-tests/test-artifacts/mahout/src/main/resources>
[INFO] Copying 3 resources
[INFO]
[INFO] --- maven-compiler-plugin:3.1:compile (default-compile) @ mahout-smoke ---
[INFO] Changes detected - recompiling the module!
[INFO] Using Groovy-Eclipse compiler to compile both Java and Groovy files
org.codehaus.groovy.control.messages.SyntaxErrorMessage@d2be35
org.codehaus.groovy.control.messages.SyntaxErrorMessage@1c5912d
org.codehaus.groovy.control.messages.SyntaxErrorMessage@1be38d5
org.codehaus.groovy.control.messages.SyntaxErrorMessage@1852ae5
<https://builds.apache.org/job/Bigtop-trunk-testartifacts/ws/bigtop-tests/test-artifacts/mahout/src/main/groovy/org/apache/bigtop/itest/mahout/smoke/TestMahoutExamples.groovy>: 74 Groovy:unexpected token: f_name @ line 74, column 13.
<https://builds.apache.org/job/Bigtop-trunk-testartifacts/ws/bigtop-tests/test-artifacts/mahout/src/main/groovy/org/apache/bigtop/itest/mahout/smoke/TestMahoutExamples.groovy>: 75 Groovy:unexpected token: sh @ line 75, column 13.
<https://builds.apache.org/job/Bigtop-trunk-testartifacts/ws/bigtop-tests/test-artifacts/mahout/src/main/groovy/org/apache/bigtop/itest/mahout/smoke/TestMahoutExamples.groovy>: 80 Groovy:unexpected token: assertTrue @ line 80, column 13.
<https://builds.apache.org/job/Bigtop-trunk-testartifacts/ws/bigtop-tests/test-artifacts/mahout/src/main/groovy/org/apache/bigtop/itest/mahout/smoke/TestMahoutExamples.groovy>: 83 Groovy:unexpected token: } @ line 83, column 5.
[INFO] -------------------------------------------------------------
[ERROR] COMPILATION ERROR :
[INFO] -------------------------------------------------------------
[ERROR] <https://builds.apache.org/job/Bigtop-trunk-testartifacts/ws/bigtop-tests/test-artifacts/mahout/src/main/groovy/org/apache/bigtop/itest/mahout/smoke/TestMahoutExamples.groovy>:[74,1] 1. ERROR in <https://builds.apache.org/job/Bigtop-trunk-testartifacts/ws/bigtop-tests/test-artifacts/mahout/src/main/groovy/org/apache/bigtop/itest/mahout/smoke/TestMahoutExamples.groovy> (at line 74)
f_name,loc ->
^
Groovy:unexpected token: f_name @ line 74, column 13.
[ERROR] <https://builds.apache.org/job/Bigtop-trunk-testartifacts/ws/bigtop-tests/test-artifacts/mahout/src/main/groovy/org/apache/bigtop/itest/mahout/smoke/TestMahoutExamples.groovy>:[75,1] 2. ERROR in <https://builds.apache.org/job/Bigtop-trunk-testartifacts/ws/bigtop-tests/test-artifacts/mahout/src/main/groovy/org/apache/bigtop/itest/mahout/smoke/TestMahoutExamples.groovy> (at line 75)
sh.exec("if [ ! -f ${download_dir}/${f_name} ]; then " +
^
Groovy:unexpected token: sh @ line 75, column 13.
[ERROR] <https://builds.apache.org/job/Bigtop-trunk-testartifacts/ws/bigtop-tests/test-artifacts/mahout/src/main/groovy/org/apache/bigtop/itest/mahout/smoke/TestMahoutExamples.groovy>:[80,1] 3. ERROR in <https://builds.apache.org/job/Bigtop-trunk-testartifacts/ws/bigtop-tests/test-artifacts/mahout/src/main/groovy/org/apache/bigtop/itest/mahout/smoke/TestMahoutExamples.groovy> (at line 80)
assertTrue("file "+ f_name + " at "+loc + " len=" + file.length() + " is > 5k bytes", file.length() > 5000 );
^
Groovy:unexpected token: assertTrue @ line 80, column 13.
[ERROR] <https://builds.apache.org/job/Bigtop-trunk-testartifacts/ws/bigtop-tests/test-artifacts/mahout/src/main/groovy/org/apache/bigtop/itest/mahout/smoke/TestMahoutExamples.groovy>:[83,1] 4. ERROR in <https://builds.apache.org/job/Bigtop-trunk-testartifacts/ws/bigtop-tests/test-artifacts/mahout/src/main/groovy/org/apache/bigtop/itest/mahout/smoke/TestMahoutExamples.groovy> (at line 83)
}
^
Groovy:unexpected token: } @ line 83, column 5.
[ERROR] Found 4 errors and 0 warnings.
[INFO] 5 errors
[INFO] -------------------------------------------------------------
[INFO] ------------------------------------------------------------------------
[INFO] Reactor Summary:
[INFO]
[INFO] bigtop-smokes ..................................... SUCCESS [3.761s]
[INFO] hadoopsmoke ....................................... SUCCESS [6.340s]
[INFO] packagesmoke ...................................... SUCCESS [5.798s]
[INFO] httpfssmokes ...................................... SUCCESS [3.428s]
[INFO] ooziesmoke ........................................ SUCCESS [2.024s]
[INFO] hbasesmoke ........................................ SUCCESS [4.161s]
[INFO] flumesmoke ........................................ SUCCESS [2.256s]
[INFO] sqoopsmokes ....................................... SUCCESS [2.933s]
[INFO] mahoutsmoke ....................................... FAILURE [0.314s]
[INFO] giraphsmoke ....................................... SKIPPED
[INFO] huesmoke .......................................... SKIPPED
[INFO] solrsmoke ......................................... SKIPPED
[INFO] crunchsmoke ....................................... SKIPPED
[INFO] datafusmoke ....................................... SKIPPED
[INFO] io-longevity ...................................... SKIPPED
[INFO] hcatalogsmoke ..................................... SKIPPED
[INFO] sparksmoke ........................................ SKIPPED
[INFO] phoenixsmoke ...................................... SKIPPED
[INFO] fatjar ............................................ SKIPPED
[INFO] ------------------------------------------------------------------------
[INFO] BUILD FAILURE
[INFO] ------------------------------------------------------------------------
[INFO] Total time: 38.427s
[INFO] Finished at: Mon Jan 19 00:01:21 UTC 2015
[INFO] Final Memory: 32M/364M
[INFO] ------------------------------------------------------------------------
Waiting for Jenkins to finish collecting data
[ERROR] Failed to execute goal org.apache.maven.plugins:maven-compiler-plugin:3.1:compile (default-compile) on project mahout-smoke: Compilation failure: Compilation failure:
[ERROR] <https://builds.apache.org/job/Bigtop-trunk-testartifacts/ws/bigtop-tests/test-artifacts/mahout/src/main/groovy/org/apache/bigtop/itest/mahout/smoke/TestMahoutExamples.groovy>:[74,1] 1. ERROR in <https://builds.apache.org/job/Bigtop-trunk-testartifacts/ws/bigtop-tests/test-artifacts/mahout/src/main/groovy/org/apache/bigtop/itest/mahout/smoke/TestMahoutExamples.groovy> (at line 74)
[ERROR] f_name,loc ->
[ERROR] ^
[ERROR] Groovy:unexpected token: f_name @ line 74, column 13.
[ERROR]
[ERROR] <https://builds.apache.org/job/Bigtop-trunk-testartifacts/ws/bigtop-tests/test-artifacts/mahout/src/main/groovy/org/apache/bigtop/itest/mahout/smoke/TestMahoutExamples.groovy>:[75,1] 2. ERROR in <https://builds.apache.org/job/Bigtop-trunk-testartifacts/ws/bigtop-tests/test-artifacts/mahout/src/main/groovy/org/apache/bigtop/itest/mahout/smoke/TestMahoutExamples.groovy> (at line 75)
[ERROR] sh.exec("if [ ! -f ${download_dir}/${f_name} ]; then " +
[ERROR] ^
[ERROR] Groovy:unexpected token: sh @ line 75, column 13.
[ERROR]
[ERROR] <https://builds.apache.org/job/Bigtop-trunk-testartifacts/ws/bigtop-tests/test-artifacts/mahout/src/main/groovy/org/apache/bigtop/itest/mahout/smoke/TestMahoutExamples.groovy>:[80,1] 3. ERROR in <https://builds.apache.org/job/Bigtop-trunk-testartifacts/ws/bigtop-tests/test-artifacts/mahout/src/main/groovy/org/apache/bigtop/itest/mahout/smoke/TestMahoutExamples.groovy> (at line 80)
[ERROR] assertTrue("file "+ f_name + " at "+loc + " len=" + file.length() + " is > 5k bytes", file.length() > 5000 );
[ERROR] ^
[ERROR] Groovy:unexpected token: assertTrue @ line 80, column 13.
[ERROR]
[ERROR] <https://builds.apache.org/job/Bigtop-trunk-testartifacts/ws/bigtop-tests/test-artifacts/mahout/src/main/groovy/org/apache/bigtop/itest/mahout/smoke/TestMahoutExamples.groovy>:[83,1] 4. ERROR in <https://builds.apache.org/job/Bigtop-trunk-testartifacts/ws/bigtop-tests/test-artifacts/mahout/src/main/groovy/org/apache/bigtop/itest/mahout/smoke/TestMahoutExamples.groovy> (at line 83)
[ERROR] }
[ERROR] ^
[ERROR] Groovy:unexpected token: } @ line 83, column 5.
[ERROR]
[ERROR] Found 4 errors and 0 warnings.
[ERROR] -> [Help 1]
[ERROR]
[ERROR] To see the full stack trace of the errors, re-run Maven with the -e switch.
[ERROR] Re-run Maven using the -X switch to enable full debug logging.
[ERROR]
[ERROR] For more information about the errors and possible solutions, please read the following articles:
[ERROR] [Help 1] http://cwiki.apache.org/confluence/display/MAVEN/MojoFailureException
[ERROR]
[ERROR] After correcting the problems, you can resume the build with the command
[ERROR] mvn <goals> -rf :mahout-smoke
[JENKINS] Archiving <https://builds.apache.org/job/Bigtop-trunk-testartifacts/ws/bigtop-tests/test-artifacts/pom.xml> to org.apache.bigtop.itest/bigtop-smokes/0.9.0-SNAPSHOT/bigtop-smokes-0.9.0-SNAPSHOT.pom
Sending artifact delta relative to Bigtop-trunk-testartifacts » bigtop-smokes #1591
Archived 1 artifacts
Archive block size is 32768
Received 0 blocks and 4894 bytes
Compression is 0.0%
Took 84 ms
[JENKINS] Archiving <https://builds.apache.org/job/Bigtop-trunk-testartifacts/ws/bigtop-tests/test-artifacts/sqoop/pom.xml> to org.apache.bigtop.itest/sqoop-smoke/0.9.0-SNAPSHOT/sqoop-smoke-0.9.0-SNAPSHOT.pom
[JENKINS] Archiving <https://builds.apache.org/job/Bigtop-trunk-testartifacts/ws/bigtop-tests/test-artifacts/sqoop/target/sqoop-smoke-0.9.0-SNAPSHOT.jar> to org.apache.bigtop.itest/sqoop-smoke/0.9.0-20150119.000119-69/sqoop-smoke-0.9.0-20150119.000119-69.jar
Sending artifact delta relative to Bigtop-trunk-testartifacts » sqoopsmokes #1591
Archived 2 artifacts
Archive block size is 32768
Received 0 blocks and 50622 bytes
Compression is 0.0%
Took 0.12 sec
[JENKINS] Archiving <https://builds.apache.org/job/Bigtop-trunk-testartifacts/ws/bigtop-tests/test-artifacts/hue/pom.xml> to org.apache.bigtop.itest/hue-smoke/0.9.0-SNAPSHOT/hue-smoke-0.9.0-SNAPSHOT.pom
Sending artifact delta relative to Bigtop-trunk-testartifacts » huesmoke #1587
Archived 1 artifacts
Archive block size is 32768
Received 0 blocks and 1510 bytes
Compression is 0.0%
Took 0.13 sec
[JENKINS] Archiving <https://builds.apache.org/job/Bigtop-trunk-testartifacts/ws/bigtop-tests/test-artifacts/crunch/pom.xml> to org.apache.bigtop.itest/crunch-smoke/0.9.0-SNAPSHOT/crunch-smoke-0.9.0-SNAPSHOT.pom
Sending artifact delta relative to Bigtop-trunk-testartifacts » crunchsmoke #1587
Archived 1 artifacts
Archive block size is 32768
Received 0 blocks and 1521 bytes
Compression is 0.0%
Took 0.16 sec
[JENKINS] Archiving <https://builds.apache.org/job/Bigtop-trunk-testartifacts/ws/bigtop-tests/test-artifacts/package/pom.xml> to org.apache.bigtop.itest/package-smoke/0.9.0-SNAPSHOT/package-smoke-0.9.0-SNAPSHOT.pom
[JENKINS] Archiving <https://builds.apache.org/job/Bigtop-trunk-testartifacts/ws/bigtop-tests/test-artifacts/package/target/package-smoke-0.9.0-SNAPSHOT.jar> to org.apache.bigtop.itest/package-smoke/0.9.0-20150119.000102-69/package-smoke-0.9.0-20150119.000102-69.jar
Sending artifact delta relative to Bigtop-trunk-testartifacts » packagesmoke #1591
Archived 2 artifacts
Archive block size is 32768
Received 1 blocks and 778253 bytes
Compression is 4.0%
Took 0.37 sec
[JENKINS] Archiving <https://builds.apache.org/job/Bigtop-trunk-testartifacts/ws/bigtop-tests/test-artifacts/flume/pom.xml> to org.apache.bigtop.itest/flume-smoke/0.9.0-SNAPSHOT/flume-smoke-0.9.0-SNAPSHOT.pom
[JENKINS] Archiving <https://builds.apache.org/job/Bigtop-trunk-testartifacts/ws/bigtop-tests/test-artifacts/flume/target/flume-smoke-0.9.0-SNAPSHOT.jar> to org.apache.bigtop.itest/flume-smoke/0.9.0-20150119.000115-69/flume-smoke-0.9.0-20150119.000115-69.jar
Sending artifact delta relative to Bigtop-trunk-testartifacts » flumesmoke #1591
Archived 2 artifacts
Archive block size is 32768
Received 0 blocks and 42421 bytes
Compression is 0.0%
Took 60 ms
[JENKINS] Archiving <https://builds.apache.org/job/Bigtop-trunk-testartifacts/ws/bigtop-tests/test-artifacts/httpfs/pom.xml> to org.apache.bigtop.itest/httpfs-smoke/0.9.0-SNAPSHOT/httpfs-smoke-0.9.0-SNAPSHOT.pom
[JENKINS] Archiving <https://builds.apache.org/job/Bigtop-trunk-testartifacts/ws/bigtop-tests/test-artifacts/httpfs/target/httpfs-smoke-0.9.0-SNAPSHOT.jar> to org.apache.bigtop.itest/httpfs-smoke/0.9.0-20150119.000106-69/httpfs-smoke-0.9.0-20150119.000106-69.jar
Sending artifact delta relative to Bigtop-trunk-testartifacts » httpfssmokes #1591
Archived 2 artifacts
Archive block size is 32768
Received 0 blocks and 17687 bytes
Compression is 0.0%
Took 45 ms
[JENKINS] Archiving <https://builds.apache.org/job/Bigtop-trunk-testartifacts/ws/bigtop-tests/test-artifacts/spark/pom.xml> to org.apache.bigtop.itest/spark-smoke/0.9.0-SNAPSHOT/spark-smoke-0.9.0-SNAPSHOT.pom
Sending artifact delta relative to Bigtop-trunk-testartifacts » sparksmoke #1587
Archived 1 artifacts
Archive block size is 32768
Received 0 blocks and 2266 bytes
Compression is 0.0%
Took 59 ms
[JENKINS] Archiving <https://builds.apache.org/job/Bigtop-trunk-testartifacts/ws/bigtop-tests/test-artifacts/hadoop/pom.xml> to org.apache.bigtop.itest/hadoop-smoke/0.9.0-SNAPSHOT/hadoop-smoke-0.9.0-SNAPSHOT.pom
[JENKINS] Archiving <https://builds.apache.org/job/Bigtop-trunk-testartifacts/ws/bigtop-tests/test-artifacts/hadoop/target/hadoop-smoke-0.9.0-SNAPSHOT.jar> to org.apache.bigtop.itest/hadoop-smoke/0.9.0-20150119.000056-69/hadoop-smoke-0.9.0-20150119.000056-69.jar
Sending artifact delta relative to Bigtop-trunk-testartifacts » hadoopsmoke #1591
Archived 2 artifacts
Archive block size is 32768
Received 2 blocks and 265981 bytes
Compression is 19.8%
Took 0.16 sec
[JENKINS] Archiving <https://builds.apache.org/job/Bigtop-trunk-testartifacts/ws/bigtop-tests/test-artifacts/oozie/pom.xml> to org.apache.bigtop.itest/oozie-smoke/0.9.0-SNAPSHOT/oozie-smoke-0.9.0-SNAPSHOT.pom
[JENKINS] Archiving <https://builds.apache.org/job/Bigtop-trunk-testartifacts/ws/bigtop-tests/test-artifacts/oozie/target/oozie-smoke-0.9.0-SNAPSHOT.jar> to org.apache.bigtop.itest/oozie-smoke/0.9.0-20150119.000108-69/oozie-smoke-0.9.0-20150119.000108-69.jar
Sending artifact delta relative to Bigtop-trunk-testartifacts » ooziesmoke #1591
Archived 2 artifacts
Archive block size is 32768
Received 0 blocks and 16595 bytes
Compression is 0.0%
Took 46 ms
[JENKINS] Archiving <https://builds.apache.org/job/Bigtop-trunk-testartifacts/ws/bigtop-tests/test-artifacts/giraph/pom.xml> to org.apache.bigtop.itest/giraph-smoke/0.9.0-SNAPSHOT/giraph-smoke-0.9.0-SNAPSHOT.pom
Sending artifact delta relative to Bigtop-trunk-testartifacts » giraphsmoke #1587
Archived 1 artifacts
Archive block size is 32768
Received 0 blocks and 1522 bytes
Compression is 0.0%
Took 53 ms
[JENKINS] Archiving <https://builds.apache.org/job/Bigtop-trunk-testartifacts/ws/bigtop-tests/test-artifacts/hcatalog/pom.xml> to org.apache.bigtop.itest/hcatalog-smoke/0.9.0-SNAPSHOT/hcatalog-smoke-0.9.0-SNAPSHOT.pom
Sending artifact delta relative to Bigtop-trunk-testartifacts » hcatalogsmoke #1587
Archived 1 artifacts
Archive block size is 32768
Received 0 blocks and 1529 bytes
Compression is 0.0%
Took 31 ms
[JENKINS] Archiving <https://builds.apache.org/job/Bigtop-trunk-testartifacts/ws/bigtop-tests/test-artifacts/datafu/pom.xml> to org.apache.bigtop.itest/datafu-smoke/0.9.0-SNAPSHOT/datafu-smoke-0.9.0-SNAPSHOT.pom
Sending artifact delta relative to Bigtop-trunk-testartifacts » datafusmoke #1587
Archived 1 artifacts
Archive block size is 32768
Received 0 blocks and 2405 bytes
Compression is 0.0%
Took 35 ms
[JENKINS] Archiving <https://builds.apache.org/job/Bigtop-trunk-testartifacts/ws/bigtop-tests/test-artifacts/longevity/pom.xml> to org.apache.bigtop.itest/io-longevity/0.9.0-SNAPSHOT/io-longevity-0.9.0-SNAPSHOT.pom
Sending artifact delta relative to Bigtop-trunk-testartifacts » io-longevity #1587
Archived 1 artifacts
Archive block size is 32768
Received 0 blocks and 1699 bytes
Compression is 0.0%
Took 29 ms
[JENKINS] Archiving <https://builds.apache.org/job/Bigtop-trunk-testartifacts/ws/bigtop-tests/test-artifacts/mahout/pom.xml> to org.apache.bigtop.itest/mahout-smoke/0.9.0-SNAPSHOT/mahout-smoke-0.9.0-SNAPSHOT.pom
Sending artifact delta relative to Bigtop-trunk-testartifacts » mahoutsmoke #1587
Archived 1 artifacts
Archive block size is 32768
Received 0 blocks and 1522 bytes
Compression is 0.0%
Took 33 ms
[JENKINS] Archiving <https://builds.apache.org/job/Bigtop-trunk-testartifacts/ws/bigtop-tests/test-artifacts/hbase/pom.xml> to org.apache.bigtop.itest/hbase-smoke/0.9.0-SNAPSHOT/hbase-smoke-0.9.0-SNAPSHOT.pom
[JENKINS] Archiving <https://builds.apache.org/job/Bigtop-trunk-testartifacts/ws/bigtop-tests/test-artifacts/hbase/target/hbase-smoke-0.9.0-SNAPSHOT.jar> to org.apache.bigtop.itest/hbase-smoke/0.9.0-20150119.000113-69/hbase-smoke-0.9.0-20150119.000113-69.jar
Sending artifact delta relative to Bigtop-trunk-testartifacts » hbasesmoke #1591
Archived 2 artifacts
Archive block size is 32768
Received 0 blocks and 184779 bytes
Compression is 0.0%
Took 78 ms
[JENKINS] Archiving <https://builds.apache.org/job/Bigtop-trunk-testartifacts/ws/bigtop-tests/test-artifacts/solr/pom.xml> to org.apache.bigtop.itest/solr-smoke/0.9.0-SNAPSHOT/solr-smoke-0.9.0-SNAPSHOT.pom
Sending artifact delta relative to Bigtop-trunk-testartifacts » solrsmoke #1587
Archived 1 artifacts
Archive block size is 32768
Received 0 blocks and 1784 bytes
Compression is 0.0%
Took 71 ms
[JENKINS] Archiving <https://builds.apache.org/job/Bigtop-trunk-testartifacts/ws/bigtop-tests/test-artifacts/phoenix/pom.xml> to org.apache.bigtop.itest/phoenix-smoke/0.9.0-SNAPSHOT/phoenix-smoke-0.9.0-SNAPSHOT.pom
Sending artifact delta relative to Bigtop-trunk-testartifacts » phoenixsmoke #1587
Archived 1 artifacts
Archive block size is 32768
Received 0 blocks and 1526 bytes
Compression is 0.0%
Took 34 ms
[JENKINS] Archiving <https://builds.apache.org/job/Bigtop-trunk-testartifacts/ws/bigtop-tests/test-artifacts/fatjar/pom.xml> to org.apache.bigtop.itest/fat-smoke/0.9.0-SNAPSHOT/fat-smoke-0.9.0-SNAPSHOT.pom
Sending artifact delta relative to Bigtop-trunk-testartifacts » fatjar #1587
Archived 1 artifacts
Archive block size is 32768
Received 0 blocks and 5446 bytes
Compression is 0.0%
Took 1.9 sec
Sending e-mails to: ci@bigtop.apache.org
channel stopped
Jenkins build is back to normal : Bigtop-trunk-testartifacts #1599
Posted by Apache Jenkins Server <je...@builds.apache.org>.
See <https://builds.apache.org/job/Bigtop-trunk-testartifacts/1599/changes>
Build failed in Jenkins: Bigtop-trunk-testartifacts #1598
Posted by Apache Jenkins Server <je...@builds.apache.org>.
See <https://builds.apache.org/job/Bigtop-trunk-testartifacts/1598/changes>
Changes:
[evansye] BIGTOP-1614: Add .gitignore file for docker-puppet
------------------------------------------
[...truncated 565 lines...]
[INFO]
[INFO] --- maven-remote-resources-plugin:1.1:process (default) @ mahout-smoke ---
[INFO]
[INFO] --- maven-resources-plugin:2.4.3:resources (default-resources) @ mahout-smoke ---
[INFO] Using 'UTF-8' encoding to copy filtered resources.
[INFO] skip non existing resourceDirectory <https://builds.apache.org/job/Bigtop-trunk-testartifacts/ws/bigtop-tests/test-artifacts/mahout/src/main/resources>
[INFO] Copying 3 resources
[INFO]
[INFO] --- maven-compiler-plugin:3.1:compile (default-compile) @ mahout-smoke ---
[INFO] Changes detected - recompiling the module!
[INFO] Using Groovy-Eclipse compiler to compile both Java and Groovy files
org.codehaus.groovy.control.messages.SyntaxErrorMessage@f7206d
org.codehaus.groovy.control.messages.SyntaxErrorMessage@71e0e9
org.codehaus.groovy.control.messages.SyntaxErrorMessage@64e553
org.codehaus.groovy.control.messages.SyntaxErrorMessage@be3bd
<https://builds.apache.org/job/Bigtop-trunk-testartifacts/ws/bigtop-tests/test-artifacts/mahout/src/main/groovy/org/apache/bigtop/itest/mahout/smoke/TestMahoutExamples.groovy>: 74 Groovy:unexpected token: f_name @ line 74, column 13.
<https://builds.apache.org/job/Bigtop-trunk-testartifacts/ws/bigtop-tests/test-artifacts/mahout/src/main/groovy/org/apache/bigtop/itest/mahout/smoke/TestMahoutExamples.groovy>: 75 Groovy:unexpected token: sh @ line 75, column 13.
<https://builds.apache.org/job/Bigtop-trunk-testartifacts/ws/bigtop-tests/test-artifacts/mahout/src/main/groovy/org/apache/bigtop/itest/mahout/smoke/TestMahoutExamples.groovy>: 80 Groovy:unexpected token: assertTrue @ line 80, column 13.
<https://builds.apache.org/job/Bigtop-trunk-testartifacts/ws/bigtop-tests/test-artifacts/mahout/src/main/groovy/org/apache/bigtop/itest/mahout/smoke/TestMahoutExamples.groovy>: 83 Groovy:unexpected token: } @ line 83, column 5.
[INFO] -------------------------------------------------------------
[ERROR] COMPILATION ERROR :
[INFO] -------------------------------------------------------------
[ERROR] <https://builds.apache.org/job/Bigtop-trunk-testartifacts/ws/bigtop-tests/test-artifacts/mahout/src/main/groovy/org/apache/bigtop/itest/mahout/smoke/TestMahoutExamples.groovy>:[74,1] 1. ERROR in <https://builds.apache.org/job/Bigtop-trunk-testartifacts/ws/bigtop-tests/test-artifacts/mahout/src/main/groovy/org/apache/bigtop/itest/mahout/smoke/TestMahoutExamples.groovy> (at line 74)
f_name,loc ->
^
Groovy:unexpected token: f_name @ line 74, column 13.
[ERROR] <https://builds.apache.org/job/Bigtop-trunk-testartifacts/ws/bigtop-tests/test-artifacts/mahout/src/main/groovy/org/apache/bigtop/itest/mahout/smoke/TestMahoutExamples.groovy>:[75,1] 2. ERROR in <https://builds.apache.org/job/Bigtop-trunk-testartifacts/ws/bigtop-tests/test-artifacts/mahout/src/main/groovy/org/apache/bigtop/itest/mahout/smoke/TestMahoutExamples.groovy> (at line 75)
sh.exec("if [ ! -f ${download_dir}/${f_name} ]; then " +
^
Groovy:unexpected token: sh @ line 75, column 13.
[ERROR] <https://builds.apache.org/job/Bigtop-trunk-testartifacts/ws/bigtop-tests/test-artifacts/mahout/src/main/groovy/org/apache/bigtop/itest/mahout/smoke/TestMahoutExamples.groovy>:[80,1] 3. ERROR in <https://builds.apache.org/job/Bigtop-trunk-testartifacts/ws/bigtop-tests/test-artifacts/mahout/src/main/groovy/org/apache/bigtop/itest/mahout/smoke/TestMahoutExamples.groovy> (at line 80)
assertTrue("file "+ f_name + " at "+loc + " len=" + file.length() + " is > 5k bytes", file.length() > 5000 );
^
Groovy:unexpected token: assertTrue @ line 80, column 13.
[ERROR] <https://builds.apache.org/job/Bigtop-trunk-testartifacts/ws/bigtop-tests/test-artifacts/mahout/src/main/groovy/org/apache/bigtop/itest/mahout/smoke/TestMahoutExamples.groovy>:[83,1] 4. ERROR in <https://builds.apache.org/job/Bigtop-trunk-testartifacts/ws/bigtop-tests/test-artifacts/mahout/src/main/groovy/org/apache/bigtop/itest/mahout/smoke/TestMahoutExamples.groovy> (at line 83)
}
^
Groovy:unexpected token: } @ line 83, column 5.
[ERROR] Found 4 errors and 0 warnings.
[INFO] 5 errors
[INFO] -------------------------------------------------------------
[INFO] ------------------------------------------------------------------------
[INFO] Reactor Summary:
[INFO]
[INFO] bigtop-smokes ..................................... SUCCESS [3.955s]
[INFO] hadoopsmoke ....................................... SUCCESS [8.084s]
[INFO] packagesmoke ...................................... SUCCESS [6.939s]
[INFO] httpfssmokes ...................................... SUCCESS [2.549s]
[INFO] ooziesmoke ........................................ SUCCESS [2.066s]
[INFO] hbasesmoke ........................................ SUCCESS [6.798s]
[INFO] flumesmoke ........................................ SUCCESS [2.224s]
[INFO] sqoopsmokes ....................................... SUCCESS [2.568s]
[INFO] mahoutsmoke ....................................... FAILURE [0.331s]
[INFO] giraphsmoke ....................................... SKIPPED
[INFO] huesmoke .......................................... SKIPPED
[INFO] solrsmoke ......................................... SKIPPED
[INFO] crunchsmoke ....................................... SKIPPED
[INFO] datafusmoke ....................................... SKIPPED
[INFO] io-longevity ...................................... SKIPPED
[INFO] hcatalogsmoke ..................................... SKIPPED
[INFO] sparksmoke ........................................ SKIPPED
[INFO] phoenixsmoke ...................................... SKIPPED
[INFO] fatjar ............................................ SKIPPED
[INFO] ------------------------------------------------------------------------
[INFO] BUILD FAILURE
[INFO] ------------------------------------------------------------------------
[INFO] Total time: 43.440s
[INFO] Finished at: Tue Jan 20 13:16:38 UTC 2015
[INFO] Final Memory: 31M/364M
[INFO] ------------------------------------------------------------------------
Waiting for Jenkins to finish collecting data
[ERROR] Failed to execute goal org.apache.maven.plugins:maven-compiler-plugin:3.1:compile (default-compile) on project mahout-smoke: Compilation failure: Compilation failure:
[ERROR] <https://builds.apache.org/job/Bigtop-trunk-testartifacts/ws/bigtop-tests/test-artifacts/mahout/src/main/groovy/org/apache/bigtop/itest/mahout/smoke/TestMahoutExamples.groovy>:[74,1] 1. ERROR in <https://builds.apache.org/job/Bigtop-trunk-testartifacts/ws/bigtop-tests/test-artifacts/mahout/src/main/groovy/org/apache/bigtop/itest/mahout/smoke/TestMahoutExamples.groovy> (at line 74)
[ERROR] f_name,loc ->
[ERROR] ^
[ERROR] Groovy:unexpected token: f_name @ line 74, column 13.
[ERROR]
[ERROR] <https://builds.apache.org/job/Bigtop-trunk-testartifacts/ws/bigtop-tests/test-artifacts/mahout/src/main/groovy/org/apache/bigtop/itest/mahout/smoke/TestMahoutExamples.groovy>:[75,1] 2. ERROR in <https://builds.apache.org/job/Bigtop-trunk-testartifacts/ws/bigtop-tests/test-artifacts/mahout/src/main/groovy/org/apache/bigtop/itest/mahout/smoke/TestMahoutExamples.groovy> (at line 75)
[ERROR] sh.exec("if [ ! -f ${download_dir}/${f_name} ]; then " +
[ERROR] ^
[ERROR] Groovy:unexpected token: sh @ line 75, column 13.
[ERROR]
[ERROR] <https://builds.apache.org/job/Bigtop-trunk-testartifacts/ws/bigtop-tests/test-artifacts/mahout/src/main/groovy/org/apache/bigtop/itest/mahout/smoke/TestMahoutExamples.groovy>:[80,1] 3. ERROR in <https://builds.apache.org/job/Bigtop-trunk-testartifacts/ws/bigtop-tests/test-artifacts/mahout/src/main/groovy/org/apache/bigtop/itest/mahout/smoke/TestMahoutExamples.groovy> (at line 80)
[ERROR] assertTrue("file "+ f_name + " at "+loc + " len=" + file.length() + " is > 5k bytes", file.length() > 5000 );
[ERROR] ^
[ERROR] Groovy:unexpected token: assertTrue @ line 80, column 13.
[ERROR]
[ERROR] <https://builds.apache.org/job/Bigtop-trunk-testartifacts/ws/bigtop-tests/test-artifacts/mahout/src/main/groovy/org/apache/bigtop/itest/mahout/smoke/TestMahoutExamples.groovy>:[83,1] 4. ERROR in <https://builds.apache.org/job/Bigtop-trunk-testartifacts/ws/bigtop-tests/test-artifacts/mahout/src/main/groovy/org/apache/bigtop/itest/mahout/smoke/TestMahoutExamples.groovy> (at line 83)
[ERROR] }
[ERROR] ^
[ERROR] Groovy:unexpected token: } @ line 83, column 5.
[ERROR]
[ERROR] Found 4 errors and 0 warnings.
[ERROR] -> [Help 1]
[ERROR]
[ERROR] To see the full stack trace of the errors, re-run Maven with the -e switch.
[ERROR] Re-run Maven using the -X switch to enable full debug logging.
[ERROR]
[ERROR] For more information about the errors and possible solutions, please read the following articles:
[ERROR] [Help 1] http://cwiki.apache.org/confluence/display/MAVEN/MojoFailureException
[ERROR]
[ERROR] After correcting the problems, you can resume the build with the command
[ERROR] mvn <goals> -rf :mahout-smoke
[JENKINS] Archiving <https://builds.apache.org/job/Bigtop-trunk-testartifacts/ws/bigtop-tests/test-artifacts/pom.xml> to org.apache.bigtop.itest/bigtop-smokes/0.9.0-SNAPSHOT/bigtop-smokes-0.9.0-SNAPSHOT.pom
Sending artifact delta relative to Bigtop-trunk-testartifacts » bigtop-smokes #1597
Archived 1 artifacts
Archive block size is 32768
Received 0 blocks and 4894 bytes
Compression is 0.0%
Took 0.18 sec
[JENKINS] Archiving <https://builds.apache.org/job/Bigtop-trunk-testartifacts/ws/bigtop-tests/test-artifacts/sqoop/pom.xml> to org.apache.bigtop.itest/sqoop-smoke/0.9.0-SNAPSHOT/sqoop-smoke-0.9.0-SNAPSHOT.pom
[JENKINS] Archiving <https://builds.apache.org/job/Bigtop-trunk-testartifacts/ws/bigtop-tests/test-artifacts/sqoop/target/sqoop-smoke-0.9.0-SNAPSHOT.jar> to org.apache.bigtop.itest/sqoop-smoke/0.9.0-20150120.131636-75/sqoop-smoke-0.9.0-20150120.131636-75.jar
Sending artifact delta relative to Bigtop-trunk-testartifacts » sqoopsmokes #1597
Archived 2 artifacts
Archive block size is 32768
Received 0 blocks and 50623 bytes
Compression is 0.0%
Took 0.18 sec
[JENKINS] Archiving <https://builds.apache.org/job/Bigtop-trunk-testartifacts/ws/bigtop-tests/test-artifacts/hue/pom.xml> to org.apache.bigtop.itest/hue-smoke/0.9.0-SNAPSHOT/hue-smoke-0.9.0-SNAPSHOT.pom
Sending artifact delta relative to Bigtop-trunk-testartifacts » huesmoke #1587
Archived 1 artifacts
Archive block size is 32768
Received 0 blocks and 1510 bytes
Compression is 0.0%
Took 95 ms
[JENKINS] Archiving <https://builds.apache.org/job/Bigtop-trunk-testartifacts/ws/bigtop-tests/test-artifacts/crunch/pom.xml> to org.apache.bigtop.itest/crunch-smoke/0.9.0-SNAPSHOT/crunch-smoke-0.9.0-SNAPSHOT.pom
Sending artifact delta relative to Bigtop-trunk-testartifacts » crunchsmoke #1587
Archived 1 artifacts
Archive block size is 32768
Received 0 blocks and 1521 bytes
Compression is 0.0%
Took 0.17 sec
[JENKINS] Archiving <https://builds.apache.org/job/Bigtop-trunk-testartifacts/ws/bigtop-tests/test-artifacts/package/pom.xml> to org.apache.bigtop.itest/package-smoke/0.9.0-SNAPSHOT/package-smoke-0.9.0-SNAPSHOT.pom
[JENKINS] Archiving <https://builds.apache.org/job/Bigtop-trunk-testartifacts/ws/bigtop-tests/test-artifacts/package/target/package-smoke-0.9.0-SNAPSHOT.jar> to org.apache.bigtop.itest/package-smoke/0.9.0-20150120.131618-75/package-smoke-0.9.0-20150120.131618-75.jar
Sending artifact delta relative to Bigtop-trunk-testartifacts » packagesmoke #1597
Archived 2 artifacts
Archive block size is 32768
Received 1 blocks and 778255 bytes
Compression is 4.0%
Took 0.55 sec
[JENKINS] Archiving <https://builds.apache.org/job/Bigtop-trunk-testartifacts/ws/bigtop-tests/test-artifacts/flume/pom.xml> to org.apache.bigtop.itest/flume-smoke/0.9.0-SNAPSHOT/flume-smoke-0.9.0-SNAPSHOT.pom
[JENKINS] Archiving <https://builds.apache.org/job/Bigtop-trunk-testartifacts/ws/bigtop-tests/test-artifacts/flume/target/flume-smoke-0.9.0-SNAPSHOT.jar> to org.apache.bigtop.itest/flume-smoke/0.9.0-20150120.131633-75/flume-smoke-0.9.0-20150120.131633-75.jar
Sending artifact delta relative to Bigtop-trunk-testartifacts » flumesmoke #1597
Archived 2 artifacts
Archive block size is 32768
Received 0 blocks and 42422 bytes
Compression is 0.0%
Took 0.19 sec
[JENKINS] Archiving <https://builds.apache.org/job/Bigtop-trunk-testartifacts/ws/bigtop-tests/test-artifacts/httpfs/pom.xml> to org.apache.bigtop.itest/httpfs-smoke/0.9.0-SNAPSHOT/httpfs-smoke-0.9.0-SNAPSHOT.pom
[JENKINS] Archiving <https://builds.apache.org/job/Bigtop-trunk-testartifacts/ws/bigtop-tests/test-artifacts/httpfs/target/httpfs-smoke-0.9.0-SNAPSHOT.jar> to org.apache.bigtop.itest/httpfs-smoke/0.9.0-20150120.131621-75/httpfs-smoke-0.9.0-20150120.131621-75.jar
Sending artifact delta relative to Bigtop-trunk-testartifacts » httpfssmokes #1597
Archived 2 artifacts
Archive block size is 32768
Received 0 blocks and 17688 bytes
Compression is 0.0%
Took 0.1 sec
[JENKINS] Archiving <https://builds.apache.org/job/Bigtop-trunk-testartifacts/ws/bigtop-tests/test-artifacts/spark/pom.xml> to org.apache.bigtop.itest/spark-smoke/0.9.0-SNAPSHOT/spark-smoke-0.9.0-SNAPSHOT.pom
Sending artifact delta relative to Bigtop-trunk-testartifacts » sparksmoke #1587
Archived 1 artifacts
Archive block size is 32768
Received 0 blocks and 2266 bytes
Compression is 0.0%
Took 0.11 sec
[JENKINS] Archiving <https://builds.apache.org/job/Bigtop-trunk-testartifacts/ws/bigtop-tests/test-artifacts/hadoop/pom.xml> to org.apache.bigtop.itest/hadoop-smoke/0.9.0-SNAPSHOT/hadoop-smoke-0.9.0-SNAPSHOT.pom
[JENKINS] Archiving <https://builds.apache.org/job/Bigtop-trunk-testartifacts/ws/bigtop-tests/test-artifacts/hadoop/target/hadoop-smoke-0.9.0-SNAPSHOT.jar> to org.apache.bigtop.itest/hadoop-smoke/0.9.0-20150120.131610-75/hadoop-smoke-0.9.0-20150120.131610-75.jar
Sending artifact delta relative to Bigtop-trunk-testartifacts » hadoopsmoke #1597
Archived 2 artifacts
Archive block size is 32768
Received 2 blocks and 265983 bytes
Compression is 19.8%
Took 0.27 sec
[JENKINS] Archiving <https://builds.apache.org/job/Bigtop-trunk-testartifacts/ws/bigtop-tests/test-artifacts/oozie/pom.xml> to org.apache.bigtop.itest/oozie-smoke/0.9.0-SNAPSHOT/oozie-smoke-0.9.0-SNAPSHOT.pom
[JENKINS] Archiving <https://builds.apache.org/job/Bigtop-trunk-testartifacts/ws/bigtop-tests/test-artifacts/oozie/target/oozie-smoke-0.9.0-SNAPSHOT.jar> to org.apache.bigtop.itest/oozie-smoke/0.9.0-20150120.131624-75/oozie-smoke-0.9.0-20150120.131624-75.jar
Sending artifact delta relative to Bigtop-trunk-testartifacts » ooziesmoke #1597
Archived 2 artifacts
Archive block size is 32768
Received 0 blocks and 16597 bytes
Compression is 0.0%
Took 67 ms
[JENKINS] Archiving <https://builds.apache.org/job/Bigtop-trunk-testartifacts/ws/bigtop-tests/test-artifacts/giraph/pom.xml> to org.apache.bigtop.itest/giraph-smoke/0.9.0-SNAPSHOT/giraph-smoke-0.9.0-SNAPSHOT.pom
Sending artifact delta relative to Bigtop-trunk-testartifacts » giraphsmoke #1587
Archived 1 artifacts
Archive block size is 32768
Received 0 blocks and 1522 bytes
Compression is 0.0%
Took 76 ms
[JENKINS] Archiving <https://builds.apache.org/job/Bigtop-trunk-testartifacts/ws/bigtop-tests/test-artifacts/hcatalog/pom.xml> to org.apache.bigtop.itest/hcatalog-smoke/0.9.0-SNAPSHOT/hcatalog-smoke-0.9.0-SNAPSHOT.pom
Sending artifact delta relative to Bigtop-trunk-testartifacts » hcatalogsmoke #1587
Archived 1 artifacts
Archive block size is 32768
Received 0 blocks and 1529 bytes
Compression is 0.0%
Took 55 ms
[JENKINS] Archiving <https://builds.apache.org/job/Bigtop-trunk-testartifacts/ws/bigtop-tests/test-artifacts/datafu/pom.xml> to org.apache.bigtop.itest/datafu-smoke/0.9.0-SNAPSHOT/datafu-smoke-0.9.0-SNAPSHOT.pom
Sending artifact delta relative to Bigtop-trunk-testartifacts » datafusmoke #1587
Archived 1 artifacts
Archive block size is 32768
Received 0 blocks and 2405 bytes
Compression is 0.0%
Took 55 ms
[JENKINS] Archiving <https://builds.apache.org/job/Bigtop-trunk-testartifacts/ws/bigtop-tests/test-artifacts/longevity/pom.xml> to org.apache.bigtop.itest/io-longevity/0.9.0-SNAPSHOT/io-longevity-0.9.0-SNAPSHOT.pom
Sending artifact delta relative to Bigtop-trunk-testartifacts » io-longevity #1587
Archived 1 artifacts
Archive block size is 32768
Received 0 blocks and 1699 bytes
Compression is 0.0%
Took 33 ms
[JENKINS] Archiving <https://builds.apache.org/job/Bigtop-trunk-testartifacts/ws/bigtop-tests/test-artifacts/mahout/pom.xml> to org.apache.bigtop.itest/mahout-smoke/0.9.0-SNAPSHOT/mahout-smoke-0.9.0-SNAPSHOT.pom
Sending artifact delta relative to Bigtop-trunk-testartifacts » mahoutsmoke #1587
Archived 1 artifacts
Archive block size is 32768
Received 0 blocks and 1522 bytes
Compression is 0.0%
Took 33 ms
[JENKINS] Archiving <https://builds.apache.org/job/Bigtop-trunk-testartifacts/ws/bigtop-tests/test-artifacts/hbase/pom.xml> to org.apache.bigtop.itest/hbase-smoke/0.9.0-SNAPSHOT/hbase-smoke-0.9.0-SNAPSHOT.pom
[JENKINS] Archiving <https://builds.apache.org/job/Bigtop-trunk-testartifacts/ws/bigtop-tests/test-artifacts/hbase/target/hbase-smoke-0.9.0-SNAPSHOT.jar> to org.apache.bigtop.itest/hbase-smoke/0.9.0-20150120.131630-75/hbase-smoke-0.9.0-20150120.131630-75.jar
Sending artifact delta relative to Bigtop-trunk-testartifacts » hbasesmoke #1597
Archived 2 artifacts
Archive block size is 32768
Received 1 blocks and 152011 bytes
Compression is 17.7%
Took 0.17 sec
[JENKINS] Archiving <https://builds.apache.org/job/Bigtop-trunk-testartifacts/ws/bigtop-tests/test-artifacts/solr/pom.xml> to org.apache.bigtop.itest/solr-smoke/0.9.0-SNAPSHOT/solr-smoke-0.9.0-SNAPSHOT.pom
Sending artifact delta relative to Bigtop-trunk-testartifacts » solrsmoke #1587
Archived 1 artifacts
Archive block size is 32768
Received 0 blocks and 1784 bytes
Compression is 0.0%
Took 89 ms
[JENKINS] Archiving <https://builds.apache.org/job/Bigtop-trunk-testartifacts/ws/bigtop-tests/test-artifacts/phoenix/pom.xml> to org.apache.bigtop.itest/phoenix-smoke/0.9.0-SNAPSHOT/phoenix-smoke-0.9.0-SNAPSHOT.pom
Sending artifact delta relative to Bigtop-trunk-testartifacts » phoenixsmoke #1587
Archived 1 artifacts
Archive block size is 32768
Received 0 blocks and 1526 bytes
Compression is 0.0%
Took 64 ms
[JENKINS] Archiving <https://builds.apache.org/job/Bigtop-trunk-testartifacts/ws/bigtop-tests/test-artifacts/fatjar/pom.xml> to org.apache.bigtop.itest/fat-smoke/0.9.0-SNAPSHOT/fat-smoke-0.9.0-SNAPSHOT.pom
Sending artifact delta relative to Bigtop-trunk-testartifacts » fatjar #1587
Archived 1 artifacts
Archive block size is 32768
Received 0 blocks and 5446 bytes
Compression is 0.0%
Took 2 sec
Sending e-mails to: ci@bigtop.apache.org
channel stopped
Build failed in Jenkins: Bigtop-trunk-testartifacts #1597
Posted by Apache Jenkins Server <je...@builds.apache.org>.
See <https://builds.apache.org/job/Bigtop-trunk-testartifacts/1597/changes>
Changes:
[jayunit100] BIGTOP-1613: Add .gitignore for vagrant-puppet
[jayunit100] BIGTOP-1612: Update README for smoke-tests
------------------------------------------
[...truncated 565 lines...]
[INFO]
[INFO] --- maven-remote-resources-plugin:1.1:process (default) @ mahout-smoke ---
[INFO]
[INFO] --- maven-resources-plugin:2.4.3:resources (default-resources) @ mahout-smoke ---
[INFO] Using 'UTF-8' encoding to copy filtered resources.
[INFO] skip non existing resourceDirectory <https://builds.apache.org/job/Bigtop-trunk-testartifacts/ws/bigtop-tests/test-artifacts/mahout/src/main/resources>
[INFO] Copying 3 resources
[INFO]
[INFO] --- maven-compiler-plugin:3.1:compile (default-compile) @ mahout-smoke ---
[INFO] Changes detected - recompiling the module!
[INFO] Using Groovy-Eclipse compiler to compile both Java and Groovy files
org.codehaus.groovy.control.messages.SyntaxErrorMessage@1323241
org.codehaus.groovy.control.messages.SyntaxErrorMessage@818376
org.codehaus.groovy.control.messages.SyntaxErrorMessage@ddc385
org.codehaus.groovy.control.messages.SyntaxErrorMessage@14f5969
/x1/jenkins/jenkins-slave/workspace/Bigtop-trunk-testartifacts/bigtop-tests/test-artifacts/mahout/src/main/groovy/org/apache/bigtop/itest/mahout/smoke/TestMahoutExamples.groovy: 74 Groovy:unexpected token: f_name @ line 74, column 13.
/x1/jenkins/jenkins-slave/workspace/Bigtop-trunk-testartifacts/bigtop-tests/test-artifacts/mahout/src/main/groovy/org/apache/bigtop/itest/mahout/smoke/TestMahoutExamples.groovy: 75 Groovy:unexpected token: sh @ line 75, column 13.
/x1/jenkins/jenkins-slave/workspace/Bigtop-trunk-testartifacts/bigtop-tests/test-artifacts/mahout/src/main/groovy/org/apache/bigtop/itest/mahout/smoke/TestMahoutExamples.groovy: 80 Groovy:unexpected token: assertTrue @ line 80, column 13.
/x1/jenkins/jenkins-slave/workspace/Bigtop-trunk-testartifacts/bigtop-tests/test-artifacts/mahout/src/main/groovy/org/apache/bigtop/itest/mahout/smoke/TestMahoutExamples.groovy: 83 Groovy:unexpected token: } @ line 83, column 5.
[INFO] -------------------------------------------------------------
[ERROR] COMPILATION ERROR :
[INFO] -------------------------------------------------------------
[ERROR] /x1/jenkins/jenkins-slave/workspace/Bigtop-trunk-testartifacts/bigtop-tests/test-artifacts/mahout/src/main/groovy/org/apache/bigtop/itest/mahout/smoke/TestMahoutExamples.groovy:[74,1] 1. ERROR in /x1/jenkins/jenkins-slave/workspace/Bigtop-trunk-testartifacts/bigtop-tests/test-artifacts/mahout/src/main/groovy/org/apache/bigtop/itest/mahout/smoke/TestMahoutExamples.groovy (at line 74)
f_name,loc ->
^
Groovy:unexpected token: f_name @ line 74, column 13.
[ERROR] /x1/jenkins/jenkins-slave/workspace/Bigtop-trunk-testartifacts/bigtop-tests/test-artifacts/mahout/src/main/groovy/org/apache/bigtop/itest/mahout/smoke/TestMahoutExamples.groovy:[75,1] 2. ERROR in /x1/jenkins/jenkins-slave/workspace/Bigtop-trunk-testartifacts/bigtop-tests/test-artifacts/mahout/src/main/groovy/org/apache/bigtop/itest/mahout/smoke/TestMahoutExamples.groovy (at line 75)
sh.exec("if [ ! -f ${download_dir}/${f_name} ]; then " +
^
Groovy:unexpected token: sh @ line 75, column 13.
[ERROR] /x1/jenkins/jenkins-slave/workspace/Bigtop-trunk-testartifacts/bigtop-tests/test-artifacts/mahout/src/main/groovy/org/apache/bigtop/itest/mahout/smoke/TestMahoutExamples.groovy:[80,1] 3. ERROR in /x1/jenkins/jenkins-slave/workspace/Bigtop-trunk-testartifacts/bigtop-tests/test-artifacts/mahout/src/main/groovy/org/apache/bigtop/itest/mahout/smoke/TestMahoutExamples.groovy (at line 80)
assertTrue("file "+ f_name + " at "+loc + " len=" + file.length() + " is > 5k bytes", file.length() > 5000 );
^
Groovy:unexpected token: assertTrue @ line 80, column 13.
[ERROR] /x1/jenkins/jenkins-slave/workspace/Bigtop-trunk-testartifacts/bigtop-tests/test-artifacts/mahout/src/main/groovy/org/apache/bigtop/itest/mahout/smoke/TestMahoutExamples.groovy:[83,1] 4. ERROR in /x1/jenkins/jenkins-slave/workspace/Bigtop-trunk-testartifacts/bigtop-tests/test-artifacts/mahout/src/main/groovy/org/apache/bigtop/itest/mahout/smoke/TestMahoutExamples.groovy (at line 83)
}
^
Groovy:unexpected token: } @ line 83, column 5.
[ERROR] Found 4 errors and 0 warnings.
[INFO] 5 errors
[INFO] -------------------------------------------------------------
[INFO] ------------------------------------------------------------------------
[INFO] Reactor Summary:
[INFO]
[INFO] bigtop-smokes ..................................... SUCCESS [13.284s]
[INFO] hadoopsmoke ....................................... SUCCESS [10.492s]
[INFO] packagesmoke ...................................... SUCCESS [6.103s]
[INFO] httpfssmokes ...................................... SUCCESS [2.371s]
[INFO] ooziesmoke ........................................ SUCCESS [1.624s]
[INFO] hbasesmoke ........................................ SUCCESS [5.727s]
[INFO] flumesmoke ........................................ SUCCESS [1.589s]
[INFO] sqoopsmokes ....................................... SUCCESS [2.525s]
[INFO] mahoutsmoke ....................................... FAILURE [0.227s]
[INFO] giraphsmoke ....................................... SKIPPED
[INFO] huesmoke .......................................... SKIPPED
[INFO] solrsmoke ......................................... SKIPPED
[INFO] crunchsmoke ....................................... SKIPPED
[INFO] datafusmoke ....................................... SKIPPED
[INFO] io-longevity ...................................... SKIPPED
[INFO] hcatalogsmoke ..................................... SKIPPED
[INFO] sparksmoke ........................................ SKIPPED
[INFO] phoenixsmoke ...................................... SKIPPED
[INFO] fatjar ............................................ SKIPPED
[INFO] ------------------------------------------------------------------------
[INFO] BUILD FAILURE
[INFO] ------------------------------------------------------------------------
[INFO] Total time: 51.334s
[INFO] Finished at: Tue Jan 20 04:01:55 UTC 2015
[INFO] Final Memory: 31M/248M
[INFO] ------------------------------------------------------------------------
Waiting for Jenkins to finish collecting data
[ERROR] Failed to execute goal org.apache.maven.plugins:maven-compiler-plugin:3.1:compile (default-compile) on project mahout-smoke: Compilation failure: Compilation failure:
[ERROR] /x1/jenkins/jenkins-slave/workspace/Bigtop-trunk-testartifacts/bigtop-tests/test-artifacts/mahout/src/main/groovy/org/apache/bigtop/itest/mahout/smoke/TestMahoutExamples.groovy:[74,1] 1. ERROR in /x1/jenkins/jenkins-slave/workspace/Bigtop-trunk-testartifacts/bigtop-tests/test-artifacts/mahout/src/main/groovy/org/apache/bigtop/itest/mahout/smoke/TestMahoutExamples.groovy (at line 74)
[ERROR] f_name,loc ->
[ERROR] ^
[ERROR] Groovy:unexpected token: f_name @ line 74, column 13.
[ERROR]
[ERROR] /x1/jenkins/jenkins-slave/workspace/Bigtop-trunk-testartifacts/bigtop-tests/test-artifacts/mahout/src/main/groovy/org/apache/bigtop/itest/mahout/smoke/TestMahoutExamples.groovy:[75,1] 2. ERROR in /x1/jenkins/jenkins-slave/workspace/Bigtop-trunk-testartifacts/bigtop-tests/test-artifacts/mahout/src/main/groovy/org/apache/bigtop/itest/mahout/smoke/TestMahoutExamples.groovy (at line 75)
[ERROR] sh.exec("if [ ! -f ${download_dir}/${f_name} ]; then " +
[ERROR] ^
[ERROR] Groovy:unexpected token: sh @ line 75, column 13.
[ERROR]
[ERROR] /x1/jenkins/jenkins-slave/workspace/Bigtop-trunk-testartifacts/bigtop-tests/test-artifacts/mahout/src/main/groovy/org/apache/bigtop/itest/mahout/smoke/TestMahoutExamples.groovy:[80,1] 3. ERROR in /x1/jenkins/jenkins-slave/workspace/Bigtop-trunk-testartifacts/bigtop-tests/test-artifacts/mahout/src/main/groovy/org/apache/bigtop/itest/mahout/smoke/TestMahoutExamples.groovy (at line 80)
[ERROR] assertTrue("file "+ f_name + " at "+loc + " len=" + file.length() + " is > 5k bytes", file.length() > 5000 );
[ERROR] ^
[ERROR] Groovy:unexpected token: assertTrue @ line 80, column 13.
[ERROR]
[ERROR] /x1/jenkins/jenkins-slave/workspace/Bigtop-trunk-testartifacts/bigtop-tests/test-artifacts/mahout/src/main/groovy/org/apache/bigtop/itest/mahout/smoke/TestMahoutExamples.groovy:[83,1] 4. ERROR in /x1/jenkins/jenkins-slave/workspace/Bigtop-trunk-testartifacts/bigtop-tests/test-artifacts/mahout/src/main/groovy/org/apache/bigtop/itest/mahout/smoke/TestMahoutExamples.groovy (at line 83)
[ERROR] }
[ERROR] ^
[ERROR] Groovy:unexpected token: } @ line 83, column 5.
[ERROR]
[ERROR] Found 4 errors and 0 warnings.
[ERROR] -> [Help 1]
[ERROR]
[ERROR] To see the full stack trace of the errors, re-run Maven with the -e switch.
[ERROR] Re-run Maven using the -X switch to enable full debug logging.
[ERROR]
[ERROR] For more information about the errors and possible solutions, please read the following articles:
[ERROR] [Help 1] http://cwiki.apache.org/confluence/display/MAVEN/MojoFailureException
[ERROR]
[ERROR] After correcting the problems, you can resume the build with the command
[ERROR] mvn <goals> -rf :mahout-smoke
[JENKINS] Archiving <https://builds.apache.org/job/Bigtop-trunk-testartifacts/ws/bigtop-tests/test-artifacts/pom.xml> to org.apache.bigtop.itest/bigtop-smokes/0.9.0-SNAPSHOT/bigtop-smokes-0.9.0-SNAPSHOT.pom
Sending artifact delta relative to Bigtop-trunk-testartifacts ? bigtop-smokes #1596
Archived 1 artifacts
Archive block size is 32768
Received 0 blocks and 4894 bytes
Compression is 0.0%
Took 0.2 sec
[JENKINS] Archiving <https://builds.apache.org/job/Bigtop-trunk-testartifacts/ws/bigtop-tests/test-artifacts/sqoop/pom.xml> to org.apache.bigtop.itest/sqoop-smoke/0.9.0-SNAPSHOT/sqoop-smoke-0.9.0-SNAPSHOT.pom
[JENKINS] Archiving <https://builds.apache.org/job/Bigtop-trunk-testartifacts/ws/bigtop-tests/test-artifacts/sqoop/target/sqoop-smoke-0.9.0-SNAPSHOT.jar> to org.apache.bigtop.itest/sqoop-smoke/0.9.0-20150120.040154-74/sqoop-smoke-0.9.0-20150120.040154-74.jar
Sending artifact delta relative to Bigtop-trunk-testartifacts ? sqoopsmokes #1596
Archived 2 artifacts
Archive block size is 32768
Received 0 blocks and 50622 bytes
Compression is 0.0%
Took 0.16 sec
[JENKINS] Archiving <https://builds.apache.org/job/Bigtop-trunk-testartifacts/ws/bigtop-tests/test-artifacts/hue/pom.xml> to org.apache.bigtop.itest/hue-smoke/0.9.0-SNAPSHOT/hue-smoke-0.9.0-SNAPSHOT.pom
Sending artifact delta relative to Bigtop-trunk-testartifacts ? huesmoke #1587
Archived 1 artifacts
Archive block size is 32768
Received 0 blocks and 1510 bytes
Compression is 0.0%
Took 0.14 sec
[JENKINS] Archiving <https://builds.apache.org/job/Bigtop-trunk-testartifacts/ws/bigtop-tests/test-artifacts/crunch/pom.xml> to org.apache.bigtop.itest/crunch-smoke/0.9.0-SNAPSHOT/crunch-smoke-0.9.0-SNAPSHOT.pom
Sending artifact delta relative to Bigtop-trunk-testartifacts ? crunchsmoke #1587
Archived 1 artifacts
Archive block size is 32768
Received 0 blocks and 1521 bytes
Compression is 0.0%
Took 0.12 sec
[JENKINS] Archiving <https://builds.apache.org/job/Bigtop-trunk-testartifacts/ws/bigtop-tests/test-artifacts/package/pom.xml> to org.apache.bigtop.itest/package-smoke/0.9.0-SNAPSHOT/package-smoke-0.9.0-SNAPSHOT.pom
[JENKINS] Archiving <https://builds.apache.org/job/Bigtop-trunk-testartifacts/ws/bigtop-tests/test-artifacts/package/target/package-smoke-0.9.0-SNAPSHOT.jar> to org.apache.bigtop.itest/package-smoke/0.9.0-20150120.040139-74/package-smoke-0.9.0-20150120.040139-74.jar
Sending artifact delta relative to Bigtop-trunk-testartifacts ? packagesmoke #1596
Archived 2 artifacts
Archive block size is 32768
Received 2 blocks and 745487 bytes
Compression is 8.1%
Took 0.39 sec
[JENKINS] Archiving <https://builds.apache.org/job/Bigtop-trunk-testartifacts/ws/bigtop-tests/test-artifacts/flume/pom.xml> to org.apache.bigtop.itest/flume-smoke/0.9.0-SNAPSHOT/flume-smoke-0.9.0-SNAPSHOT.pom
[JENKINS] Archiving <https://builds.apache.org/job/Bigtop-trunk-testartifacts/ws/bigtop-tests/test-artifacts/flume/target/flume-smoke-0.9.0-SNAPSHOT.jar> to org.apache.bigtop.itest/flume-smoke/0.9.0-20150120.040151-74/flume-smoke-0.9.0-20150120.040151-74.jar
Sending artifact delta relative to Bigtop-trunk-testartifacts ? flumesmoke #1596
Archived 2 artifacts
Archive block size is 32768
Received 0 blocks and 42422 bytes
Compression is 0.0%
Took 0.22 sec
[JENKINS] Archiving <https://builds.apache.org/job/Bigtop-trunk-testartifacts/ws/bigtop-tests/test-artifacts/httpfs/pom.xml> to org.apache.bigtop.itest/httpfs-smoke/0.9.0-SNAPSHOT/httpfs-smoke-0.9.0-SNAPSHOT.pom
[JENKINS] Archiving <https://builds.apache.org/job/Bigtop-trunk-testartifacts/ws/bigtop-tests/test-artifacts/httpfs/target/httpfs-smoke-0.9.0-SNAPSHOT.jar> to org.apache.bigtop.itest/httpfs-smoke/0.9.0-20150120.040141-74/httpfs-smoke-0.9.0-20150120.040141-74.jar
Sending artifact delta relative to Bigtop-trunk-testartifacts ? httpfssmokes #1596
Archived 2 artifacts
Archive block size is 32768
Received 0 blocks and 17687 bytes
Compression is 0.0%
Took 80 ms
[JENKINS] Archiving <https://builds.apache.org/job/Bigtop-trunk-testartifacts/ws/bigtop-tests/test-artifacts/spark/pom.xml> to org.apache.bigtop.itest/spark-smoke/0.9.0-SNAPSHOT/spark-smoke-0.9.0-SNAPSHOT.pom
Sending artifact delta relative to Bigtop-trunk-testartifacts ? sparksmoke #1587
Archived 1 artifacts
Archive block size is 32768
Received 0 blocks and 2266 bytes
Compression is 0.0%
Took 0.11 sec
[JENKINS] Archiving <https://builds.apache.org/job/Bigtop-trunk-testartifacts/ws/bigtop-tests/test-artifacts/hadoop/pom.xml> to org.apache.bigtop.itest/hadoop-smoke/0.9.0-SNAPSHOT/hadoop-smoke-0.9.0-SNAPSHOT.pom
[JENKINS] Archiving <https://builds.apache.org/job/Bigtop-trunk-testartifacts/ws/bigtop-tests/test-artifacts/hadoop/target/hadoop-smoke-0.9.0-SNAPSHOT.jar> to org.apache.bigtop.itest/hadoop-smoke/0.9.0-20150120.040132-74/hadoop-smoke-0.9.0-20150120.040132-74.jar
Sending artifact delta relative to Bigtop-trunk-testartifacts ? hadoopsmoke #1596
Archived 2 artifacts
Archive block size is 32768
Received 2 blocks and 265982 bytes
Compression is 19.8%
Took 0.17 sec
[JENKINS] Archiving <https://builds.apache.org/job/Bigtop-trunk-testartifacts/ws/bigtop-tests/test-artifacts/oozie/pom.xml> to org.apache.bigtop.itest/oozie-smoke/0.9.0-SNAPSHOT/oozie-smoke-0.9.0-SNAPSHOT.pom
[JENKINS] Archiving <https://builds.apache.org/job/Bigtop-trunk-testartifacts/ws/bigtop-tests/test-artifacts/oozie/target/oozie-smoke-0.9.0-SNAPSHOT.jar> to org.apache.bigtop.itest/oozie-smoke/0.9.0-20150120.040143-74/oozie-smoke-0.9.0-20150120.040143-74.jar
Sending artifact delta relative to Bigtop-trunk-testartifacts ? ooziesmoke #1596
Archived 2 artifacts
Archive block size is 32768
Received 0 blocks and 16596 bytes
Compression is 0.0%
Took 73 ms
[JENKINS] Archiving <https://builds.apache.org/job/Bigtop-trunk-testartifacts/ws/bigtop-tests/test-artifacts/giraph/pom.xml> to org.apache.bigtop.itest/giraph-smoke/0.9.0-SNAPSHOT/giraph-smoke-0.9.0-SNAPSHOT.pom
Sending artifact delta relative to Bigtop-trunk-testartifacts ? giraphsmoke #1587
Archived 1 artifacts
Archive block size is 32768
Received 0 blocks and 1522 bytes
Compression is 0.0%
Took 0.15 sec
[JENKINS] Archiving <https://builds.apache.org/job/Bigtop-trunk-testartifacts/ws/bigtop-tests/test-artifacts/hcatalog/pom.xml> to org.apache.bigtop.itest/hcatalog-smoke/0.9.0-SNAPSHOT/hcatalog-smoke-0.9.0-SNAPSHOT.pom
Sending artifact delta relative to Bigtop-trunk-testartifacts ? hcatalogsmoke #1587
Archived 1 artifacts
Archive block size is 32768
Received 0 blocks and 1529 bytes
Compression is 0.0%
Took 65 ms
[JENKINS] Archiving <https://builds.apache.org/job/Bigtop-trunk-testartifacts/ws/bigtop-tests/test-artifacts/datafu/pom.xml> to org.apache.bigtop.itest/datafu-smoke/0.9.0-SNAPSHOT/datafu-smoke-0.9.0-SNAPSHOT.pom
Sending artifact delta relative to Bigtop-trunk-testartifacts ? datafusmoke #1587
Archived 1 artifacts
Archive block size is 32768
Received 0 blocks and 2405 bytes
Compression is 0.0%
Took 45 ms
[JENKINS] Archiving <https://builds.apache.org/job/Bigtop-trunk-testartifacts/ws/bigtop-tests/test-artifacts/longevity/pom.xml> to org.apache.bigtop.itest/io-longevity/0.9.0-SNAPSHOT/io-longevity-0.9.0-SNAPSHOT.pom
Sending artifact delta relative to Bigtop-trunk-testartifacts ? io-longevity #1587
Archived 1 artifacts
Archive block size is 32768
Received 0 blocks and 1699 bytes
Compression is 0.0%
Took 23 ms
[JENKINS] Archiving <https://builds.apache.org/job/Bigtop-trunk-testartifacts/ws/bigtop-tests/test-artifacts/mahout/pom.xml> to org.apache.bigtop.itest/mahout-smoke/0.9.0-SNAPSHOT/mahout-smoke-0.9.0-SNAPSHOT.pom
Sending artifact delta relative to Bigtop-trunk-testartifacts ? mahoutsmoke #1587
Archived 1 artifacts
Archive block size is 32768
Received 0 blocks and 1522 bytes
Compression is 0.0%
Took 30 ms
[JENKINS] Archiving <https://builds.apache.org/job/Bigtop-trunk-testartifacts/ws/bigtop-tests/test-artifacts/hbase/pom.xml> to org.apache.bigtop.itest/hbase-smoke/0.9.0-SNAPSHOT/hbase-smoke-0.9.0-SNAPSHOT.pom
[JENKINS] Archiving <https://builds.apache.org/job/Bigtop-trunk-testartifacts/ws/bigtop-tests/test-artifacts/hbase/target/hbase-smoke-0.9.0-SNAPSHOT.jar> to org.apache.bigtop.itest/hbase-smoke/0.9.0-20150120.040149-74/hbase-smoke-0.9.0-20150120.040149-74.jar
Sending artifact delta relative to Bigtop-trunk-testartifacts ? hbasesmoke #1596
Archived 2 artifacts
Archive block size is 32768
Received 1 blocks and 152011 bytes
Compression is 17.7%
Took 95 ms
[JENKINS] Archiving <https://builds.apache.org/job/Bigtop-trunk-testartifacts/ws/bigtop-tests/test-artifacts/solr/pom.xml> to org.apache.bigtop.itest/solr-smoke/0.9.0-SNAPSHOT/solr-smoke-0.9.0-SNAPSHOT.pom
Sending artifact delta relative to Bigtop-trunk-testartifacts ? solrsmoke #1587
Archived 1 artifacts
Archive block size is 32768
Received 0 blocks and 1784 bytes
Compression is 0.0%
Took 90 ms
[JENKINS] Archiving <https://builds.apache.org/job/Bigtop-trunk-testartifacts/ws/bigtop-tests/test-artifacts/phoenix/pom.xml> to org.apache.bigtop.itest/phoenix-smoke/0.9.0-SNAPSHOT/phoenix-smoke-0.9.0-SNAPSHOT.pom
Sending artifact delta relative to Bigtop-trunk-testartifacts ? phoenixsmoke #1587
Archived 1 artifacts
Archive block size is 32768
Received 0 blocks and 1526 bytes
Compression is 0.0%
Took 57 ms
[JENKINS] Archiving <https://builds.apache.org/job/Bigtop-trunk-testartifacts/ws/bigtop-tests/test-artifacts/fatjar/pom.xml> to org.apache.bigtop.itest/fat-smoke/0.9.0-SNAPSHOT/fat-smoke-0.9.0-SNAPSHOT.pom
Sending artifact delta relative to Bigtop-trunk-testartifacts ? fatjar #1587
Archived 1 artifacts
Archive block size is 32768
Received 0 blocks and 5446 bytes
Compression is 0.0%
Took 1.6 sec
Sending e-mails to: ci@bigtop.apache.org
channel stopped
Build failed in Jenkins: Bigtop-trunk-testartifacts #1596
Posted by Apache Jenkins Server <je...@builds.apache.org>.
See <https://builds.apache.org/job/Bigtop-trunk-testartifacts/1596/changes>
Changes:
[cos] BIGTOP-1609. Use openjdk7 for CentOS
------------------------------------------
[...truncated 565 lines...]
[INFO]
[INFO] --- maven-remote-resources-plugin:1.1:process (default) @ mahout-smoke ---
[INFO]
[INFO] --- maven-resources-plugin:2.4.3:resources (default-resources) @ mahout-smoke ---
[INFO] Using 'UTF-8' encoding to copy filtered resources.
[INFO] skip non existing resourceDirectory <https://builds.apache.org/job/Bigtop-trunk-testartifacts/ws/bigtop-tests/test-artifacts/mahout/src/main/resources>
[INFO] Copying 3 resources
[INFO]
[INFO] --- maven-compiler-plugin:3.1:compile (default-compile) @ mahout-smoke ---
[INFO] Changes detected - recompiling the module!
[INFO] Using Groovy-Eclipse compiler to compile both Java and Groovy files
org.codehaus.groovy.control.messages.SyntaxErrorMessage@3dae16
org.codehaus.groovy.control.messages.SyntaxErrorMessage@17056b0
org.codehaus.groovy.control.messages.SyntaxErrorMessage@4b4efd
org.codehaus.groovy.control.messages.SyntaxErrorMessage@2ed6a8
<https://builds.apache.org/job/Bigtop-trunk-testartifacts/ws/bigtop-tests/test-artifacts/mahout/src/main/groovy/org/apache/bigtop/itest/mahout/smoke/TestMahoutExamples.groovy>: 74 Groovy:unexpected token: f_name @ line 74, column 13.
<https://builds.apache.org/job/Bigtop-trunk-testartifacts/ws/bigtop-tests/test-artifacts/mahout/src/main/groovy/org/apache/bigtop/itest/mahout/smoke/TestMahoutExamples.groovy>: 75 Groovy:unexpected token: sh @ line 75, column 13.
<https://builds.apache.org/job/Bigtop-trunk-testartifacts/ws/bigtop-tests/test-artifacts/mahout/src/main/groovy/org/apache/bigtop/itest/mahout/smoke/TestMahoutExamples.groovy>: 80 Groovy:unexpected token: assertTrue @ line 80, column 13.
<https://builds.apache.org/job/Bigtop-trunk-testartifacts/ws/bigtop-tests/test-artifacts/mahout/src/main/groovy/org/apache/bigtop/itest/mahout/smoke/TestMahoutExamples.groovy>: 83 Groovy:unexpected token: } @ line 83, column 5.
[INFO] -------------------------------------------------------------
[ERROR] COMPILATION ERROR :
[INFO] -------------------------------------------------------------
[ERROR] <https://builds.apache.org/job/Bigtop-trunk-testartifacts/ws/bigtop-tests/test-artifacts/mahout/src/main/groovy/org/apache/bigtop/itest/mahout/smoke/TestMahoutExamples.groovy>:[74,1] 1. ERROR in <https://builds.apache.org/job/Bigtop-trunk-testartifacts/ws/bigtop-tests/test-artifacts/mahout/src/main/groovy/org/apache/bigtop/itest/mahout/smoke/TestMahoutExamples.groovy> (at line 74)
f_name,loc ->
^
Groovy:unexpected token: f_name @ line 74, column 13.
[ERROR] <https://builds.apache.org/job/Bigtop-trunk-testartifacts/ws/bigtop-tests/test-artifacts/mahout/src/main/groovy/org/apache/bigtop/itest/mahout/smoke/TestMahoutExamples.groovy>:[75,1] 2. ERROR in <https://builds.apache.org/job/Bigtop-trunk-testartifacts/ws/bigtop-tests/test-artifacts/mahout/src/main/groovy/org/apache/bigtop/itest/mahout/smoke/TestMahoutExamples.groovy> (at line 75)
sh.exec("if [ ! -f ${download_dir}/${f_name} ]; then " +
^
Groovy:unexpected token: sh @ line 75, column 13.
[ERROR] <https://builds.apache.org/job/Bigtop-trunk-testartifacts/ws/bigtop-tests/test-artifacts/mahout/src/main/groovy/org/apache/bigtop/itest/mahout/smoke/TestMahoutExamples.groovy>:[80,1] 3. ERROR in <https://builds.apache.org/job/Bigtop-trunk-testartifacts/ws/bigtop-tests/test-artifacts/mahout/src/main/groovy/org/apache/bigtop/itest/mahout/smoke/TestMahoutExamples.groovy> (at line 80)
assertTrue("file "+ f_name + " at "+loc + " len=" + file.length() + " is > 5k bytes", file.length() > 5000 );
^
Groovy:unexpected token: assertTrue @ line 80, column 13.
[ERROR] <https://builds.apache.org/job/Bigtop-trunk-testartifacts/ws/bigtop-tests/test-artifacts/mahout/src/main/groovy/org/apache/bigtop/itest/mahout/smoke/TestMahoutExamples.groovy>:[83,1] 4. ERROR in <https://builds.apache.org/job/Bigtop-trunk-testartifacts/ws/bigtop-tests/test-artifacts/mahout/src/main/groovy/org/apache/bigtop/itest/mahout/smoke/TestMahoutExamples.groovy> (at line 83)
}
^
Groovy:unexpected token: } @ line 83, column 5.
[ERROR] Found 4 errors and 0 warnings.
[INFO] 5 errors
[INFO] -------------------------------------------------------------
[INFO] ------------------------------------------------------------------------
[INFO] Reactor Summary:
[INFO]
[INFO] bigtop-smokes ..................................... SUCCESS [3.337s]
[INFO] hadoopsmoke ....................................... SUCCESS [5.872s]
[INFO] packagesmoke ...................................... SUCCESS [5.679s]
[INFO] httpfssmokes ...................................... SUCCESS [1.626s]
[INFO] ooziesmoke ........................................ SUCCESS [2.005s]
[INFO] hbasesmoke ........................................ SUCCESS [3.867s]
[INFO] flumesmoke ........................................ SUCCESS [2.004s]
[INFO] sqoopsmokes ....................................... SUCCESS [1.614s]
[INFO] mahoutsmoke ....................................... FAILURE [0.285s]
[INFO] giraphsmoke ....................................... SKIPPED
[INFO] huesmoke .......................................... SKIPPED
[INFO] solrsmoke ......................................... SKIPPED
[INFO] crunchsmoke ....................................... SKIPPED
[INFO] datafusmoke ....................................... SKIPPED
[INFO] io-longevity ...................................... SKIPPED
[INFO] hcatalogsmoke ..................................... SKIPPED
[INFO] sparksmoke ........................................ SKIPPED
[INFO] phoenixsmoke ...................................... SKIPPED
[INFO] fatjar ............................................ SKIPPED
[INFO] ------------------------------------------------------------------------
[INFO] BUILD FAILURE
[INFO] ------------------------------------------------------------------------
[INFO] Total time: 38.538s
[INFO] Finished at: Mon Jan 19 19:02:10 UTC 2015
[INFO] Final Memory: 31M/371M
[INFO] ------------------------------------------------------------------------
Waiting for Jenkins to finish collecting data
[ERROR] Failed to execute goal org.apache.maven.plugins:maven-compiler-plugin:3.1:compile (default-compile) on project mahout-smoke: Compilation failure: Compilation failure:
[ERROR] <https://builds.apache.org/job/Bigtop-trunk-testartifacts/ws/bigtop-tests/test-artifacts/mahout/src/main/groovy/org/apache/bigtop/itest/mahout/smoke/TestMahoutExamples.groovy>:[74,1] 1. ERROR in <https://builds.apache.org/job/Bigtop-trunk-testartifacts/ws/bigtop-tests/test-artifacts/mahout/src/main/groovy/org/apache/bigtop/itest/mahout/smoke/TestMahoutExamples.groovy> (at line 74)
[ERROR] f_name,loc ->
[ERROR] ^
[ERROR] Groovy:unexpected token: f_name @ line 74, column 13.
[ERROR]
[ERROR] <https://builds.apache.org/job/Bigtop-trunk-testartifacts/ws/bigtop-tests/test-artifacts/mahout/src/main/groovy/org/apache/bigtop/itest/mahout/smoke/TestMahoutExamples.groovy>:[75,1] 2. ERROR in <https://builds.apache.org/job/Bigtop-trunk-testartifacts/ws/bigtop-tests/test-artifacts/mahout/src/main/groovy/org/apache/bigtop/itest/mahout/smoke/TestMahoutExamples.groovy> (at line 75)
[ERROR] sh.exec("if [ ! -f ${download_dir}/${f_name} ]; then " +
[ERROR] ^
[ERROR] Groovy:unexpected token: sh @ line 75, column 13.
[ERROR]
[ERROR] <https://builds.apache.org/job/Bigtop-trunk-testartifacts/ws/bigtop-tests/test-artifacts/mahout/src/main/groovy/org/apache/bigtop/itest/mahout/smoke/TestMahoutExamples.groovy>:[80,1] 3. ERROR in <https://builds.apache.org/job/Bigtop-trunk-testartifacts/ws/bigtop-tests/test-artifacts/mahout/src/main/groovy/org/apache/bigtop/itest/mahout/smoke/TestMahoutExamples.groovy> (at line 80)
[ERROR] assertTrue("file "+ f_name + " at "+loc + " len=" + file.length() + " is > 5k bytes", file.length() > 5000 );
[ERROR] ^
[ERROR] Groovy:unexpected token: assertTrue @ line 80, column 13.
[ERROR]
[ERROR] <https://builds.apache.org/job/Bigtop-trunk-testartifacts/ws/bigtop-tests/test-artifacts/mahout/src/main/groovy/org/apache/bigtop/itest/mahout/smoke/TestMahoutExamples.groovy>:[83,1] 4. ERROR in <https://builds.apache.org/job/Bigtop-trunk-testartifacts/ws/bigtop-tests/test-artifacts/mahout/src/main/groovy/org/apache/bigtop/itest/mahout/smoke/TestMahoutExamples.groovy> (at line 83)
[ERROR] }
[ERROR] ^
[ERROR] Groovy:unexpected token: } @ line 83, column 5.
[ERROR]
[ERROR] Found 4 errors and 0 warnings.
[ERROR] -> [Help 1]
[ERROR]
[ERROR] To see the full stack trace of the errors, re-run Maven with the -e switch.
[ERROR] Re-run Maven using the -X switch to enable full debug logging.
[ERROR]
[ERROR] For more information about the errors and possible solutions, please read the following articles:
[ERROR] [Help 1] http://cwiki.apache.org/confluence/display/MAVEN/MojoFailureException
[ERROR]
[ERROR] After correcting the problems, you can resume the build with the command
[ERROR] mvn <goals> -rf :mahout-smoke
[JENKINS] Archiving <https://builds.apache.org/job/Bigtop-trunk-testartifacts/ws/bigtop-tests/test-artifacts/pom.xml> to org.apache.bigtop.itest/bigtop-smokes/0.9.0-SNAPSHOT/bigtop-smokes-0.9.0-SNAPSHOT.pom
Sending artifact delta relative to Bigtop-trunk-testartifacts » bigtop-smokes #1595
Archived 1 artifacts
Archive block size is 32768
Received 0 blocks and 4894 bytes
Compression is 0.0%
Took 70 ms
[JENKINS] Archiving <https://builds.apache.org/job/Bigtop-trunk-testartifacts/ws/bigtop-tests/test-artifacts/sqoop/pom.xml> to org.apache.bigtop.itest/sqoop-smoke/0.9.0-SNAPSHOT/sqoop-smoke-0.9.0-SNAPSHOT.pom
[JENKINS] Archiving <https://builds.apache.org/job/Bigtop-trunk-testartifacts/ws/bigtop-tests/test-artifacts/sqoop/target/sqoop-smoke-0.9.0-SNAPSHOT.jar> to org.apache.bigtop.itest/sqoop-smoke/0.9.0-20150119.190209-73/sqoop-smoke-0.9.0-20150119.190209-73.jar
Sending artifact delta relative to Bigtop-trunk-testartifacts » sqoopsmokes #1595
Archived 2 artifacts
Archive block size is 32768
Received 0 blocks and 50622 bytes
Compression is 0.0%
Took 0.13 sec
[JENKINS] Archiving <https://builds.apache.org/job/Bigtop-trunk-testartifacts/ws/bigtop-tests/test-artifacts/hue/pom.xml> to org.apache.bigtop.itest/hue-smoke/0.9.0-SNAPSHOT/hue-smoke-0.9.0-SNAPSHOT.pom
Sending artifact delta relative to Bigtop-trunk-testartifacts » huesmoke #1587
Archived 1 artifacts
Archive block size is 32768
Received 0 blocks and 1510 bytes
Compression is 0.0%
Took 0.1 sec
[JENKINS] Archiving <https://builds.apache.org/job/Bigtop-trunk-testartifacts/ws/bigtop-tests/test-artifacts/crunch/pom.xml> to org.apache.bigtop.itest/crunch-smoke/0.9.0-SNAPSHOT/crunch-smoke-0.9.0-SNAPSHOT.pom
Sending artifact delta relative to Bigtop-trunk-testartifacts » crunchsmoke #1587
Archived 1 artifacts
Archive block size is 32768
Received 0 blocks and 1521 bytes
Compression is 0.0%
Took 0.16 sec
[JENKINS] Archiving <https://builds.apache.org/job/Bigtop-trunk-testartifacts/ws/bigtop-tests/test-artifacts/package/pom.xml> to org.apache.bigtop.itest/package-smoke/0.9.0-SNAPSHOT/package-smoke-0.9.0-SNAPSHOT.pom
[JENKINS] Archiving <https://builds.apache.org/job/Bigtop-trunk-testartifacts/ws/bigtop-tests/test-artifacts/package/target/package-smoke-0.9.0-SNAPSHOT.jar> to org.apache.bigtop.itest/package-smoke/0.9.0-20150119.190156-73/package-smoke-0.9.0-20150119.190156-73.jar
Sending artifact delta relative to Bigtop-trunk-testartifacts » packagesmoke #1595
Archived 2 artifacts
Archive block size is 32768
Received 2 blocks and 745486 bytes
Compression is 8.1%
Took 0.35 sec
[JENKINS] Archiving <https://builds.apache.org/job/Bigtop-trunk-testartifacts/ws/bigtop-tests/test-artifacts/flume/pom.xml> to org.apache.bigtop.itest/flume-smoke/0.9.0-SNAPSHOT/flume-smoke-0.9.0-SNAPSHOT.pom
[JENKINS] Archiving <https://builds.apache.org/job/Bigtop-trunk-testartifacts/ws/bigtop-tests/test-artifacts/flume/target/flume-smoke-0.9.0-SNAPSHOT.jar> to org.apache.bigtop.itest/flume-smoke/0.9.0-20150119.190206-73/flume-smoke-0.9.0-20150119.190206-73.jar
Sending artifact delta relative to Bigtop-trunk-testartifacts » flumesmoke #1595
Archived 2 artifacts
Archive block size is 32768
Received 0 blocks and 42421 bytes
Compression is 0.0%
Took 0.12 sec
[JENKINS] Archiving <https://builds.apache.org/job/Bigtop-trunk-testartifacts/ws/bigtop-tests/test-artifacts/httpfs/pom.xml> to org.apache.bigtop.itest/httpfs-smoke/0.9.0-SNAPSHOT/httpfs-smoke-0.9.0-SNAPSHOT.pom
[JENKINS] Archiving <https://builds.apache.org/job/Bigtop-trunk-testartifacts/ws/bigtop-tests/test-artifacts/httpfs/target/httpfs-smoke-0.9.0-SNAPSHOT.jar> to org.apache.bigtop.itest/httpfs-smoke/0.9.0-20150119.190157-73/httpfs-smoke-0.9.0-20150119.190157-73.jar
Sending artifact delta relative to Bigtop-trunk-testartifacts » httpfssmokes #1595
Archived 2 artifacts
Archive block size is 32768
Received 0 blocks and 17687 bytes
Compression is 0.0%
Took 58 ms
[JENKINS] Archiving <https://builds.apache.org/job/Bigtop-trunk-testartifacts/ws/bigtop-tests/test-artifacts/spark/pom.xml> to org.apache.bigtop.itest/spark-smoke/0.9.0-SNAPSHOT/spark-smoke-0.9.0-SNAPSHOT.pom
Sending artifact delta relative to Bigtop-trunk-testartifacts » sparksmoke #1587
Archived 1 artifacts
Archive block size is 32768
Received 0 blocks and 2266 bytes
Compression is 0.0%
Took 57 ms
[JENKINS] Archiving <https://builds.apache.org/job/Bigtop-trunk-testartifacts/ws/bigtop-tests/test-artifacts/hadoop/pom.xml> to org.apache.bigtop.itest/hadoop-smoke/0.9.0-SNAPSHOT/hadoop-smoke-0.9.0-SNAPSHOT.pom
[JENKINS] Archiving <https://builds.apache.org/job/Bigtop-trunk-testartifacts/ws/bigtop-tests/test-artifacts/hadoop/target/hadoop-smoke-0.9.0-SNAPSHOT.jar> to org.apache.bigtop.itest/hadoop-smoke/0.9.0-20150119.190149-73/hadoop-smoke-0.9.0-20150119.190149-73.jar
Sending artifact delta relative to Bigtop-trunk-testartifacts » hadoopsmoke #1595
Archived 2 artifacts
Archive block size is 32768
Received 2 blocks and 265982 bytes
Compression is 19.8%
Took 0.19 sec
[JENKINS] Archiving <https://builds.apache.org/job/Bigtop-trunk-testartifacts/ws/bigtop-tests/test-artifacts/oozie/pom.xml> to org.apache.bigtop.itest/oozie-smoke/0.9.0-SNAPSHOT/oozie-smoke-0.9.0-SNAPSHOT.pom
[JENKINS] Archiving <https://builds.apache.org/job/Bigtop-trunk-testartifacts/ws/bigtop-tests/test-artifacts/oozie/target/oozie-smoke-0.9.0-SNAPSHOT.jar> to org.apache.bigtop.itest/oozie-smoke/0.9.0-20150119.190200-73/oozie-smoke-0.9.0-20150119.190200-73.jar
Sending artifact delta relative to Bigtop-trunk-testartifacts » ooziesmoke #1595
Archived 2 artifacts
Archive block size is 32768
Received 0 blocks and 16596 bytes
Compression is 0.0%
Took 0.1 sec
[JENKINS] Archiving <https://builds.apache.org/job/Bigtop-trunk-testartifacts/ws/bigtop-tests/test-artifacts/giraph/pom.xml> to org.apache.bigtop.itest/giraph-smoke/0.9.0-SNAPSHOT/giraph-smoke-0.9.0-SNAPSHOT.pom
Sending artifact delta relative to Bigtop-trunk-testartifacts » giraphsmoke #1587
Archived 1 artifacts
Archive block size is 32768
Received 0 blocks and 1522 bytes
Compression is 0.0%
Took 0.15 sec
[JENKINS] Archiving <https://builds.apache.org/job/Bigtop-trunk-testartifacts/ws/bigtop-tests/test-artifacts/hcatalog/pom.xml> to org.apache.bigtop.itest/hcatalog-smoke/0.9.0-SNAPSHOT/hcatalog-smoke-0.9.0-SNAPSHOT.pom
Sending artifact delta relative to Bigtop-trunk-testartifacts » hcatalogsmoke #1587
Archived 1 artifacts
Archive block size is 32768
Received 0 blocks and 1529 bytes
Compression is 0.0%
Took 65 ms
[JENKINS] Archiving <https://builds.apache.org/job/Bigtop-trunk-testartifacts/ws/bigtop-tests/test-artifacts/datafu/pom.xml> to org.apache.bigtop.itest/datafu-smoke/0.9.0-SNAPSHOT/datafu-smoke-0.9.0-SNAPSHOT.pom
Sending artifact delta relative to Bigtop-trunk-testartifacts » datafusmoke #1587
Archived 1 artifacts
Archive block size is 32768
Received 0 blocks and 2405 bytes
Compression is 0.0%
Took 44 ms
[JENKINS] Archiving <https://builds.apache.org/job/Bigtop-trunk-testartifacts/ws/bigtop-tests/test-artifacts/longevity/pom.xml> to org.apache.bigtop.itest/io-longevity/0.9.0-SNAPSHOT/io-longevity-0.9.0-SNAPSHOT.pom
Sending artifact delta relative to Bigtop-trunk-testartifacts » io-longevity #1587
Archived 1 artifacts
Archive block size is 32768
Received 0 blocks and 1699 bytes
Compression is 0.0%
Took 31 ms
[JENKINS] Archiving <https://builds.apache.org/job/Bigtop-trunk-testartifacts/ws/bigtop-tests/test-artifacts/mahout/pom.xml> to org.apache.bigtop.itest/mahout-smoke/0.9.0-SNAPSHOT/mahout-smoke-0.9.0-SNAPSHOT.pom
Sending artifact delta relative to Bigtop-trunk-testartifacts » mahoutsmoke #1587
Archived 1 artifacts
Archive block size is 32768
Received 0 blocks and 1522 bytes
Compression is 0.0%
Took 29 ms
[JENKINS] Archiving <https://builds.apache.org/job/Bigtop-trunk-testartifacts/ws/bigtop-tests/test-artifacts/hbase/pom.xml> to org.apache.bigtop.itest/hbase-smoke/0.9.0-SNAPSHOT/hbase-smoke-0.9.0-SNAPSHOT.pom
[JENKINS] Archiving <https://builds.apache.org/job/Bigtop-trunk-testartifacts/ws/bigtop-tests/test-artifacts/hbase/target/hbase-smoke-0.9.0-SNAPSHOT.jar> to org.apache.bigtop.itest/hbase-smoke/0.9.0-20150119.190204-73/hbase-smoke-0.9.0-20150119.190204-73.jar
Sending artifact delta relative to Bigtop-trunk-testartifacts » hbasesmoke #1595
Archived 2 artifacts
Archive block size is 32768
Received 1 blocks and 152011 bytes
Compression is 17.7%
Took 0.11 sec
[JENKINS] Archiving <https://builds.apache.org/job/Bigtop-trunk-testartifacts/ws/bigtop-tests/test-artifacts/solr/pom.xml> to org.apache.bigtop.itest/solr-smoke/0.9.0-SNAPSHOT/solr-smoke-0.9.0-SNAPSHOT.pom
Sending artifact delta relative to Bigtop-trunk-testartifacts » solrsmoke #1587
Archived 1 artifacts
Archive block size is 32768
Received 0 blocks and 1784 bytes
Compression is 0.0%
Took 55 ms
[JENKINS] Archiving <https://builds.apache.org/job/Bigtop-trunk-testartifacts/ws/bigtop-tests/test-artifacts/phoenix/pom.xml> to org.apache.bigtop.itest/phoenix-smoke/0.9.0-SNAPSHOT/phoenix-smoke-0.9.0-SNAPSHOT.pom
Sending artifact delta relative to Bigtop-trunk-testartifacts » phoenixsmoke #1587
Archived 1 artifacts
Archive block size is 32768
Received 0 blocks and 1526 bytes
Compression is 0.0%
Took 29 ms
[JENKINS] Archiving <https://builds.apache.org/job/Bigtop-trunk-testartifacts/ws/bigtop-tests/test-artifacts/fatjar/pom.xml> to org.apache.bigtop.itest/fat-smoke/0.9.0-SNAPSHOT/fat-smoke-0.9.0-SNAPSHOT.pom
Sending artifact delta relative to Bigtop-trunk-testartifacts » fatjar #1587
Archived 1 artifacts
Archive block size is 32768
Received 0 blocks and 5446 bytes
Compression is 0.0%
Took 1.9 sec
Sending e-mails to: ci@bigtop.apache.org
channel stopped
Build failed in Jenkins: Bigtop-trunk-testartifacts #1595
Posted by Apache Jenkins Server <je...@builds.apache.org>.
See <https://builds.apache.org/job/Bigtop-trunk-testartifacts/1595/changes>
Changes:
[cos] BIGTOP-XXXX Update GridGain version to 6.5.6
------------------------------------------
[...truncated 691 lines...]
[INFO]
[INFO] --- maven-remote-resources-plugin:1.1:process (default) @ mahout-smoke ---
[INFO]
[INFO] --- maven-resources-plugin:2.4.3:resources (default-resources) @ mahout-smoke ---
[INFO] Using 'UTF-8' encoding to copy filtered resources.
[INFO] skip non existing resourceDirectory <https://builds.apache.org/job/Bigtop-trunk-testartifacts/ws/bigtop-tests/test-artifacts/mahout/src/main/resources>
[INFO] Copying 3 resources
[INFO]
[INFO] --- maven-compiler-plugin:3.1:compile (default-compile) @ mahout-smoke ---
[INFO] Changes detected - recompiling the module!
[INFO] Using Groovy-Eclipse compiler to compile both Java and Groovy files
org.codehaus.groovy.control.messages.SyntaxErrorMessage@85b49e
org.codehaus.groovy.control.messages.SyntaxErrorMessage@150c02
org.codehaus.groovy.control.messages.SyntaxErrorMessage@1c7730b
org.codehaus.groovy.control.messages.SyntaxErrorMessage@151e779
<https://builds.apache.org/job/Bigtop-trunk-testartifacts/ws/bigtop-tests/test-artifacts/mahout/src/main/groovy/org/apache/bigtop/itest/mahout/smoke/TestMahoutExamples.groovy>: 74 Groovy:unexpected token: f_name @ line 74, column 13.
<https://builds.apache.org/job/Bigtop-trunk-testartifacts/ws/bigtop-tests/test-artifacts/mahout/src/main/groovy/org/apache/bigtop/itest/mahout/smoke/TestMahoutExamples.groovy>: 75 Groovy:unexpected token: sh @ line 75, column 13.
<https://builds.apache.org/job/Bigtop-trunk-testartifacts/ws/bigtop-tests/test-artifacts/mahout/src/main/groovy/org/apache/bigtop/itest/mahout/smoke/TestMahoutExamples.groovy>: 80 Groovy:unexpected token: assertTrue @ line 80, column 13.
<https://builds.apache.org/job/Bigtop-trunk-testartifacts/ws/bigtop-tests/test-artifacts/mahout/src/main/groovy/org/apache/bigtop/itest/mahout/smoke/TestMahoutExamples.groovy>: 83 Groovy:unexpected token: } @ line 83, column 5.
[INFO] -------------------------------------------------------------
[ERROR] COMPILATION ERROR :
[INFO] -------------------------------------------------------------
[ERROR] <https://builds.apache.org/job/Bigtop-trunk-testartifacts/ws/bigtop-tests/test-artifacts/mahout/src/main/groovy/org/apache/bigtop/itest/mahout/smoke/TestMahoutExamples.groovy>:[74,1] 1. ERROR in <https://builds.apache.org/job/Bigtop-trunk-testartifacts/ws/bigtop-tests/test-artifacts/mahout/src/main/groovy/org/apache/bigtop/itest/mahout/smoke/TestMahoutExamples.groovy> (at line 74)
f_name,loc ->
^
Groovy:unexpected token: f_name @ line 74, column 13.
[ERROR] <https://builds.apache.org/job/Bigtop-trunk-testartifacts/ws/bigtop-tests/test-artifacts/mahout/src/main/groovy/org/apache/bigtop/itest/mahout/smoke/TestMahoutExamples.groovy>:[75,1] 2. ERROR in <https://builds.apache.org/job/Bigtop-trunk-testartifacts/ws/bigtop-tests/test-artifacts/mahout/src/main/groovy/org/apache/bigtop/itest/mahout/smoke/TestMahoutExamples.groovy> (at line 75)
sh.exec("if [ ! -f ${download_dir}/${f_name} ]; then " +
^
Groovy:unexpected token: sh @ line 75, column 13.
[ERROR] <https://builds.apache.org/job/Bigtop-trunk-testartifacts/ws/bigtop-tests/test-artifacts/mahout/src/main/groovy/org/apache/bigtop/itest/mahout/smoke/TestMahoutExamples.groovy>:[80,1] 3. ERROR in <https://builds.apache.org/job/Bigtop-trunk-testartifacts/ws/bigtop-tests/test-artifacts/mahout/src/main/groovy/org/apache/bigtop/itest/mahout/smoke/TestMahoutExamples.groovy> (at line 80)
assertTrue("file "+ f_name + " at "+loc + " len=" + file.length() + " is > 5k bytes", file.length() > 5000 );
^
Groovy:unexpected token: assertTrue @ line 80, column 13.
[ERROR] <https://builds.apache.org/job/Bigtop-trunk-testartifacts/ws/bigtop-tests/test-artifacts/mahout/src/main/groovy/org/apache/bigtop/itest/mahout/smoke/TestMahoutExamples.groovy>:[83,1] 4. ERROR in <https://builds.apache.org/job/Bigtop-trunk-testartifacts/ws/bigtop-tests/test-artifacts/mahout/src/main/groovy/org/apache/bigtop/itest/mahout/smoke/TestMahoutExamples.groovy> (at line 83)
}
^
Groovy:unexpected token: } @ line 83, column 5.
[ERROR] Found 4 errors and 0 warnings.
[INFO] 5 errors
[INFO] -------------------------------------------------------------
[INFO] ------------------------------------------------------------------------
[INFO] Reactor Summary:
[INFO]
[INFO] bigtop-smokes ..................................... SUCCESS [7.311s]
[INFO] hadoopsmoke ....................................... SUCCESS [8.651s]
[INFO] packagesmoke ...................................... SUCCESS [7.308s]
[INFO] httpfssmokes ...................................... SUCCESS [2.122s]
[INFO] ooziesmoke ........................................ SUCCESS [3.364s]
[INFO] hbasesmoke ........................................ SUCCESS [12.892s]
[INFO] flumesmoke ........................................ SUCCESS [2.063s]
[INFO] sqoopsmokes ....................................... SUCCESS [3.884s]
[INFO] mahoutsmoke ....................................... FAILURE [0.367s]
[INFO] giraphsmoke ....................................... SKIPPED
[INFO] huesmoke .......................................... SKIPPED
[INFO] solrsmoke ......................................... SKIPPED
[INFO] crunchsmoke ....................................... SKIPPED
[INFO] datafusmoke ....................................... SKIPPED
[INFO] io-longevity ...................................... SKIPPED
[INFO] hcatalogsmoke ..................................... SKIPPED
[INFO] sparksmoke ........................................ SKIPPED
[INFO] phoenixsmoke ...................................... SKIPPED
[INFO] fatjar ............................................ SKIPPED
[INFO] ------------------------------------------------------------------------
[INFO] BUILD FAILURE
[INFO] ------------------------------------------------------------------------
[INFO] Total time: 55.894s
[INFO] Finished at: Mon Jan 19 18:47:16 UTC 2015
[INFO] Final Memory: 32M/354M
[INFO] ------------------------------------------------------------------------
Waiting for Jenkins to finish collecting data
[ERROR] Failed to execute goal org.apache.maven.plugins:maven-compiler-plugin:3.1:compile (default-compile) on project mahout-smoke: Compilation failure: Compilation failure:
[ERROR] <https://builds.apache.org/job/Bigtop-trunk-testartifacts/ws/bigtop-tests/test-artifacts/mahout/src/main/groovy/org/apache/bigtop/itest/mahout/smoke/TestMahoutExamples.groovy>:[74,1] 1. ERROR in <https://builds.apache.org/job/Bigtop-trunk-testartifacts/ws/bigtop-tests/test-artifacts/mahout/src/main/groovy/org/apache/bigtop/itest/mahout/smoke/TestMahoutExamples.groovy> (at line 74)
[ERROR] f_name,loc ->
[ERROR] ^
[ERROR] Groovy:unexpected token: f_name @ line 74, column 13.
[ERROR]
[ERROR] <https://builds.apache.org/job/Bigtop-trunk-testartifacts/ws/bigtop-tests/test-artifacts/mahout/src/main/groovy/org/apache/bigtop/itest/mahout/smoke/TestMahoutExamples.groovy>:[75,1] 2. ERROR in <https://builds.apache.org/job/Bigtop-trunk-testartifacts/ws/bigtop-tests/test-artifacts/mahout/src/main/groovy/org/apache/bigtop/itest/mahout/smoke/TestMahoutExamples.groovy> (at line 75)
[ERROR] sh.exec("if [ ! -f ${download_dir}/${f_name} ]; then " +
[ERROR] ^
[ERROR] Groovy:unexpected token: sh @ line 75, column 13.
[ERROR]
[ERROR] <https://builds.apache.org/job/Bigtop-trunk-testartifacts/ws/bigtop-tests/test-artifacts/mahout/src/main/groovy/org/apache/bigtop/itest/mahout/smoke/TestMahoutExamples.groovy>:[80,1] 3. ERROR in <https://builds.apache.org/job/Bigtop-trunk-testartifacts/ws/bigtop-tests/test-artifacts/mahout/src/main/groovy/org/apache/bigtop/itest/mahout/smoke/TestMahoutExamples.groovy> (at line 80)
[ERROR] assertTrue("file "+ f_name + " at "+loc + " len=" + file.length() + " is > 5k bytes", file.length() > 5000 );
[ERROR] ^
[ERROR] Groovy:unexpected token: assertTrue @ line 80, column 13.
[ERROR]
[ERROR] <https://builds.apache.org/job/Bigtop-trunk-testartifacts/ws/bigtop-tests/test-artifacts/mahout/src/main/groovy/org/apache/bigtop/itest/mahout/smoke/TestMahoutExamples.groovy>:[83,1] 4. ERROR in <https://builds.apache.org/job/Bigtop-trunk-testartifacts/ws/bigtop-tests/test-artifacts/mahout/src/main/groovy/org/apache/bigtop/itest/mahout/smoke/TestMahoutExamples.groovy> (at line 83)
[ERROR] }
[ERROR] ^
[ERROR] Groovy:unexpected token: } @ line 83, column 5.
[ERROR]
[ERROR] Found 4 errors and 0 warnings.
[ERROR] -> [Help 1]
[ERROR]
[ERROR] To see the full stack trace of the errors, re-run Maven with the -e switch.
[ERROR] Re-run Maven using the -X switch to enable full debug logging.
[ERROR]
[ERROR] For more information about the errors and possible solutions, please read the following articles:
[ERROR] [Help 1] http://cwiki.apache.org/confluence/display/MAVEN/MojoFailureException
[ERROR]
[ERROR] After correcting the problems, you can resume the build with the command
[ERROR] mvn <goals> -rf :mahout-smoke
[JENKINS] Archiving <https://builds.apache.org/job/Bigtop-trunk-testartifacts/ws/bigtop-tests/test-artifacts/pom.xml> to org.apache.bigtop.itest/bigtop-smokes/0.9.0-SNAPSHOT/bigtop-smokes-0.9.0-SNAPSHOT.pom
Sending artifact delta relative to Bigtop-trunk-testartifacts » bigtop-smokes #1594
Archived 1 artifacts
Archive block size is 32768
Received 0 blocks and 4894 bytes
Compression is 0.0%
Took 0.11 sec
[JENKINS] Archiving <https://builds.apache.org/job/Bigtop-trunk-testartifacts/ws/bigtop-tests/test-artifacts/sqoop/pom.xml> to org.apache.bigtop.itest/sqoop-smoke/0.9.0-SNAPSHOT/sqoop-smoke-0.9.0-SNAPSHOT.pom
[JENKINS] Archiving <https://builds.apache.org/job/Bigtop-trunk-testartifacts/ws/bigtop-tests/test-artifacts/sqoop/target/sqoop-smoke-0.9.0-SNAPSHOT.jar> to org.apache.bigtop.itest/sqoop-smoke/0.9.0-20150119.184715-72/sqoop-smoke-0.9.0-20150119.184715-72.jar
Sending artifact delta relative to Bigtop-trunk-testartifacts » sqoopsmokes #1594
Archived 2 artifacts
Archive block size is 32768
Received 0 blocks and 50623 bytes
Compression is 0.0%
Took 0.16 sec
[JENKINS] Archiving <https://builds.apache.org/job/Bigtop-trunk-testartifacts/ws/bigtop-tests/test-artifacts/hue/pom.xml> to org.apache.bigtop.itest/hue-smoke/0.9.0-SNAPSHOT/hue-smoke-0.9.0-SNAPSHOT.pom
Sending artifact delta relative to Bigtop-trunk-testartifacts » huesmoke #1587
Archived 1 artifacts
Archive block size is 32768
Received 0 blocks and 1510 bytes
Compression is 0.0%
Took 95 ms
[JENKINS] Archiving <https://builds.apache.org/job/Bigtop-trunk-testartifacts/ws/bigtop-tests/test-artifacts/crunch/pom.xml> to org.apache.bigtop.itest/crunch-smoke/0.9.0-SNAPSHOT/crunch-smoke-0.9.0-SNAPSHOT.pom
Sending artifact delta relative to Bigtop-trunk-testartifacts » crunchsmoke #1587
Archived 1 artifacts
Archive block size is 32768
Received 0 blocks and 1521 bytes
Compression is 0.0%
Took 0.17 sec
[JENKINS] Archiving <https://builds.apache.org/job/Bigtop-trunk-testartifacts/ws/bigtop-tests/test-artifacts/package/pom.xml> to org.apache.bigtop.itest/package-smoke/0.9.0-SNAPSHOT/package-smoke-0.9.0-SNAPSHOT.pom
[JENKINS] Archiving <https://builds.apache.org/job/Bigtop-trunk-testartifacts/ws/bigtop-tests/test-artifacts/package/target/package-smoke-0.9.0-SNAPSHOT.jar> to org.apache.bigtop.itest/package-smoke/0.9.0-20150119.184647-72/package-smoke-0.9.0-20150119.184647-72.jar
Sending artifact delta relative to Bigtop-trunk-testartifacts » packagesmoke #1594
Archived 2 artifacts
Archive block size is 32768
Received 1 blocks and 778255 bytes
Compression is 4.0%
Took 0.5 sec
[JENKINS] Archiving <https://builds.apache.org/job/Bigtop-trunk-testartifacts/ws/bigtop-tests/test-artifacts/flume/pom.xml> to org.apache.bigtop.itest/flume-smoke/0.9.0-SNAPSHOT/flume-smoke-0.9.0-SNAPSHOT.pom
[JENKINS] Archiving <https://builds.apache.org/job/Bigtop-trunk-testartifacts/ws/bigtop-tests/test-artifacts/flume/target/flume-smoke-0.9.0-SNAPSHOT.jar> to org.apache.bigtop.itest/flume-smoke/0.9.0-20150119.184710-72/flume-smoke-0.9.0-20150119.184710-72.jar
Sending artifact delta relative to Bigtop-trunk-testartifacts » flumesmoke #1594
Archived 2 artifacts
Archive block size is 32768
Received 0 blocks and 42422 bytes
Compression is 0.0%
Took 0.16 sec
[JENKINS] Archiving <https://builds.apache.org/job/Bigtop-trunk-testartifacts/ws/bigtop-tests/test-artifacts/httpfs/pom.xml> to org.apache.bigtop.itest/httpfs-smoke/0.9.0-SNAPSHOT/httpfs-smoke-0.9.0-SNAPSHOT.pom
[JENKINS] Archiving <https://builds.apache.org/job/Bigtop-trunk-testartifacts/ws/bigtop-tests/test-artifacts/httpfs/target/httpfs-smoke-0.9.0-SNAPSHOT.jar> to org.apache.bigtop.itest/httpfs-smoke/0.9.0-20150119.184651-72/httpfs-smoke-0.9.0-20150119.184651-72.jar
Sending artifact delta relative to Bigtop-trunk-testartifacts » httpfssmokes #1594
Archived 2 artifacts
Archive block size is 32768
Received 0 blocks and 17688 bytes
Compression is 0.0%
Took 0.13 sec
[JENKINS] Archiving <https://builds.apache.org/job/Bigtop-trunk-testartifacts/ws/bigtop-tests/test-artifacts/spark/pom.xml> to org.apache.bigtop.itest/spark-smoke/0.9.0-SNAPSHOT/spark-smoke-0.9.0-SNAPSHOT.pom
Sending artifact delta relative to Bigtop-trunk-testartifacts » sparksmoke #1587
Archived 1 artifacts
Archive block size is 32768
Received 0 blocks and 2266 bytes
Compression is 0.0%
Took 61 ms
[JENKINS] Archiving <https://builds.apache.org/job/Bigtop-trunk-testartifacts/ws/bigtop-tests/test-artifacts/hadoop/pom.xml> to org.apache.bigtop.itest/hadoop-smoke/0.9.0-SNAPSHOT/hadoop-smoke-0.9.0-SNAPSHOT.pom
[JENKINS] Archiving <https://builds.apache.org/job/Bigtop-trunk-testartifacts/ws/bigtop-tests/test-artifacts/hadoop/target/hadoop-smoke-0.9.0-SNAPSHOT.jar> to org.apache.bigtop.itest/hadoop-smoke/0.9.0-20150119.184640-72/hadoop-smoke-0.9.0-20150119.184640-72.jar
Sending artifact delta relative to Bigtop-trunk-testartifacts » hadoopsmoke #1594
Archived 2 artifacts
Archive block size is 32768
Received 2 blocks and 265983 bytes
Compression is 19.8%
Took 0.21 sec
[JENKINS] Archiving <https://builds.apache.org/job/Bigtop-trunk-testartifacts/ws/bigtop-tests/test-artifacts/oozie/pom.xml> to org.apache.bigtop.itest/oozie-smoke/0.9.0-SNAPSHOT/oozie-smoke-0.9.0-SNAPSHOT.pom
[JENKINS] Archiving <https://builds.apache.org/job/Bigtop-trunk-testartifacts/ws/bigtop-tests/test-artifacts/oozie/target/oozie-smoke-0.9.0-SNAPSHOT.jar> to org.apache.bigtop.itest/oozie-smoke/0.9.0-20150119.184654-72/oozie-smoke-0.9.0-20150119.184654-72.jar
Sending artifact delta relative to Bigtop-trunk-testartifacts » ooziesmoke #1594
Archived 2 artifacts
Archive block size is 32768
Received 0 blocks and 16597 bytes
Compression is 0.0%
Took 89 ms
[JENKINS] Archiving <https://builds.apache.org/job/Bigtop-trunk-testartifacts/ws/bigtop-tests/test-artifacts/giraph/pom.xml> to org.apache.bigtop.itest/giraph-smoke/0.9.0-SNAPSHOT/giraph-smoke-0.9.0-SNAPSHOT.pom
Sending artifact delta relative to Bigtop-trunk-testartifacts » giraphsmoke #1587
Archived 1 artifacts
Archive block size is 32768
Received 0 blocks and 1522 bytes
Compression is 0.0%
Took 77 ms
[JENKINS] Archiving <https://builds.apache.org/job/Bigtop-trunk-testartifacts/ws/bigtop-tests/test-artifacts/hcatalog/pom.xml> to org.apache.bigtop.itest/hcatalog-smoke/0.9.0-SNAPSHOT/hcatalog-smoke-0.9.0-SNAPSHOT.pom
Sending artifact delta relative to Bigtop-trunk-testartifacts » hcatalogsmoke #1587
Archived 1 artifacts
Archive block size is 32768
Received 0 blocks and 1529 bytes
Compression is 0.0%
Took 66 ms
[JENKINS] Archiving <https://builds.apache.org/job/Bigtop-trunk-testartifacts/ws/bigtop-tests/test-artifacts/datafu/pom.xml> to org.apache.bigtop.itest/datafu-smoke/0.9.0-SNAPSHOT/datafu-smoke-0.9.0-SNAPSHOT.pom
Sending artifact delta relative to Bigtop-trunk-testartifacts » datafusmoke #1587
Archived 1 artifacts
Archive block size is 32768
Received 0 blocks and 2405 bytes
Compression is 0.0%
Took 60 ms
[JENKINS] Archiving <https://builds.apache.org/job/Bigtop-trunk-testartifacts/ws/bigtop-tests/test-artifacts/longevity/pom.xml> to org.apache.bigtop.itest/io-longevity/0.9.0-SNAPSHOT/io-longevity-0.9.0-SNAPSHOT.pom
Sending artifact delta relative to Bigtop-trunk-testartifacts » io-longevity #1587
Archived 1 artifacts
Archive block size is 32768
Received 0 blocks and 1699 bytes
Compression is 0.0%
Took 38 ms
[JENKINS] Archiving <https://builds.apache.org/job/Bigtop-trunk-testartifacts/ws/bigtop-tests/test-artifacts/mahout/pom.xml> to org.apache.bigtop.itest/mahout-smoke/0.9.0-SNAPSHOT/mahout-smoke-0.9.0-SNAPSHOT.pom
Sending artifact delta relative to Bigtop-trunk-testartifacts » mahoutsmoke #1587
Archived 1 artifacts
Archive block size is 32768
Received 0 blocks and 1522 bytes
Compression is 0.0%
Took 33 ms
[JENKINS] Archiving <https://builds.apache.org/job/Bigtop-trunk-testartifacts/ws/bigtop-tests/test-artifacts/hbase/pom.xml> to org.apache.bigtop.itest/hbase-smoke/0.9.0-SNAPSHOT/hbase-smoke-0.9.0-SNAPSHOT.pom
[JENKINS] Archiving <https://builds.apache.org/job/Bigtop-trunk-testartifacts/ws/bigtop-tests/test-artifacts/hbase/target/hbase-smoke-0.9.0-SNAPSHOT.jar> to org.apache.bigtop.itest/hbase-smoke/0.9.0-20150119.184708-72/hbase-smoke-0.9.0-20150119.184708-72.jar
Sending artifact delta relative to Bigtop-trunk-testartifacts » hbasesmoke #1594
Archived 2 artifacts
Archive block size is 32768
Received 1 blocks and 152012 bytes
Compression is 17.7%
Took 0.12 sec
[JENKINS] Archiving <https://builds.apache.org/job/Bigtop-trunk-testartifacts/ws/bigtop-tests/test-artifacts/solr/pom.xml> to org.apache.bigtop.itest/solr-smoke/0.9.0-SNAPSHOT/solr-smoke-0.9.0-SNAPSHOT.pom
Sending artifact delta relative to Bigtop-trunk-testartifacts » solrsmoke #1587
Archived 1 artifacts
Archive block size is 32768
Received 0 blocks and 1784 bytes
Compression is 0.0%
Took 57 ms
[JENKINS] Archiving <https://builds.apache.org/job/Bigtop-trunk-testartifacts/ws/bigtop-tests/test-artifacts/phoenix/pom.xml> to org.apache.bigtop.itest/phoenix-smoke/0.9.0-SNAPSHOT/phoenix-smoke-0.9.0-SNAPSHOT.pom
Sending artifact delta relative to Bigtop-trunk-testartifacts » phoenixsmoke #1587
Archived 1 artifacts
Archive block size is 32768
Received 0 blocks and 1526 bytes
Compression is 0.0%
Took 36 ms
[JENKINS] Archiving <https://builds.apache.org/job/Bigtop-trunk-testartifacts/ws/bigtop-tests/test-artifacts/fatjar/pom.xml> to org.apache.bigtop.itest/fat-smoke/0.9.0-SNAPSHOT/fat-smoke-0.9.0-SNAPSHOT.pom
Sending artifact delta relative to Bigtop-trunk-testartifacts » fatjar #1587
Archived 1 artifacts
Archive block size is 32768
Received 0 blocks and 5446 bytes
Compression is 0.0%
Took 2 sec
Sending e-mails to: ci@bigtop.apache.org
channel stopped
Build failed in Jenkins: Bigtop-trunk-testartifacts #1594
Posted by Apache Jenkins Server <je...@builds.apache.org>.
See <https://builds.apache.org/job/Bigtop-trunk-testartifacts/1594/changes>
Changes:
[evansye] BIGTOP-1602. Update and clean up puppet config file templates.
------------------------------------------
[...truncated 565 lines...]
[INFO]
[INFO] --- maven-remote-resources-plugin:1.1:process (default) @ mahout-smoke ---
[INFO]
[INFO] --- maven-resources-plugin:2.4.3:resources (default-resources) @ mahout-smoke ---
[INFO] Using 'UTF-8' encoding to copy filtered resources.
[INFO] skip non existing resourceDirectory <https://builds.apache.org/job/Bigtop-trunk-testartifacts/ws/bigtop-tests/test-artifacts/mahout/src/main/resources>
[INFO] Copying 3 resources
[INFO]
[INFO] --- maven-compiler-plugin:3.1:compile (default-compile) @ mahout-smoke ---
[INFO] Changes detected - recompiling the module!
[INFO] Using Groovy-Eclipse compiler to compile both Java and Groovy files
org.codehaus.groovy.control.messages.SyntaxErrorMessage@1c9b702
org.codehaus.groovy.control.messages.SyntaxErrorMessage@df7af
org.codehaus.groovy.control.messages.SyntaxErrorMessage@1003266
org.codehaus.groovy.control.messages.SyntaxErrorMessage@1ecfb5e
<https://builds.apache.org/job/Bigtop-trunk-testartifacts/ws/bigtop-tests/test-artifacts/mahout/src/main/groovy/org/apache/bigtop/itest/mahout/smoke/TestMahoutExamples.groovy>: 74 Groovy:unexpected token: f_name @ line 74, column 13.
<https://builds.apache.org/job/Bigtop-trunk-testartifacts/ws/bigtop-tests/test-artifacts/mahout/src/main/groovy/org/apache/bigtop/itest/mahout/smoke/TestMahoutExamples.groovy>: 75 Groovy:unexpected token: sh @ line 75, column 13.
<https://builds.apache.org/job/Bigtop-trunk-testartifacts/ws/bigtop-tests/test-artifacts/mahout/src/main/groovy/org/apache/bigtop/itest/mahout/smoke/TestMahoutExamples.groovy>: 80 Groovy:unexpected token: assertTrue @ line 80, column 13.
<https://builds.apache.org/job/Bigtop-trunk-testartifacts/ws/bigtop-tests/test-artifacts/mahout/src/main/groovy/org/apache/bigtop/itest/mahout/smoke/TestMahoutExamples.groovy>: 83 Groovy:unexpected token: } @ line 83, column 5.
[INFO] -------------------------------------------------------------
[ERROR] COMPILATION ERROR :
[INFO] -------------------------------------------------------------
[ERROR] <https://builds.apache.org/job/Bigtop-trunk-testartifacts/ws/bigtop-tests/test-artifacts/mahout/src/main/groovy/org/apache/bigtop/itest/mahout/smoke/TestMahoutExamples.groovy>:[74,1] 1. ERROR in <https://builds.apache.org/job/Bigtop-trunk-testartifacts/ws/bigtop-tests/test-artifacts/mahout/src/main/groovy/org/apache/bigtop/itest/mahout/smoke/TestMahoutExamples.groovy> (at line 74)
f_name,loc ->
^
Groovy:unexpected token: f_name @ line 74, column 13.
[ERROR] <https://builds.apache.org/job/Bigtop-trunk-testartifacts/ws/bigtop-tests/test-artifacts/mahout/src/main/groovy/org/apache/bigtop/itest/mahout/smoke/TestMahoutExamples.groovy>:[75,1] 2. ERROR in <https://builds.apache.org/job/Bigtop-trunk-testartifacts/ws/bigtop-tests/test-artifacts/mahout/src/main/groovy/org/apache/bigtop/itest/mahout/smoke/TestMahoutExamples.groovy> (at line 75)
sh.exec("if [ ! -f ${download_dir}/${f_name} ]; then " +
^
Groovy:unexpected token: sh @ line 75, column 13.
[ERROR] <https://builds.apache.org/job/Bigtop-trunk-testartifacts/ws/bigtop-tests/test-artifacts/mahout/src/main/groovy/org/apache/bigtop/itest/mahout/smoke/TestMahoutExamples.groovy>:[80,1] 3. ERROR in <https://builds.apache.org/job/Bigtop-trunk-testartifacts/ws/bigtop-tests/test-artifacts/mahout/src/main/groovy/org/apache/bigtop/itest/mahout/smoke/TestMahoutExamples.groovy> (at line 80)
assertTrue("file "+ f_name + " at "+loc + " len=" + file.length() + " is > 5k bytes", file.length() > 5000 );
^
Groovy:unexpected token: assertTrue @ line 80, column 13.
[ERROR] <https://builds.apache.org/job/Bigtop-trunk-testartifacts/ws/bigtop-tests/test-artifacts/mahout/src/main/groovy/org/apache/bigtop/itest/mahout/smoke/TestMahoutExamples.groovy>:[83,1] 4. ERROR in <https://builds.apache.org/job/Bigtop-trunk-testartifacts/ws/bigtop-tests/test-artifacts/mahout/src/main/groovy/org/apache/bigtop/itest/mahout/smoke/TestMahoutExamples.groovy> (at line 83)
}
^
Groovy:unexpected token: } @ line 83, column 5.
[ERROR] Found 4 errors and 0 warnings.
[INFO] 5 errors
[INFO] -------------------------------------------------------------
[INFO] ------------------------------------------------------------------------
[INFO] Reactor Summary:
[INFO]
[INFO] bigtop-smokes ..................................... SUCCESS [5.078s]
[INFO] hadoopsmoke ....................................... SUCCESS [5.740s]
[INFO] packagesmoke ...................................... SUCCESS [5.917s]
[INFO] httpfssmokes ...................................... SUCCESS [1.996s]
[INFO] ooziesmoke ........................................ SUCCESS [3.177s]
[INFO] hbasesmoke ........................................ SUCCESS [3.948s]
[INFO] flumesmoke ........................................ SUCCESS [1.925s]
[INFO] sqoopsmokes ....................................... SUCCESS [21.789s]
[INFO] mahoutsmoke ....................................... FAILURE [0.310s]
[INFO] giraphsmoke ....................................... SKIPPED
[INFO] huesmoke .......................................... SKIPPED
[INFO] solrsmoke ......................................... SKIPPED
[INFO] crunchsmoke ....................................... SKIPPED
[INFO] datafusmoke ....................................... SKIPPED
[INFO] io-longevity ...................................... SKIPPED
[INFO] hcatalogsmoke ..................................... SKIPPED
[INFO] sparksmoke ........................................ SKIPPED
[INFO] phoenixsmoke ...................................... SKIPPED
[INFO] fatjar ............................................ SKIPPED
[INFO] ------------------------------------------------------------------------
[INFO] BUILD FAILURE
[INFO] ------------------------------------------------------------------------
[INFO] Total time: 57.267s
[INFO] Finished at: Mon Jan 19 15:46:45 UTC 2015
[INFO] Final Memory: 31M/371M
[INFO] ------------------------------------------------------------------------
Waiting for Jenkins to finish collecting data
[ERROR] Failed to execute goal org.apache.maven.plugins:maven-compiler-plugin:3.1:compile (default-compile) on project mahout-smoke: Compilation failure: Compilation failure:
[ERROR] <https://builds.apache.org/job/Bigtop-trunk-testartifacts/ws/bigtop-tests/test-artifacts/mahout/src/main/groovy/org/apache/bigtop/itest/mahout/smoke/TestMahoutExamples.groovy>:[74,1] 1. ERROR in <https://builds.apache.org/job/Bigtop-trunk-testartifacts/ws/bigtop-tests/test-artifacts/mahout/src/main/groovy/org/apache/bigtop/itest/mahout/smoke/TestMahoutExamples.groovy> (at line 74)
[ERROR] f_name,loc ->
[ERROR] ^
[ERROR] Groovy:unexpected token: f_name @ line 74, column 13.
[ERROR]
[ERROR] <https://builds.apache.org/job/Bigtop-trunk-testartifacts/ws/bigtop-tests/test-artifacts/mahout/src/main/groovy/org/apache/bigtop/itest/mahout/smoke/TestMahoutExamples.groovy>:[75,1] 2. ERROR in <https://builds.apache.org/job/Bigtop-trunk-testartifacts/ws/bigtop-tests/test-artifacts/mahout/src/main/groovy/org/apache/bigtop/itest/mahout/smoke/TestMahoutExamples.groovy> (at line 75)
[ERROR] sh.exec("if [ ! -f ${download_dir}/${f_name} ]; then " +
[ERROR] ^
[ERROR] Groovy:unexpected token: sh @ line 75, column 13.
[ERROR]
[ERROR] <https://builds.apache.org/job/Bigtop-trunk-testartifacts/ws/bigtop-tests/test-artifacts/mahout/src/main/groovy/org/apache/bigtop/itest/mahout/smoke/TestMahoutExamples.groovy>:[80,1] 3. ERROR in <https://builds.apache.org/job/Bigtop-trunk-testartifacts/ws/bigtop-tests/test-artifacts/mahout/src/main/groovy/org/apache/bigtop/itest/mahout/smoke/TestMahoutExamples.groovy> (at line 80)
[ERROR] assertTrue("file "+ f_name + " at "+loc + " len=" + file.length() + " is > 5k bytes", file.length() > 5000 );
[ERROR] ^
[ERROR] Groovy:unexpected token: assertTrue @ line 80, column 13.
[ERROR]
[ERROR] <https://builds.apache.org/job/Bigtop-trunk-testartifacts/ws/bigtop-tests/test-artifacts/mahout/src/main/groovy/org/apache/bigtop/itest/mahout/smoke/TestMahoutExamples.groovy>:[83,1] 4. ERROR in <https://builds.apache.org/job/Bigtop-trunk-testartifacts/ws/bigtop-tests/test-artifacts/mahout/src/main/groovy/org/apache/bigtop/itest/mahout/smoke/TestMahoutExamples.groovy> (at line 83)
[ERROR] }
[ERROR] ^
[ERROR] Groovy:unexpected token: } @ line 83, column 5.
[ERROR]
[ERROR] Found 4 errors and 0 warnings.
[ERROR] -> [Help 1]
[ERROR]
[ERROR] To see the full stack trace of the errors, re-run Maven with the -e switch.
[ERROR] Re-run Maven using the -X switch to enable full debug logging.
[ERROR]
[ERROR] For more information about the errors and possible solutions, please read the following articles:
[ERROR] [Help 1] http://cwiki.apache.org/confluence/display/MAVEN/MojoFailureException
[ERROR]
[ERROR] After correcting the problems, you can resume the build with the command
[ERROR] mvn <goals> -rf :mahout-smoke
[JENKINS] Archiving <https://builds.apache.org/job/Bigtop-trunk-testartifacts/ws/bigtop-tests/test-artifacts/pom.xml> to org.apache.bigtop.itest/bigtop-smokes/0.9.0-SNAPSHOT/bigtop-smokes-0.9.0-SNAPSHOT.pom
Sending artifact delta relative to Bigtop-trunk-testartifacts » bigtop-smokes #1593
Archived 1 artifacts
Archive block size is 32768
Received 0 blocks and 4894 bytes
Compression is 0.0%
Took 36 ms
[JENKINS] Archiving <https://builds.apache.org/job/Bigtop-trunk-testartifacts/ws/bigtop-tests/test-artifacts/sqoop/pom.xml> to org.apache.bigtop.itest/sqoop-smoke/0.9.0-SNAPSHOT/sqoop-smoke-0.9.0-SNAPSHOT.pom
[JENKINS] Archiving <https://builds.apache.org/job/Bigtop-trunk-testartifacts/ws/bigtop-tests/test-artifacts/sqoop/target/sqoop-smoke-0.9.0-SNAPSHOT.jar> to org.apache.bigtop.itest/sqoop-smoke/0.9.0-20150119.154643-71/sqoop-smoke-0.9.0-20150119.154643-71.jar
Sending artifact delta relative to Bigtop-trunk-testartifacts » sqoopsmokes #1593
Archived 2 artifacts
Archive block size is 32768
Received 0 blocks and 50623 bytes
Compression is 0.0%
Took 65 ms
[JENKINS] Archiving <https://builds.apache.org/job/Bigtop-trunk-testartifacts/ws/bigtop-tests/test-artifacts/hue/pom.xml> to org.apache.bigtop.itest/hue-smoke/0.9.0-SNAPSHOT/hue-smoke-0.9.0-SNAPSHOT.pom
Sending artifact delta relative to Bigtop-trunk-testartifacts » huesmoke #1587
Archived 1 artifacts
Archive block size is 32768
Received 0 blocks and 1510 bytes
Compression is 0.0%
Took 0.11 sec
[JENKINS] Archiving <https://builds.apache.org/job/Bigtop-trunk-testartifacts/ws/bigtop-tests/test-artifacts/crunch/pom.xml> to org.apache.bigtop.itest/crunch-smoke/0.9.0-SNAPSHOT/crunch-smoke-0.9.0-SNAPSHOT.pom
Sending artifact delta relative to Bigtop-trunk-testartifacts » crunchsmoke #1587
Archived 1 artifacts
Archive block size is 32768
Received 0 blocks and 1521 bytes
Compression is 0.0%
Took 0.22 sec
[JENKINS] Archiving <https://builds.apache.org/job/Bigtop-trunk-testartifacts/ws/bigtop-tests/test-artifacts/package/pom.xml> to org.apache.bigtop.itest/package-smoke/0.9.0-SNAPSHOT/package-smoke-0.9.0-SNAPSHOT.pom
[JENKINS] Archiving <https://builds.apache.org/job/Bigtop-trunk-testartifacts/ws/bigtop-tests/test-artifacts/package/target/package-smoke-0.9.0-SNAPSHOT.jar> to org.apache.bigtop.itest/package-smoke/0.9.0-20150119.154608-71/package-smoke-0.9.0-20150119.154608-71.jar
Sending artifact delta relative to Bigtop-trunk-testartifacts » packagesmoke #1593
Archived 2 artifacts
Archive block size is 32768
Received 1 blocks and 778254 bytes
Compression is 4.0%
Took 0.31 sec
[JENKINS] Archiving <https://builds.apache.org/job/Bigtop-trunk-testartifacts/ws/bigtop-tests/test-artifacts/flume/pom.xml> to org.apache.bigtop.itest/flume-smoke/0.9.0-SNAPSHOT/flume-smoke-0.9.0-SNAPSHOT.pom
[JENKINS] Archiving <https://builds.apache.org/job/Bigtop-trunk-testartifacts/ws/bigtop-tests/test-artifacts/flume/target/flume-smoke-0.9.0-SNAPSHOT.jar> to org.apache.bigtop.itest/flume-smoke/0.9.0-20150119.154621-71/flume-smoke-0.9.0-20150119.154621-71.jar
Sending artifact delta relative to Bigtop-trunk-testartifacts » flumesmoke #1593
Archived 2 artifacts
Archive block size is 32768
Received 0 blocks and 42422 bytes
Compression is 0.0%
Took 54 ms
[JENKINS] Archiving <https://builds.apache.org/job/Bigtop-trunk-testartifacts/ws/bigtop-tests/test-artifacts/httpfs/pom.xml> to org.apache.bigtop.itest/httpfs-smoke/0.9.0-SNAPSHOT/httpfs-smoke-0.9.0-SNAPSHOT.pom
[JENKINS] Archiving <https://builds.apache.org/job/Bigtop-trunk-testartifacts/ws/bigtop-tests/test-artifacts/httpfs/target/httpfs-smoke-0.9.0-SNAPSHOT.jar> to org.apache.bigtop.itest/httpfs-smoke/0.9.0-20150119.154611-71/httpfs-smoke-0.9.0-20150119.154611-71.jar
Sending artifact delta relative to Bigtop-trunk-testartifacts » httpfssmokes #1593
Archived 2 artifacts
Archive block size is 32768
Received 0 blocks and 17688 bytes
Compression is 0.0%
Took 79 ms
[JENKINS] Archiving <https://builds.apache.org/job/Bigtop-trunk-testartifacts/ws/bigtop-tests/test-artifacts/spark/pom.xml> to org.apache.bigtop.itest/spark-smoke/0.9.0-SNAPSHOT/spark-smoke-0.9.0-SNAPSHOT.pom
Sending artifact delta relative to Bigtop-trunk-testartifacts » sparksmoke #1587
Archived 1 artifacts
Archive block size is 32768
Received 0 blocks and 2266 bytes
Compression is 0.0%
Took 0.1 sec
[JENKINS] Archiving <https://builds.apache.org/job/Bigtop-trunk-testartifacts/ws/bigtop-tests/test-artifacts/hadoop/pom.xml> to org.apache.bigtop.itest/hadoop-smoke/0.9.0-SNAPSHOT/hadoop-smoke-0.9.0-SNAPSHOT.pom
[JENKINS] Archiving <https://builds.apache.org/job/Bigtop-trunk-testartifacts/ws/bigtop-tests/test-artifacts/hadoop/target/hadoop-smoke-0.9.0-SNAPSHOT.jar> to org.apache.bigtop.itest/hadoop-smoke/0.9.0-20150119.154602-71/hadoop-smoke-0.9.0-20150119.154602-71.jar
Sending artifact delta relative to Bigtop-trunk-testartifacts » hadoopsmoke #1593
Archived 2 artifacts
Archive block size is 32768
Received 2 blocks and 265983 bytes
Compression is 19.8%
Took 0.13 sec
[JENKINS] Archiving <https://builds.apache.org/job/Bigtop-trunk-testartifacts/ws/bigtop-tests/test-artifacts/oozie/pom.xml> to org.apache.bigtop.itest/oozie-smoke/0.9.0-SNAPSHOT/oozie-smoke-0.9.0-SNAPSHOT.pom
[JENKINS] Archiving <https://builds.apache.org/job/Bigtop-trunk-testartifacts/ws/bigtop-tests/test-artifacts/oozie/target/oozie-smoke-0.9.0-SNAPSHOT.jar> to org.apache.bigtop.itest/oozie-smoke/0.9.0-20150119.154613-71/oozie-smoke-0.9.0-20150119.154613-71.jar
Sending artifact delta relative to Bigtop-trunk-testartifacts » ooziesmoke #1593
Archived 2 artifacts
Archive block size is 32768
Received 0 blocks and 16597 bytes
Compression is 0.0%
Took 34 ms
[JENKINS] Archiving <https://builds.apache.org/job/Bigtop-trunk-testartifacts/ws/bigtop-tests/test-artifacts/giraph/pom.xml> to org.apache.bigtop.itest/giraph-smoke/0.9.0-SNAPSHOT/giraph-smoke-0.9.0-SNAPSHOT.pom
Sending artifact delta relative to Bigtop-trunk-testartifacts » giraphsmoke #1587
Archived 1 artifacts
Archive block size is 32768
Received 0 blocks and 1522 bytes
Compression is 0.0%
Took 0.11 sec
[JENKINS] Archiving <https://builds.apache.org/job/Bigtop-trunk-testartifacts/ws/bigtop-tests/test-artifacts/hcatalog/pom.xml> to org.apache.bigtop.itest/hcatalog-smoke/0.9.0-SNAPSHOT/hcatalog-smoke-0.9.0-SNAPSHOT.pom
Sending artifact delta relative to Bigtop-trunk-testartifacts » hcatalogsmoke #1587
Archived 1 artifacts
Archive block size is 32768
Received 0 blocks and 1529 bytes
Compression is 0.0%
Took 0.11 sec
[JENKINS] Archiving <https://builds.apache.org/job/Bigtop-trunk-testartifacts/ws/bigtop-tests/test-artifacts/datafu/pom.xml> to org.apache.bigtop.itest/datafu-smoke/0.9.0-SNAPSHOT/datafu-smoke-0.9.0-SNAPSHOT.pom
Sending artifact delta relative to Bigtop-trunk-testartifacts » datafusmoke #1587
Archived 1 artifacts
Archive block size is 32768
Received 0 blocks and 2405 bytes
Compression is 0.0%
Took 51 ms
[JENKINS] Archiving <https://builds.apache.org/job/Bigtop-trunk-testartifacts/ws/bigtop-tests/test-artifacts/longevity/pom.xml> to org.apache.bigtop.itest/io-longevity/0.9.0-SNAPSHOT/io-longevity-0.9.0-SNAPSHOT.pom
Sending artifact delta relative to Bigtop-trunk-testartifacts » io-longevity #1587
Archived 1 artifacts
Archive block size is 32768
Received 0 blocks and 1699 bytes
Compression is 0.0%
Took 36 ms
[JENKINS] Archiving <https://builds.apache.org/job/Bigtop-trunk-testartifacts/ws/bigtop-tests/test-artifacts/mahout/pom.xml> to org.apache.bigtop.itest/mahout-smoke/0.9.0-SNAPSHOT/mahout-smoke-0.9.0-SNAPSHOT.pom
Sending artifact delta relative to Bigtop-trunk-testartifacts » mahoutsmoke #1587
Archived 1 artifacts
Archive block size is 32768
Received 0 blocks and 1522 bytes
Compression is 0.0%
Took 49 ms
[JENKINS] Archiving <https://builds.apache.org/job/Bigtop-trunk-testartifacts/ws/bigtop-tests/test-artifacts/hbase/pom.xml> to org.apache.bigtop.itest/hbase-smoke/0.9.0-SNAPSHOT/hbase-smoke-0.9.0-SNAPSHOT.pom
[JENKINS] Archiving <https://builds.apache.org/job/Bigtop-trunk-testartifacts/ws/bigtop-tests/test-artifacts/hbase/target/hbase-smoke-0.9.0-SNAPSHOT.jar> to org.apache.bigtop.itest/hbase-smoke/0.9.0-20150119.154619-71/hbase-smoke-0.9.0-20150119.154619-71.jar
Sending artifact delta relative to Bigtop-trunk-testartifacts » hbasesmoke #1593
Archived 2 artifacts
Archive block size is 32768
Received 1 blocks and 152012 bytes
Compression is 17.7%
Took 0.11 sec
[JENKINS] Archiving <https://builds.apache.org/job/Bigtop-trunk-testartifacts/ws/bigtop-tests/test-artifacts/solr/pom.xml> to org.apache.bigtop.itest/solr-smoke/0.9.0-SNAPSHOT/solr-smoke-0.9.0-SNAPSHOT.pom
Sending artifact delta relative to Bigtop-trunk-testartifacts » solrsmoke #1587
Archived 1 artifacts
Archive block size is 32768
Received 0 blocks and 1784 bytes
Compression is 0.0%
Took 0.11 sec
[JENKINS] Archiving <https://builds.apache.org/job/Bigtop-trunk-testartifacts/ws/bigtop-tests/test-artifacts/phoenix/pom.xml> to org.apache.bigtop.itest/phoenix-smoke/0.9.0-SNAPSHOT/phoenix-smoke-0.9.0-SNAPSHOT.pom
Sending artifact delta relative to Bigtop-trunk-testartifacts » phoenixsmoke #1587
Archived 1 artifacts
Archive block size is 32768
Received 0 blocks and 1526 bytes
Compression is 0.0%
Took 46 ms
[JENKINS] Archiving <https://builds.apache.org/job/Bigtop-trunk-testartifacts/ws/bigtop-tests/test-artifacts/fatjar/pom.xml> to org.apache.bigtop.itest/fat-smoke/0.9.0-SNAPSHOT/fat-smoke-0.9.0-SNAPSHOT.pom
Sending artifact delta relative to Bigtop-trunk-testartifacts » fatjar #1587
Archived 1 artifacts
Archive block size is 32768
Received 0 blocks and 5446 bytes
Compression is 0.0%
Took 1.7 sec
Sending e-mails to: ci@bigtop.apache.org
channel stopped
Build failed in Jenkins: Bigtop-trunk-testartifacts #1593
Posted by Apache Jenkins Server <je...@builds.apache.org>.
See <https://builds.apache.org/job/Bigtop-trunk-testartifacts/1593/changes>
Changes:
[jayunit100] BIGTOP-1604. Create MAINTAINERS.txt file.
------------------------------------------
[...truncated 565 lines...]
[INFO]
[INFO] --- maven-remote-resources-plugin:1.1:process (default) @ mahout-smoke ---
[INFO]
[INFO] --- maven-resources-plugin:2.4.3:resources (default-resources) @ mahout-smoke ---
[INFO] Using 'UTF-8' encoding to copy filtered resources.
[INFO] skip non existing resourceDirectory <https://builds.apache.org/job/Bigtop-trunk-testartifacts/ws/bigtop-tests/test-artifacts/mahout/src/main/resources>
[INFO] Copying 3 resources
[INFO]
[INFO] --- maven-compiler-plugin:3.1:compile (default-compile) @ mahout-smoke ---
[INFO] Changes detected - recompiling the module!
[INFO] Using Groovy-Eclipse compiler to compile both Java and Groovy files
org.codehaus.groovy.control.messages.SyntaxErrorMessage@10b62b5
org.codehaus.groovy.control.messages.SyntaxErrorMessage@7d7969
org.codehaus.groovy.control.messages.SyntaxErrorMessage@1addecc
org.codehaus.groovy.control.messages.SyntaxErrorMessage@1fe48de
<https://builds.apache.org/job/Bigtop-trunk-testartifacts/ws/bigtop-tests/test-artifacts/mahout/src/main/groovy/org/apache/bigtop/itest/mahout/smoke/TestMahoutExamples.groovy>: 74 Groovy:unexpected token: f_name @ line 74, column 13.
<https://builds.apache.org/job/Bigtop-trunk-testartifacts/ws/bigtop-tests/test-artifacts/mahout/src/main/groovy/org/apache/bigtop/itest/mahout/smoke/TestMahoutExamples.groovy>: 75 Groovy:unexpected token: sh @ line 75, column 13.
<https://builds.apache.org/job/Bigtop-trunk-testartifacts/ws/bigtop-tests/test-artifacts/mahout/src/main/groovy/org/apache/bigtop/itest/mahout/smoke/TestMahoutExamples.groovy>: 80 Groovy:unexpected token: assertTrue @ line 80, column 13.
<https://builds.apache.org/job/Bigtop-trunk-testartifacts/ws/bigtop-tests/test-artifacts/mahout/src/main/groovy/org/apache/bigtop/itest/mahout/smoke/TestMahoutExamples.groovy>: 83 Groovy:unexpected token: } @ line 83, column 5.
[INFO] -------------------------------------------------------------
[ERROR] COMPILATION ERROR :
[INFO] -------------------------------------------------------------
[ERROR] <https://builds.apache.org/job/Bigtop-trunk-testartifacts/ws/bigtop-tests/test-artifacts/mahout/src/main/groovy/org/apache/bigtop/itest/mahout/smoke/TestMahoutExamples.groovy>:[74,1] 1. ERROR in <https://builds.apache.org/job/Bigtop-trunk-testartifacts/ws/bigtop-tests/test-artifacts/mahout/src/main/groovy/org/apache/bigtop/itest/mahout/smoke/TestMahoutExamples.groovy> (at line 74)
f_name,loc ->
^
Groovy:unexpected token: f_name @ line 74, column 13.
[ERROR] <https://builds.apache.org/job/Bigtop-trunk-testartifacts/ws/bigtop-tests/test-artifacts/mahout/src/main/groovy/org/apache/bigtop/itest/mahout/smoke/TestMahoutExamples.groovy>:[75,1] 2. ERROR in <https://builds.apache.org/job/Bigtop-trunk-testartifacts/ws/bigtop-tests/test-artifacts/mahout/src/main/groovy/org/apache/bigtop/itest/mahout/smoke/TestMahoutExamples.groovy> (at line 75)
sh.exec("if [ ! -f ${download_dir}/${f_name} ]; then " +
^
Groovy:unexpected token: sh @ line 75, column 13.
[ERROR] <https://builds.apache.org/job/Bigtop-trunk-testartifacts/ws/bigtop-tests/test-artifacts/mahout/src/main/groovy/org/apache/bigtop/itest/mahout/smoke/TestMahoutExamples.groovy>:[80,1] 3. ERROR in <https://builds.apache.org/job/Bigtop-trunk-testartifacts/ws/bigtop-tests/test-artifacts/mahout/src/main/groovy/org/apache/bigtop/itest/mahout/smoke/TestMahoutExamples.groovy> (at line 80)
assertTrue("file "+ f_name + " at "+loc + " len=" + file.length() + " is > 5k bytes", file.length() > 5000 );
^
Groovy:unexpected token: assertTrue @ line 80, column 13.
[ERROR] <https://builds.apache.org/job/Bigtop-trunk-testartifacts/ws/bigtop-tests/test-artifacts/mahout/src/main/groovy/org/apache/bigtop/itest/mahout/smoke/TestMahoutExamples.groovy>:[83,1] 4. ERROR in <https://builds.apache.org/job/Bigtop-trunk-testartifacts/ws/bigtop-tests/test-artifacts/mahout/src/main/groovy/org/apache/bigtop/itest/mahout/smoke/TestMahoutExamples.groovy> (at line 83)
}
^
Groovy:unexpected token: } @ line 83, column 5.
[ERROR] Found 4 errors and 0 warnings.
[INFO] 5 errors
[INFO] -------------------------------------------------------------
[INFO] ------------------------------------------------------------------------
[INFO] Reactor Summary:
[INFO]
[INFO] bigtop-smokes ..................................... SUCCESS [4.341s]
[INFO] hadoopsmoke ....................................... SUCCESS [8.184s]
[INFO] packagesmoke ...................................... SUCCESS [6.314s]
[INFO] httpfssmokes ...................................... SUCCESS [2.263s]
[INFO] ooziesmoke ........................................ SUCCESS [2.151s]
[INFO] hbasesmoke ........................................ SUCCESS [5.976s]
[INFO] flumesmoke ........................................ SUCCESS [2.427s]
[INFO] sqoopsmokes ....................................... SUCCESS [2.525s]
[INFO] mahoutsmoke ....................................... FAILURE [0.329s]
[INFO] giraphsmoke ....................................... SKIPPED
[INFO] huesmoke .......................................... SKIPPED
[INFO] solrsmoke ......................................... SKIPPED
[INFO] crunchsmoke ....................................... SKIPPED
[INFO] datafusmoke ....................................... SKIPPED
[INFO] io-longevity ...................................... SKIPPED
[INFO] hcatalogsmoke ..................................... SKIPPED
[INFO] sparksmoke ........................................ SKIPPED
[INFO] phoenixsmoke ...................................... SKIPPED
[INFO] fatjar ............................................ SKIPPED
[INFO] ------------------------------------------------------------------------
[INFO] BUILD FAILURE
[INFO] ------------------------------------------------------------------------
[INFO] Total time: 1:39.368s
[INFO] Finished at: Mon Jan 19 14:47:31 UTC 2015
[INFO] Final Memory: 38M/448M
[INFO] ------------------------------------------------------------------------
Waiting for Jenkins to finish collecting data
[ERROR] Failed to execute goal org.apache.maven.plugins:maven-compiler-plugin:3.1:compile (default-compile) on project mahout-smoke: Compilation failure: Compilation failure:
[ERROR] <https://builds.apache.org/job/Bigtop-trunk-testartifacts/ws/bigtop-tests/test-artifacts/mahout/src/main/groovy/org/apache/bigtop/itest/mahout/smoke/TestMahoutExamples.groovy>:[74,1] 1. ERROR in <https://builds.apache.org/job/Bigtop-trunk-testartifacts/ws/bigtop-tests/test-artifacts/mahout/src/main/groovy/org/apache/bigtop/itest/mahout/smoke/TestMahoutExamples.groovy> (at line 74)
[ERROR] f_name,loc ->
[ERROR] ^
[ERROR] Groovy:unexpected token: f_name @ line 74, column 13.
[ERROR]
[ERROR] <https://builds.apache.org/job/Bigtop-trunk-testartifacts/ws/bigtop-tests/test-artifacts/mahout/src/main/groovy/org/apache/bigtop/itest/mahout/smoke/TestMahoutExamples.groovy>:[75,1] 2. ERROR in <https://builds.apache.org/job/Bigtop-trunk-testartifacts/ws/bigtop-tests/test-artifacts/mahout/src/main/groovy/org/apache/bigtop/itest/mahout/smoke/TestMahoutExamples.groovy> (at line 75)
[ERROR] sh.exec("if [ ! -f ${download_dir}/${f_name} ]; then " +
[ERROR] ^
[ERROR] Groovy:unexpected token: sh @ line 75, column 13.
[ERROR]
[ERROR] <https://builds.apache.org/job/Bigtop-trunk-testartifacts/ws/bigtop-tests/test-artifacts/mahout/src/main/groovy/org/apache/bigtop/itest/mahout/smoke/TestMahoutExamples.groovy>:[80,1] 3. ERROR in <https://builds.apache.org/job/Bigtop-trunk-testartifacts/ws/bigtop-tests/test-artifacts/mahout/src/main/groovy/org/apache/bigtop/itest/mahout/smoke/TestMahoutExamples.groovy> (at line 80)
[ERROR] assertTrue("file "+ f_name + " at "+loc + " len=" + file.length() + " is > 5k bytes", file.length() > 5000 );
[ERROR] ^
[ERROR] Groovy:unexpected token: assertTrue @ line 80, column 13.
[ERROR]
[ERROR] <https://builds.apache.org/job/Bigtop-trunk-testartifacts/ws/bigtop-tests/test-artifacts/mahout/src/main/groovy/org/apache/bigtop/itest/mahout/smoke/TestMahoutExamples.groovy>:[83,1] 4. ERROR in <https://builds.apache.org/job/Bigtop-trunk-testartifacts/ws/bigtop-tests/test-artifacts/mahout/src/main/groovy/org/apache/bigtop/itest/mahout/smoke/TestMahoutExamples.groovy> (at line 83)
[ERROR] }
[ERROR] ^
[ERROR] Groovy:unexpected token: } @ line 83, column 5.
[ERROR]
[ERROR] Found 4 errors and 0 warnings.
[ERROR] -> [Help 1]
[ERROR]
[ERROR] To see the full stack trace of the errors, re-run Maven with the -e switch.
[ERROR] Re-run Maven using the -X switch to enable full debug logging.
[ERROR]
[ERROR] For more information about the errors and possible solutions, please read the following articles:
[ERROR] [Help 1] http://cwiki.apache.org/confluence/display/MAVEN/MojoFailureException
[ERROR]
[ERROR] After correcting the problems, you can resume the build with the command
[ERROR] mvn <goals> -rf :mahout-smoke
[JENKINS] Archiving <https://builds.apache.org/job/Bigtop-trunk-testartifacts/ws/bigtop-tests/test-artifacts/pom.xml> to org.apache.bigtop.itest/bigtop-smokes/0.9.0-SNAPSHOT/bigtop-smokes-0.9.0-SNAPSHOT.pom
Sending artifact delta relative to Bigtop-trunk-testartifacts » bigtop-smokes #1592
Archived 1 artifacts
Archive block size is 32768
Received 0 blocks and 4894 bytes
Compression is 0.0%
Took 0.19 sec
[JENKINS] Archiving <https://builds.apache.org/job/Bigtop-trunk-testartifacts/ws/bigtop-tests/test-artifacts/sqoop/pom.xml> to org.apache.bigtop.itest/sqoop-smoke/0.9.0-SNAPSHOT/sqoop-smoke-0.9.0-SNAPSHOT.pom
[JENKINS] Archiving <https://builds.apache.org/job/Bigtop-trunk-testartifacts/ws/bigtop-tests/test-artifacts/sqoop/target/sqoop-smoke-0.9.0-SNAPSHOT.jar> to org.apache.bigtop.itest/sqoop-smoke/0.9.0-20150119.144729-70/sqoop-smoke-0.9.0-20150119.144729-70.jar
Sending artifact delta relative to Bigtop-trunk-testartifacts » sqoopsmokes #1592
Archived 2 artifacts
Archive block size is 32768
Received 0 blocks and 50623 bytes
Compression is 0.0%
Took 0.22 sec
[JENKINS] Archiving <https://builds.apache.org/job/Bigtop-trunk-testartifacts/ws/bigtop-tests/test-artifacts/hue/pom.xml> to org.apache.bigtop.itest/hue-smoke/0.9.0-SNAPSHOT/hue-smoke-0.9.0-SNAPSHOT.pom
Sending artifact delta relative to Bigtop-trunk-testartifacts » huesmoke #1587
Archived 1 artifacts
Archive block size is 32768
Received 0 blocks and 1510 bytes
Compression is 0.0%
Took 98 ms
[JENKINS] Archiving <https://builds.apache.org/job/Bigtop-trunk-testartifacts/ws/bigtop-tests/test-artifacts/crunch/pom.xml> to org.apache.bigtop.itest/crunch-smoke/0.9.0-SNAPSHOT/crunch-smoke-0.9.0-SNAPSHOT.pom
Sending artifact delta relative to Bigtop-trunk-testartifacts » crunchsmoke #1587
Archived 1 artifacts
Archive block size is 32768
Received 0 blocks and 1521 bytes
Compression is 0.0%
Took 0.1 sec
[JENKINS] Archiving <https://builds.apache.org/job/Bigtop-trunk-testartifacts/ws/bigtop-tests/test-artifacts/package/pom.xml> to org.apache.bigtop.itest/package-smoke/0.9.0-SNAPSHOT/package-smoke-0.9.0-SNAPSHOT.pom
[JENKINS] Archiving <https://builds.apache.org/job/Bigtop-trunk-testartifacts/ws/bigtop-tests/test-artifacts/package/target/package-smoke-0.9.0-SNAPSHOT.jar> to org.apache.bigtop.itest/package-smoke/0.9.0-20150119.144712-70/package-smoke-0.9.0-20150119.144712-70.jar
Sending artifact delta relative to Bigtop-trunk-testartifacts » packagesmoke #1592
Archived 2 artifacts
Archive block size is 32768
Received 1 blocks and 778254 bytes
Compression is 4.0%
Took 0.34 sec
[JENKINS] Archiving <https://builds.apache.org/job/Bigtop-trunk-testartifacts/ws/bigtop-tests/test-artifacts/flume/pom.xml> to org.apache.bigtop.itest/flume-smoke/0.9.0-SNAPSHOT/flume-smoke-0.9.0-SNAPSHOT.pom
[JENKINS] Archiving <https://builds.apache.org/job/Bigtop-trunk-testartifacts/ws/bigtop-tests/test-artifacts/flume/target/flume-smoke-0.9.0-SNAPSHOT.jar> to org.apache.bigtop.itest/flume-smoke/0.9.0-20150119.144727-70/flume-smoke-0.9.0-20150119.144727-70.jar
Sending artifact delta relative to Bigtop-trunk-testartifacts » flumesmoke #1592
Archived 2 artifacts
Archive block size is 32768
Received 0 blocks and 42423 bytes
Compression is 0.0%
Took 0.13 sec
[JENKINS] Archiving <https://builds.apache.org/job/Bigtop-trunk-testartifacts/ws/bigtop-tests/test-artifacts/httpfs/pom.xml> to org.apache.bigtop.itest/httpfs-smoke/0.9.0-SNAPSHOT/httpfs-smoke-0.9.0-SNAPSHOT.pom
[JENKINS] Archiving <https://builds.apache.org/job/Bigtop-trunk-testartifacts/ws/bigtop-tests/test-artifacts/httpfs/target/httpfs-smoke-0.9.0-SNAPSHOT.jar> to org.apache.bigtop.itest/httpfs-smoke/0.9.0-20150119.144715-70/httpfs-smoke-0.9.0-20150119.144715-70.jar
Sending artifact delta relative to Bigtop-trunk-testartifacts » httpfssmokes #1592
Archived 2 artifacts
Archive block size is 32768
Received 0 blocks and 17688 bytes
Compression is 0.0%
Took 82 ms
[JENKINS] Archiving <https://builds.apache.org/job/Bigtop-trunk-testartifacts/ws/bigtop-tests/test-artifacts/spark/pom.xml> to org.apache.bigtop.itest/spark-smoke/0.9.0-SNAPSHOT/spark-smoke-0.9.0-SNAPSHOT.pom
Sending artifact delta relative to Bigtop-trunk-testartifacts » sparksmoke #1587
Archived 1 artifacts
Archive block size is 32768
Received 0 blocks and 2266 bytes
Compression is 0.0%
Took 92 ms
[JENKINS] Archiving <https://builds.apache.org/job/Bigtop-trunk-testartifacts/ws/bigtop-tests/test-artifacts/hadoop/pom.xml> to org.apache.bigtop.itest/hadoop-smoke/0.9.0-SNAPSHOT/hadoop-smoke-0.9.0-SNAPSHOT.pom
[JENKINS] Archiving <https://builds.apache.org/job/Bigtop-trunk-testartifacts/ws/bigtop-tests/test-artifacts/hadoop/target/hadoop-smoke-0.9.0-SNAPSHOT.jar> to org.apache.bigtop.itest/hadoop-smoke/0.9.0-20150119.144705-70/hadoop-smoke-0.9.0-20150119.144705-70.jar
Sending artifact delta relative to Bigtop-trunk-testartifacts » hadoopsmoke #1592
Archived 2 artifacts
Archive block size is 32768
Received 2 blocks and 265983 bytes
Compression is 19.8%
Took 0.12 sec
[JENKINS] Archiving <https://builds.apache.org/job/Bigtop-trunk-testartifacts/ws/bigtop-tests/test-artifacts/oozie/pom.xml> to org.apache.bigtop.itest/oozie-smoke/0.9.0-SNAPSHOT/oozie-smoke-0.9.0-SNAPSHOT.pom
[JENKINS] Archiving <https://builds.apache.org/job/Bigtop-trunk-testartifacts/ws/bigtop-tests/test-artifacts/oozie/target/oozie-smoke-0.9.0-SNAPSHOT.jar> to org.apache.bigtop.itest/oozie-smoke/0.9.0-20150119.144717-70/oozie-smoke-0.9.0-20150119.144717-70.jar
Sending artifact delta relative to Bigtop-trunk-testartifacts » ooziesmoke #1592
Archived 2 artifacts
Archive block size is 32768
Received 0 blocks and 16597 bytes
Compression is 0.0%
Took 66 ms
[JENKINS] Archiving <https://builds.apache.org/job/Bigtop-trunk-testartifacts/ws/bigtop-tests/test-artifacts/giraph/pom.xml> to org.apache.bigtop.itest/giraph-smoke/0.9.0-SNAPSHOT/giraph-smoke-0.9.0-SNAPSHOT.pom
Sending artifact delta relative to Bigtop-trunk-testartifacts » giraphsmoke #1587
Archived 1 artifacts
Archive block size is 32768
Received 0 blocks and 1522 bytes
Compression is 0.0%
Took 89 ms
[JENKINS] Archiving <https://builds.apache.org/job/Bigtop-trunk-testartifacts/ws/bigtop-tests/test-artifacts/hcatalog/pom.xml> to org.apache.bigtop.itest/hcatalog-smoke/0.9.0-SNAPSHOT/hcatalog-smoke-0.9.0-SNAPSHOT.pom
Sending artifact delta relative to Bigtop-trunk-testartifacts » hcatalogsmoke #1587
Archived 1 artifacts
Archive block size is 32768
Received 0 blocks and 1529 bytes
Compression is 0.0%
Took 51 ms
[JENKINS] Archiving <https://builds.apache.org/job/Bigtop-trunk-testartifacts/ws/bigtop-tests/test-artifacts/datafu/pom.xml> to org.apache.bigtop.itest/datafu-smoke/0.9.0-SNAPSHOT/datafu-smoke-0.9.0-SNAPSHOT.pom
Sending artifact delta relative to Bigtop-trunk-testartifacts » datafusmoke #1587
Archived 1 artifacts
Archive block size is 32768
Received 0 blocks and 2405 bytes
Compression is 0.0%
Took 98 ms
[JENKINS] Archiving <https://builds.apache.org/job/Bigtop-trunk-testartifacts/ws/bigtop-tests/test-artifacts/longevity/pom.xml> to org.apache.bigtop.itest/io-longevity/0.9.0-SNAPSHOT/io-longevity-0.9.0-SNAPSHOT.pom
Sending artifact delta relative to Bigtop-trunk-testartifacts » io-longevity #1587
Archived 1 artifacts
Archive block size is 32768
Received 0 blocks and 1699 bytes
Compression is 0.0%
Took 35 ms
[JENKINS] Archiving <https://builds.apache.org/job/Bigtop-trunk-testartifacts/ws/bigtop-tests/test-artifacts/mahout/pom.xml> to org.apache.bigtop.itest/mahout-smoke/0.9.0-SNAPSHOT/mahout-smoke-0.9.0-SNAPSHOT.pom
Sending artifact delta relative to Bigtop-trunk-testartifacts » mahoutsmoke #1587
Archived 1 artifacts
Archive block size is 32768
Received 0 blocks and 1522 bytes
Compression is 0.0%
Took 35 ms
[JENKINS] Archiving <https://builds.apache.org/job/Bigtop-trunk-testartifacts/ws/bigtop-tests/test-artifacts/hbase/pom.xml> to org.apache.bigtop.itest/hbase-smoke/0.9.0-SNAPSHOT/hbase-smoke-0.9.0-SNAPSHOT.pom
[JENKINS] Archiving <https://builds.apache.org/job/Bigtop-trunk-testartifacts/ws/bigtop-tests/test-artifacts/hbase/target/hbase-smoke-0.9.0-SNAPSHOT.jar> to org.apache.bigtop.itest/hbase-smoke/0.9.0-20150119.144724-70/hbase-smoke-0.9.0-20150119.144724-70.jar
Sending artifact delta relative to Bigtop-trunk-testartifacts » hbasesmoke #1592
Archived 2 artifacts
Archive block size is 32768
Received 1 blocks and 152012 bytes
Compression is 17.7%
Took 0.11 sec
[JENKINS] Archiving <https://builds.apache.org/job/Bigtop-trunk-testartifacts/ws/bigtop-tests/test-artifacts/solr/pom.xml> to org.apache.bigtop.itest/solr-smoke/0.9.0-SNAPSHOT/solr-smoke-0.9.0-SNAPSHOT.pom
Sending artifact delta relative to Bigtop-trunk-testartifacts » solrsmoke #1587
Archived 1 artifacts
Archive block size is 32768
Received 0 blocks and 1784 bytes
Compression is 0.0%
Took 77 ms
[JENKINS] Archiving <https://builds.apache.org/job/Bigtop-trunk-testartifacts/ws/bigtop-tests/test-artifacts/phoenix/pom.xml> to org.apache.bigtop.itest/phoenix-smoke/0.9.0-SNAPSHOT/phoenix-smoke-0.9.0-SNAPSHOT.pom
Sending artifact delta relative to Bigtop-trunk-testartifacts » phoenixsmoke #1587
Archived 1 artifacts
Archive block size is 32768
Received 0 blocks and 1526 bytes
Compression is 0.0%
Took 41 ms
[JENKINS] Archiving <https://builds.apache.org/job/Bigtop-trunk-testartifacts/ws/bigtop-tests/test-artifacts/fatjar/pom.xml> to org.apache.bigtop.itest/fat-smoke/0.9.0-SNAPSHOT/fat-smoke-0.9.0-SNAPSHOT.pom
Sending artifact delta relative to Bigtop-trunk-testartifacts » fatjar #1587
Archived 1 artifacts
Archive block size is 32768
Received 0 blocks and 5446 bytes
Compression is 0.0%
Took 1.9 sec
Sending e-mails to: ci@bigtop.apache.org
channel stopped