You are viewing a plain text version of this content. The canonical link for it is here.
Posted to java-dev@axis.apache.org by Apache Hudson Server <hu...@hudson.apache.org> on 2011/02/19 13:35:35 UTC

Build failed in Hudson: Rampart » Rampart - Policy #306

See <https://hudson.apache.org/hudson/job/Rampart/org.apache.rampart$rampart-policy/306/changes>

Changes:

[veithen] Changed the trunk version number to match the new conventions.

[veithen] RAMPART-322: Applied Dan Kulp's patch to update Rampart to Neethi 3.0.0-SNAPSHOT.

------------------------------------------
[INFO] ------------------------------------------------------------------------
[INFO] Building Rampart - Policy
[INFO]    task-segment: [clean, install]
[INFO] ------------------------------------------------------------------------
[INFO] [clean:clean {execution: default-clean}]
[INFO] Deleting <https://hudson.apache.org/hudson/job/Rampart/org.apache.rampart$rampart-policy/ws/target>
[INFO] [remote-resources:process {execution: default}]
[INFO] [resources:resources {execution: default-resources}]
[INFO] Using 'UTF-8' encoding to copy filtered resources.
[INFO] Copying 1 resource
[INFO] Copying 3 resources
[INFO] [compiler:compile {execution: default-compile}]
Compiling 89 source files to <https://hudson.apache.org/hudson/job/Rampart/org.apache.rampart$rampart-policy/ws/target/classes>
[HUDSON] Archiving <https://hudson.apache.org/hudson/job/Rampart/org.apache.rampart$rampart-policy/ws/pom.xml> to /home/hudson/hudson/jobs/Rampart/modules/org.apache.rampart$rampart-policy/builds/2011-02-19_12-34-37/archive/org.apache.rampart/rampart-policy/1.7.0-SNAPSHOT/pom.xml
[INFO] ------------------------------------------------------------------------
[ERROR] BUILD FAILURE
[INFO] ------------------------------------------------------------------------
[INFO] Compilation failure

<https://hudson.apache.org/hudson/job/Rampart/org.apache.rampart$rampart-policy/ws/src/main/java/org/apache/ws/secpolicy11/builders/SymmetricBindingBuilder.java>:[36,64] type org.apache.neethi.builders.AssertionBuilder does not take parameters

<https://hudson.apache.org/hudson/job/Rampart/org.apache.rampart$rampart-policy/ws/src/main/java/org/apache/ws/secpolicy12/builders/UsernameTokenBuilder.java>:[35,61] type org.apache.neethi.builders.AssertionBuilder does not take parameters

<https://hudson.apache.org/hudson/job/Rampart/org.apache.rampart$rampart-policy/ws/src/main/java/org/apache/ws/secpolicy12/builders/SupportingTokensBuilder.java>:[39,64] type org.apache.neethi.builders.AssertionBuilder does not take parameters

<https://hudson.apache.org/hudson/job/Rampart/org.apache.rampart$rampart-policy/ws/src/main/java/org/apache/ws/secpolicy11/builders/TransportBindingBuilder.java>:[37,64] type org.apache.neethi.builders.AssertionBuilder does not take parameters

<https://hudson.apache.org/hudson/job/Rampart/org.apache.rampart$rampart-policy/ws/src/main/java/org/apache/ws/secpolicy12/builders/SignedElementsBuilder.java>:[33,62] type org.apache.neethi.builders.AssertionBuilder does not take parameters

<https://hudson.apache.org/hudson/job/Rampart/org.apache.rampart$rampart-policy/ws/src/main/java/org/apache/ws/secpolicy11/builders/SecureConversationTokenBuilder.java>:[31,71] type org.apache.neethi.builders.AssertionBuilder does not take parameters

<https://hudson.apache.org/hudson/job/Rampart/org.apache.rampart$rampart-policy/ws/src/main/java/org/apache/ws/secpolicy12/builders/AsymmetricBindingBuilder.java>:[37,65] type org.apache.neethi.builders.AssertionBuilder does not take parameters

<https://hudson.apache.org/hudson/job/Rampart/org.apache.rampart$rampart-policy/ws/src/main/java/org/apache/ws/secpolicy11/builders/SecurityContextTokenBuilder.java>:[29,68] type org.apache.neethi.builders.AssertionBuilder does not take parameters

<https://hudson.apache.org/hudson/job/Rampart/org.apache.rampart$rampart-policy/ws/src/main/java/org/apache/ws/secpolicy11/builders/Trust10Builder.java>:[28,55] type org.apache.neethi.builders.AssertionBuilder does not take parameters

<https://hudson.apache.org/hudson/job/Rampart/org.apache.rampart$rampart-policy/ws/src/main/java/org/apache/ws/secpolicy12/builders/AlgorithmSuiteBuilder.java>:[34,62] type org.apache.neethi.builders.AssertionBuilder does not take parameters

<https://hudson.apache.org/hudson/job/Rampart/org.apache.rampart$rampart-policy/ws/src/main/java/org/apache/ws/secpolicy12/builders/TransportBindingBuilder.java>:[37,64] type org.apache.neethi.builders.AssertionBuilder does not take parameters

<https://hudson.apache.org/hudson/job/Rampart/org.apache.rampart$rampart-policy/ws/src/main/java/org/apache/ws/secpolicy11/builders/X509TokenBuilder.java>:[35,57] type org.apache.neethi.builders.AssertionBuilder does not take parameters

<https://hudson.apache.org/hudson/job/Rampart/org.apache.rampart$rampart-policy/ws/src/main/java/org/apache/ws/secpolicy12/builders/RequiredPartsBuilder.java>:[33,61] type org.apache.neethi.builders.AssertionBuilder does not take parameters

<https://hudson.apache.org/hudson/job/Rampart/org.apache.rampart$rampart-policy/ws/src/main/java/org/apache/ws/secpolicy12/builders/WSS10Builder.java>:[33,53] type org.apache.neethi.builders.AssertionBuilder does not take parameters

<https://hudson.apache.org/hudson/job/Rampart/org.apache.rampart$rampart-policy/ws/src/main/java/org/apache/ws/secpolicy11/builders/SupportingTokensBuilder.java>:[39,64] type org.apache.neethi.builders.AssertionBuilder does not take parameters

<https://hudson.apache.org/hudson/job/Rampart/org.apache.rampart$rampart-policy/ws/src/main/java/org/apache/ws/secpolicy12/builders/Trust13Builder.java>:[28,55] type org.apache.neethi.builders.AssertionBuilder does not take parameters

<https://hudson.apache.org/hudson/job/Rampart/org.apache.rampart$rampart-policy/ws/src/main/java/org/apache/ws/secpolicy11/builders/AsymmetricBindingBuilder.java>:[37,65] type org.apache.neethi.builders.AssertionBuilder does not take parameters

<https://hudson.apache.org/hudson/job/Rampart/org.apache.rampart$rampart-policy/ws/src/main/java/org/apache/ws/secpolicy11/builders/InitiatorTokenBuilder.java>:[34,62] type org.apache.neethi.builders.AssertionBuilder does not take parameters

<https://hudson.apache.org/hudson/job/Rampart/org.apache.rampart$rampart-policy/ws/src/main/java/org/apache/ws/secpolicy12/builders/IssuedTokenBuilder.java>:[35,59] type org.apache.neethi.builders.AssertionBuilder does not take parameters

<https://hudson.apache.org/hudson/job/Rampart/org.apache.rampart$rampart-policy/ws/src/main/java/org/apache/ws/secpolicy12/builders/SecurityContextTokenBuilder.java>:[29,68] type org.apache.neethi.builders.AssertionBuilder does not take parameters

<https://hudson.apache.org/hudson/job/Rampart/org.apache.rampart$rampart-policy/ws/src/main/java/org/apache/ws/secpolicy11/builders/EncryptedPartsBuilder.java>:[34,62] type org.apache.neethi.builders.AssertionBuilder does not take parameters

<https://hudson.apache.org/hudson/job/Rampart/org.apache.rampart$rampart-policy/ws/src/main/java/org/apache/ws/secpolicy11/builders/RecipientTokenBuilder.java>:[34,62] type org.apache.neethi.builders.AssertionBuilder does not take parameters

<https://hudson.apache.org/hudson/job/Rampart/org.apache.rampart$rampart-policy/ws/src/main/java/org/apache/ws/secpolicy11/builders/SignedPartsBuilder.java>:[33,59] type org.apache.neethi.builders.AssertionBuilder does not take parameters

<https://hudson.apache.org/hudson/job/Rampart/org.apache.rampart$rampart-policy/ws/src/main/java/org/apache/ws/secpolicy11/builders/AlgorithmSuiteBuilder.java>:[34,62] type org.apache.neethi.builders.AssertionBuilder does not take parameters

<https://hudson.apache.org/hudson/job/Rampart/org.apache.rampart$rampart-policy/ws/src/main/java/org/apache/ws/secpolicy12/builders/ProtectionTokenBuilder.java>:[34,63] type org.apache.neethi.builders.AssertionBuilder does not take parameters

<https://hudson.apache.org/hudson/job/Rampart/org.apache.rampart$rampart-policy/ws/src/main/java/org/apache/ws/secpolicy11/builders/WSS10Builder.java>:[33,53] type org.apache.neethi.builders.AssertionBuilder does not take parameters

<https://hudson.apache.org/hudson/job/Rampart/org.apache.rampart$rampart-policy/ws/src/main/java/org/apache/ws/secpolicy12/builders/EncryptedPartsBuilder.java>:[34,62] type org.apache.neethi.builders.AssertionBuilder does not take parameters

<https://hudson.apache.org/hudson/job/Rampart/org.apache.rampart$rampart-policy/ws/src/main/java/org/apache/ws/secpolicy12/builders/TransportTokenBuilder.java>:[27,24] cannot find symbol
symbol  : class PolicyContainingAssertion
location: package org.apache.neethi

<https://hudson.apache.org/hudson/job/Rampart/org.apache.rampart$rampart-policy/ws/src/main/java/org/apache/ws/secpolicy12/builders/TransportTokenBuilder.java>:[35,62] type org.apache.neethi.builders.AssertionBuilder does not take parameters

<https://hudson.apache.org/hudson/job/Rampart/org.apache.rampart$rampart-policy/ws/src/main/java/org/apache/ws/secpolicy12/builders/WSS11Builder.java>:[33,53] type org.apache.neethi.builders.AssertionBuilder does not take parameters

<https://hudson.apache.org/hudson/job/Rampart/org.apache.rampart$rampart-policy/ws/src/main/java/org/apache/ws/secpolicy12/builders/RecipientTokenBuilder.java>:[34,62] type org.apache.neethi.builders.AssertionBuilder does not take parameters

<https://hudson.apache.org/hudson/job/Rampart/org.apache.rampart$rampart-policy/ws/src/main/java/org/apache/ws/secpolicy11/builders/SignedElementsBuilder.java>:[33,62] type org.apache.neethi.builders.AssertionBuilder does not take parameters

<https://hudson.apache.org/hudson/job/Rampart/org.apache.rampart$rampart-policy/ws/src/main/java/org/apache/ws/secpolicy11/builders/LayoutBuilder.java>:[33,54] type org.apache.neethi.builders.AssertionBuilder does not take parameters

<https://hudson.apache.org/hudson/job/Rampart/org.apache.rampart$rampart-policy/ws/src/main/java/org/apache/ws/secpolicy11/builders/ProtectionTokenBuilder.java>:[34,63] type org.apache.neethi.builders.AssertionBuilder does not take parameters

<https://hudson.apache.org/hudson/job/Rampart/org.apache.rampart$rampart-policy/ws/src/main/java/org/apache/ws/secpolicy12/builders/ContentEncryptedElementsBuilder.java>:[32,72] type org.apache.neethi.builders.AssertionBuilder does not take parameters

<https://hudson.apache.org/hudson/job/Rampart/org.apache.rampart$rampart-policy/ws/src/main/java/org/apache/ws/secpolicy12/builders/EncryptedElementsBuilder.java>:[33,65] type org.apache.neethi.builders.AssertionBuilder does not take parameters

<https://hudson.apache.org/hudson/job/Rampart/org.apache.rampart$rampart-policy/ws/src/main/java/org/apache/ws/secpolicy11/builders/EncryptedElementsBuilder.java>:[33,65] type org.apache.neethi.builders.AssertionBuilder does not take parameters

<https://hudson.apache.org/hudson/job/Rampart/org.apache.rampart$rampart-policy/ws/src/main/java/org/apache/ws/secpolicy11/builders/RequiredElementsBuilder.java>:[32,64] type org.apache.neethi.builders.AssertionBuilder does not take parameters

<https://hudson.apache.org/hudson/job/Rampart/org.apache.rampart$rampart-policy/ws/src/main/java/org/apache/ws/secpolicy11/builders/UsernameTokenBuilder.java>:[35,61] type org.apache.neethi.builders.AssertionBuilder does not take parameters

<https://hudson.apache.org/hudson/job/Rampart/org.apache.rampart$rampart-policy/ws/src/main/java/org/apache/ws/secpolicy12/builders/X509TokenBuilder.java>:[35,57] type org.apache.neethi.builders.AssertionBuilder does not take parameters

<https://hudson.apache.org/hudson/job/Rampart/org.apache.rampart$rampart-policy/ws/src/main/java/org/apache/ws/secpolicy11/builders/WSS11Builder.java>:[33,53] type org.apache.neethi.builders.AssertionBuilder does not take parameters

<https://hudson.apache.org/hudson/job/Rampart/org.apache.rampart$rampart-policy/ws/src/main/java/org/apache/ws/secpolicy12/builders/SecureConversationTokenBuilder.java>:[31,71] type org.apache.neethi.builders.AssertionBuilder does not take parameters

<https://hudson.apache.org/hudson/job/Rampart/org.apache.rampart$rampart-policy/ws/src/main/java/org/apache/ws/secpolicy12/builders/RequiredElementsBuilder.java>:[33,64] type org.apache.neethi.builders.AssertionBuilder does not take parameters

<https://hudson.apache.org/hudson/job/Rampart/org.apache.rampart$rampart-policy/ws/src/main/java/org/apache/ws/secpolicy12/builders/HttpsTokenBuilder.java>:[46,58] type org.apache.neethi.builders.AssertionBuilder does not take parameters

<https://hudson.apache.org/hudson/job/Rampart/org.apache.rampart$rampart-policy/ws/src/main/java/org/apache/ws/secpolicy11/builders/IssuedTokenBuilder.java>:[35,59] type org.apache.neethi.builders.AssertionBuilder does not take parameters

<https://hudson.apache.org/hudson/job/Rampart/org.apache.rampart$rampart-policy/ws/src/main/java/org/apache/ws/secpolicy12/builders/InitiatorTokenBuilder.java>:[34,62] type org.apache.neethi.builders.AssertionBuilder does not take parameters

<https://hudson.apache.org/hudson/job/Rampart/org.apache.rampart$rampart-policy/ws/src/main/java/org/apache/ws/secpolicy12/builders/SymmetricBindingBuilder.java>:[36,64] type org.apache.neethi.builders.AssertionBuilder does not take parameters

<https://hudson.apache.org/hudson/job/Rampart/org.apache.rampart$rampart-policy/ws/src/main/java/org/apache/ws/secpolicy12/builders/LayoutBuilder.java>:[33,54] type org.apache.neethi.builders.AssertionBuilder does not take parameters

<https://hudson.apache.org/hudson/job/Rampart/org.apache.rampart$rampart-policy/ws/src/main/java/org/apache/ws/secpolicy11/builders/TransportTokenBuilder.java>:[30,33] cannot find symbol
symbol  : class PrimitiveAssertion
location: package org.apache.neethi.builders

<https://hudson.apache.org/hudson/job/Rampart/org.apache.rampart$rampart-policy/ws/src/main/java/org/apache/ws/secpolicy11/builders/TransportTokenBuilder.java>:[36,62] type org.apache.neethi.builders.AssertionBuilder does not take parameters

<https://hudson.apache.org/hudson/job/Rampart/org.apache.rampart$rampart-policy/ws/src/main/java/org/apache/ws/secpolicy12/builders/SignedPartsBuilder.java>:[33,59] type org.apache.neethi.builders.AssertionBuilder does not take parameters

<https://hudson.apache.org/hudson/job/Rampart/org.apache.rampart$rampart-policy/ws/src/main/java/org/apache/ws/secpolicy12/builders/TransportTokenBuilder.java>:[65,33] cannot find symbol
symbol  : class PolicyContainingAssertion
location: class org.apache.ws.secpolicy12.builders.TransportTokenBuilder

<https://hudson.apache.org/hudson/job/Rampart/org.apache.rampart$rampart-policy/ws/src/main/java/org/apache/ws/secpolicy11/builders/TransportTokenBuilder.java>:[66,32] cannot find symbol
symbol  : class PrimitiveAssertion
location: class org.apache.ws.secpolicy11.builders.TransportTokenBuilder


[INFO] ------------------------------------------------------------------------
[INFO] For more information, run Maven with the -e switch
[INFO] ------------------------------------------------------------------------
[INFO] Total time: 30 seconds
[INFO] Finished at: Sat Feb 19 04:35:34 PST 2011
[INFO] Final Memory: 34M/252M
[INFO] ------------------------------------------------------------------------


---------------------------------------------------------------------
To unsubscribe, e-mail: java-dev-unsubscribe@axis.apache.org
For additional commands, e-mail: java-dev-help@axis.apache.org


Hudson build is back to normal : Rampart » Rampart - Policy #308

Posted by Apache Hudson Server <hu...@hudson.apache.org>.
See <https://hudson.apache.org/hudson/job/Rampart/org.apache.rampart$rampart-policy/308/>



---------------------------------------------------------------------
To unsubscribe, e-mail: java-dev-unsubscribe@axis.apache.org
For additional commands, e-mail: java-dev-help@axis.apache.org


Build failed in Hudson: Rampart » Rampart - Policy #307

Posted by Apache Hudson Server <hu...@hudson.apache.org>.
See <https://hudson.apache.org/hudson/job/Rampart/org.apache.rampart$rampart-policy/307/>

------------------------------------------
[INFO] ------------------------------------------------------------------------
[INFO] Building Rampart - Policy
[INFO]    task-segment: [clean, install]
[INFO] ------------------------------------------------------------------------
[INFO] [clean:clean {execution: default-clean}]
[INFO] Deleting <https://hudson.apache.org/hudson/job/Rampart/org.apache.rampart$rampart-policy/ws/target>
[INFO] [remote-resources:process {execution: default}]
[INFO] [resources:resources {execution: default-resources}]
[INFO] Using 'UTF-8' encoding to copy filtered resources.
[INFO] Copying 1 resource
[INFO] Copying 3 resources
[INFO] [compiler:compile {execution: default-compile}]
Compiling 89 source files to <https://hudson.apache.org/hudson/job/Rampart/org.apache.rampart$rampart-policy/ws/target/classes>
[HUDSON] Archiving <https://hudson.apache.org/hudson/job/Rampart/org.apache.rampart$rampart-policy/ws/pom.xml> to /home/hudson/hudson/jobs/Rampart/modules/org.apache.rampart$rampart-policy/builds/2011-02-19_15-53-46/archive/org.apache.rampart/rampart-policy/1.7.0-SNAPSHOT/pom.xml
[INFO] ------------------------------------------------------------------------
[ERROR] BUILD FAILURE
[INFO] ------------------------------------------------------------------------
[INFO] Compilation failure

<https://hudson.apache.org/hudson/job/Rampart/org.apache.rampart$rampart-policy/ws/src/main/java/org/apache/ws/secpolicy11/builders/SymmetricBindingBuilder.java>:[36,64] type org.apache.neethi.builders.AssertionBuilder does not take parameters

<https://hudson.apache.org/hudson/job/Rampart/org.apache.rampart$rampart-policy/ws/src/main/java/org/apache/ws/secpolicy12/builders/UsernameTokenBuilder.java>:[35,61] type org.apache.neethi.builders.AssertionBuilder does not take parameters

<https://hudson.apache.org/hudson/job/Rampart/org.apache.rampart$rampart-policy/ws/src/main/java/org/apache/ws/secpolicy12/builders/SupportingTokensBuilder.java>:[39,64] type org.apache.neethi.builders.AssertionBuilder does not take parameters

<https://hudson.apache.org/hudson/job/Rampart/org.apache.rampart$rampart-policy/ws/src/main/java/org/apache/ws/secpolicy11/builders/TransportBindingBuilder.java>:[37,64] type org.apache.neethi.builders.AssertionBuilder does not take parameters

<https://hudson.apache.org/hudson/job/Rampart/org.apache.rampart$rampart-policy/ws/src/main/java/org/apache/ws/secpolicy12/builders/SignedElementsBuilder.java>:[33,62] type org.apache.neethi.builders.AssertionBuilder does not take parameters

<https://hudson.apache.org/hudson/job/Rampart/org.apache.rampart$rampart-policy/ws/src/main/java/org/apache/ws/secpolicy11/builders/SecureConversationTokenBuilder.java>:[31,71] type org.apache.neethi.builders.AssertionBuilder does not take parameters

<https://hudson.apache.org/hudson/job/Rampart/org.apache.rampart$rampart-policy/ws/src/main/java/org/apache/ws/secpolicy12/builders/AsymmetricBindingBuilder.java>:[37,65] type org.apache.neethi.builders.AssertionBuilder does not take parameters

<https://hudson.apache.org/hudson/job/Rampart/org.apache.rampart$rampart-policy/ws/src/main/java/org/apache/ws/secpolicy11/builders/SecurityContextTokenBuilder.java>:[29,68] type org.apache.neethi.builders.AssertionBuilder does not take parameters

<https://hudson.apache.org/hudson/job/Rampart/org.apache.rampart$rampart-policy/ws/src/main/java/org/apache/ws/secpolicy11/builders/Trust10Builder.java>:[28,55] type org.apache.neethi.builders.AssertionBuilder does not take parameters

<https://hudson.apache.org/hudson/job/Rampart/org.apache.rampart$rampart-policy/ws/src/main/java/org/apache/ws/secpolicy12/builders/AlgorithmSuiteBuilder.java>:[34,62] type org.apache.neethi.builders.AssertionBuilder does not take parameters

<https://hudson.apache.org/hudson/job/Rampart/org.apache.rampart$rampart-policy/ws/src/main/java/org/apache/ws/secpolicy12/builders/TransportBindingBuilder.java>:[37,64] type org.apache.neethi.builders.AssertionBuilder does not take parameters

<https://hudson.apache.org/hudson/job/Rampart/org.apache.rampart$rampart-policy/ws/src/main/java/org/apache/ws/secpolicy11/builders/X509TokenBuilder.java>:[35,57] type org.apache.neethi.builders.AssertionBuilder does not take parameters

<https://hudson.apache.org/hudson/job/Rampart/org.apache.rampart$rampart-policy/ws/src/main/java/org/apache/ws/secpolicy12/builders/RequiredPartsBuilder.java>:[33,61] type org.apache.neethi.builders.AssertionBuilder does not take parameters

<https://hudson.apache.org/hudson/job/Rampart/org.apache.rampart$rampart-policy/ws/src/main/java/org/apache/ws/secpolicy12/builders/WSS10Builder.java>:[33,53] type org.apache.neethi.builders.AssertionBuilder does not take parameters

<https://hudson.apache.org/hudson/job/Rampart/org.apache.rampart$rampart-policy/ws/src/main/java/org/apache/ws/secpolicy11/builders/SupportingTokensBuilder.java>:[39,64] type org.apache.neethi.builders.AssertionBuilder does not take parameters

<https://hudson.apache.org/hudson/job/Rampart/org.apache.rampart$rampart-policy/ws/src/main/java/org/apache/ws/secpolicy12/builders/Trust13Builder.java>:[28,55] type org.apache.neethi.builders.AssertionBuilder does not take parameters

<https://hudson.apache.org/hudson/job/Rampart/org.apache.rampart$rampart-policy/ws/src/main/java/org/apache/ws/secpolicy11/builders/AsymmetricBindingBuilder.java>:[37,65] type org.apache.neethi.builders.AssertionBuilder does not take parameters

<https://hudson.apache.org/hudson/job/Rampart/org.apache.rampart$rampart-policy/ws/src/main/java/org/apache/ws/secpolicy11/builders/InitiatorTokenBuilder.java>:[34,62] type org.apache.neethi.builders.AssertionBuilder does not take parameters

<https://hudson.apache.org/hudson/job/Rampart/org.apache.rampart$rampart-policy/ws/src/main/java/org/apache/ws/secpolicy12/builders/IssuedTokenBuilder.java>:[35,59] type org.apache.neethi.builders.AssertionBuilder does not take parameters

<https://hudson.apache.org/hudson/job/Rampart/org.apache.rampart$rampart-policy/ws/src/main/java/org/apache/ws/secpolicy12/builders/SecurityContextTokenBuilder.java>:[29,68] type org.apache.neethi.builders.AssertionBuilder does not take parameters

<https://hudson.apache.org/hudson/job/Rampart/org.apache.rampart$rampart-policy/ws/src/main/java/org/apache/ws/secpolicy11/builders/EncryptedPartsBuilder.java>:[34,62] type org.apache.neethi.builders.AssertionBuilder does not take parameters

<https://hudson.apache.org/hudson/job/Rampart/org.apache.rampart$rampart-policy/ws/src/main/java/org/apache/ws/secpolicy11/builders/RecipientTokenBuilder.java>:[34,62] type org.apache.neethi.builders.AssertionBuilder does not take parameters

<https://hudson.apache.org/hudson/job/Rampart/org.apache.rampart$rampart-policy/ws/src/main/java/org/apache/ws/secpolicy11/builders/SignedPartsBuilder.java>:[33,59] type org.apache.neethi.builders.AssertionBuilder does not take parameters

<https://hudson.apache.org/hudson/job/Rampart/org.apache.rampart$rampart-policy/ws/src/main/java/org/apache/ws/secpolicy11/builders/AlgorithmSuiteBuilder.java>:[34,62] type org.apache.neethi.builders.AssertionBuilder does not take parameters

<https://hudson.apache.org/hudson/job/Rampart/org.apache.rampart$rampart-policy/ws/src/main/java/org/apache/ws/secpolicy12/builders/ProtectionTokenBuilder.java>:[34,63] type org.apache.neethi.builders.AssertionBuilder does not take parameters

<https://hudson.apache.org/hudson/job/Rampart/org.apache.rampart$rampart-policy/ws/src/main/java/org/apache/ws/secpolicy11/builders/WSS10Builder.java>:[33,53] type org.apache.neethi.builders.AssertionBuilder does not take parameters

<https://hudson.apache.org/hudson/job/Rampart/org.apache.rampart$rampart-policy/ws/src/main/java/org/apache/ws/secpolicy12/builders/EncryptedPartsBuilder.java>:[34,62] type org.apache.neethi.builders.AssertionBuilder does not take parameters

<https://hudson.apache.org/hudson/job/Rampart/org.apache.rampart$rampart-policy/ws/src/main/java/org/apache/ws/secpolicy12/builders/TransportTokenBuilder.java>:[27,24] cannot find symbol
symbol  : class PolicyContainingAssertion
location: package org.apache.neethi

<https://hudson.apache.org/hudson/job/Rampart/org.apache.rampart$rampart-policy/ws/src/main/java/org/apache/ws/secpolicy12/builders/TransportTokenBuilder.java>:[35,62] type org.apache.neethi.builders.AssertionBuilder does not take parameters

<https://hudson.apache.org/hudson/job/Rampart/org.apache.rampart$rampart-policy/ws/src/main/java/org/apache/ws/secpolicy12/builders/WSS11Builder.java>:[33,53] type org.apache.neethi.builders.AssertionBuilder does not take parameters

<https://hudson.apache.org/hudson/job/Rampart/org.apache.rampart$rampart-policy/ws/src/main/java/org/apache/ws/secpolicy12/builders/RecipientTokenBuilder.java>:[34,62] type org.apache.neethi.builders.AssertionBuilder does not take parameters

<https://hudson.apache.org/hudson/job/Rampart/org.apache.rampart$rampart-policy/ws/src/main/java/org/apache/ws/secpolicy11/builders/SignedElementsBuilder.java>:[33,62] type org.apache.neethi.builders.AssertionBuilder does not take parameters

<https://hudson.apache.org/hudson/job/Rampart/org.apache.rampart$rampart-policy/ws/src/main/java/org/apache/ws/secpolicy11/builders/LayoutBuilder.java>:[33,54] type org.apache.neethi.builders.AssertionBuilder does not take parameters

<https://hudson.apache.org/hudson/job/Rampart/org.apache.rampart$rampart-policy/ws/src/main/java/org/apache/ws/secpolicy11/builders/ProtectionTokenBuilder.java>:[34,63] type org.apache.neethi.builders.AssertionBuilder does not take parameters

<https://hudson.apache.org/hudson/job/Rampart/org.apache.rampart$rampart-policy/ws/src/main/java/org/apache/ws/secpolicy12/builders/ContentEncryptedElementsBuilder.java>:[32,72] type org.apache.neethi.builders.AssertionBuilder does not take parameters

<https://hudson.apache.org/hudson/job/Rampart/org.apache.rampart$rampart-policy/ws/src/main/java/org/apache/ws/secpolicy12/builders/EncryptedElementsBuilder.java>:[33,65] type org.apache.neethi.builders.AssertionBuilder does not take parameters

<https://hudson.apache.org/hudson/job/Rampart/org.apache.rampart$rampart-policy/ws/src/main/java/org/apache/ws/secpolicy11/builders/EncryptedElementsBuilder.java>:[33,65] type org.apache.neethi.builders.AssertionBuilder does not take parameters

<https://hudson.apache.org/hudson/job/Rampart/org.apache.rampart$rampart-policy/ws/src/main/java/org/apache/ws/secpolicy11/builders/RequiredElementsBuilder.java>:[32,64] type org.apache.neethi.builders.AssertionBuilder does not take parameters

<https://hudson.apache.org/hudson/job/Rampart/org.apache.rampart$rampart-policy/ws/src/main/java/org/apache/ws/secpolicy11/builders/UsernameTokenBuilder.java>:[35,61] type org.apache.neethi.builders.AssertionBuilder does not take parameters

<https://hudson.apache.org/hudson/job/Rampart/org.apache.rampart$rampart-policy/ws/src/main/java/org/apache/ws/secpolicy12/builders/X509TokenBuilder.java>:[35,57] type org.apache.neethi.builders.AssertionBuilder does not take parameters

<https://hudson.apache.org/hudson/job/Rampart/org.apache.rampart$rampart-policy/ws/src/main/java/org/apache/ws/secpolicy11/builders/WSS11Builder.java>:[33,53] type org.apache.neethi.builders.AssertionBuilder does not take parameters

<https://hudson.apache.org/hudson/job/Rampart/org.apache.rampart$rampart-policy/ws/src/main/java/org/apache/ws/secpolicy12/builders/SecureConversationTokenBuilder.java>:[31,71] type org.apache.neethi.builders.AssertionBuilder does not take parameters

<https://hudson.apache.org/hudson/job/Rampart/org.apache.rampart$rampart-policy/ws/src/main/java/org/apache/ws/secpolicy12/builders/RequiredElementsBuilder.java>:[33,64] type org.apache.neethi.builders.AssertionBuilder does not take parameters

<https://hudson.apache.org/hudson/job/Rampart/org.apache.rampart$rampart-policy/ws/src/main/java/org/apache/ws/secpolicy12/builders/HttpsTokenBuilder.java>:[46,58] type org.apache.neethi.builders.AssertionBuilder does not take parameters

<https://hudson.apache.org/hudson/job/Rampart/org.apache.rampart$rampart-policy/ws/src/main/java/org/apache/ws/secpolicy11/builders/IssuedTokenBuilder.java>:[35,59] type org.apache.neethi.builders.AssertionBuilder does not take parameters

<https://hudson.apache.org/hudson/job/Rampart/org.apache.rampart$rampart-policy/ws/src/main/java/org/apache/ws/secpolicy12/builders/InitiatorTokenBuilder.java>:[34,62] type org.apache.neethi.builders.AssertionBuilder does not take parameters

<https://hudson.apache.org/hudson/job/Rampart/org.apache.rampart$rampart-policy/ws/src/main/java/org/apache/ws/secpolicy12/builders/SymmetricBindingBuilder.java>:[36,64] type org.apache.neethi.builders.AssertionBuilder does not take parameters

<https://hudson.apache.org/hudson/job/Rampart/org.apache.rampart$rampart-policy/ws/src/main/java/org/apache/ws/secpolicy12/builders/LayoutBuilder.java>:[33,54] type org.apache.neethi.builders.AssertionBuilder does not take parameters

<https://hudson.apache.org/hudson/job/Rampart/org.apache.rampart$rampart-policy/ws/src/main/java/org/apache/ws/secpolicy11/builders/TransportTokenBuilder.java>:[30,33] cannot find symbol
symbol  : class PrimitiveAssertion
location: package org.apache.neethi.builders

<https://hudson.apache.org/hudson/job/Rampart/org.apache.rampart$rampart-policy/ws/src/main/java/org/apache/ws/secpolicy11/builders/TransportTokenBuilder.java>:[36,62] type org.apache.neethi.builders.AssertionBuilder does not take parameters

<https://hudson.apache.org/hudson/job/Rampart/org.apache.rampart$rampart-policy/ws/src/main/java/org/apache/ws/secpolicy12/builders/SignedPartsBuilder.java>:[33,59] type org.apache.neethi.builders.AssertionBuilder does not take parameters

<https://hudson.apache.org/hudson/job/Rampart/org.apache.rampart$rampart-policy/ws/src/main/java/org/apache/ws/secpolicy12/builders/TransportTokenBuilder.java>:[65,33] cannot find symbol
symbol  : class PolicyContainingAssertion
location: class org.apache.ws.secpolicy12.builders.TransportTokenBuilder

<https://hudson.apache.org/hudson/job/Rampart/org.apache.rampart$rampart-policy/ws/src/main/java/org/apache/ws/secpolicy11/builders/TransportTokenBuilder.java>:[66,32] cannot find symbol
symbol  : class PrimitiveAssertion
location: class org.apache.ws.secpolicy11.builders.TransportTokenBuilder


[INFO] ------------------------------------------------------------------------
[INFO] For more information, run Maven with the -e switch
[INFO] ------------------------------------------------------------------------
[INFO] Total time: 20 seconds
[INFO] Finished at: Sat Feb 19 07:54:35 PST 2011
[INFO] Final Memory: 35M/211M
[INFO] ------------------------------------------------------------------------


---------------------------------------------------------------------
To unsubscribe, e-mail: java-dev-unsubscribe@axis.apache.org
For additional commands, e-mail: java-dev-help@axis.apache.org