You are viewing a plain text version of this content. The canonical link for it is here.
Posted to builds@hbase.apache.org by Apache Jenkins Server <je...@builds.apache.org> on 2015/10/13 21:50:17 UTC
Build failed in Jenkins: HBase-1.2 » latest1.8,Hadoop #247
See <https://builds.apache.org/job/HBase-1.2/jdk=latest1.8,label=Hadoop/247/changes>
Changes:
[nkeywal] HBASE-14580 Make the HBaseMiniCluster compliant with Kerberos
------------------------------------------
[...truncated 57731 lines...]
at org.apache.hadoop.hdfs.client.impl.LeaseRenewer$1.run(LeaseRenewer.java:310)
at java.lang.Thread.run(Thread.java:744)
"IPC Client (2027133515) connection to localhost/127.0.0.1:40489 from jenkins" #379 daemon prio=5 os_prio=0 tid=0x00007f65b23c6000 nid=0x3eb4 in Object.wait() [0x00007f65a7778000]
java.lang.Thread.State: TIMED_WAITING (on object monitor)
at java.lang.Object.wait(Native Method)
at org.apache.hadoop.ipc.Client$Connection.waitForWork(Client.java:955)
- locked <0x00000000806f13e8> (a org.apache.hadoop.ipc.Client$Connection)
at org.apache.hadoop.ipc.Client$Connection.run(Client.java:1000)
"client DomainSocketWatcher" #377 daemon prio=5 os_prio=0 tid=0x00007f65b23b7800 nid=0x3eb3 runnable [0x00007f65a7879000]
java.lang.Thread.State: RUNNABLE
at org.apache.hadoop.net.unix.DomainSocketWatcher.doPoll0(Native Method)
at org.apache.hadoop.net.unix.DomainSocketWatcher.access$900(DomainSocketWatcher.java:52)
at org.apache.hadoop.net.unix.DomainSocketWatcher$2.run(DomainSocketWatcher.java:511)
at java.lang.Thread.run(Thread.java:744)
"IPC Parameter Sending Thread #0" #123 daemon prio=5 os_prio=0 tid=0x00007f65e1b03800 nid=0x3dac waiting on condition [0x00007f65b9745000]
java.lang.Thread.State: TIMED_WAITING (parking)
at sun.misc.Unsafe.park(Native Method)
- parking to wait for <0x00000000805650b0> (a java.util.concurrent.SynchronousQueue$TransferStack)
at java.util.concurrent.locks.LockSupport.parkNanos(LockSupport.java:215)
at java.util.concurrent.SynchronousQueue$TransferStack.awaitFulfill(SynchronousQueue.java:460)
at java.util.concurrent.SynchronousQueue$TransferStack.transfer(SynchronousQueue.java:362)
at java.util.concurrent.SynchronousQueue.poll(SynchronousQueue.java:941)
at java.util.concurrent.ThreadPoolExecutor.getTask(ThreadPoolExecutor.java:1066)
at java.util.concurrent.ThreadPoolExecutor.runWorker(ThreadPoolExecutor.java:1127)
at java.util.concurrent.ThreadPoolExecutor$Worker.run(ThreadPoolExecutor.java:617)
at java.lang.Thread.run(Thread.java:744)
"IPC Client (2027133515) connection to localhost/127.0.0.1:40489 from jenkins" #102 daemon prio=5 os_prio=0 tid=0x00007f65e1b02000 nid=0x3dab in Object.wait() [0x00007f65b9846000]
java.lang.Thread.State: TIMED_WAITING (on object monitor)
at java.lang.Object.wait(Native Method)
at org.apache.hadoop.ipc.Client$Connection.waitForWork(Client.java:955)
- locked <0x0000000080563f80> (a org.apache.hadoop.ipc.Client$Connection)
at org.apache.hadoop.ipc.Client$Connection.run(Client.java:1000)
"AsyncAppender-Dispatcher-Thread-51" #82 daemon prio=5 os_prio=0 tid=0x00007f65e1a3d800 nid=0x3d80 in Object.wait() [0x00007f65bc1fc000]
java.lang.Thread.State: WAITING (on object monitor)
at java.lang.Object.wait(Native Method)
at java.lang.Object.wait(Object.java:502)
at org.apache.log4j.AsyncAppender$Dispatcher.run(AsyncAppender.java:548)
- locked <0x00000000805c6e88> (a java.util.ArrayList)
at java.lang.Thread.run(Thread.java:744)
"org.apache.hadoop.fs.FileSystem$Statistics$StatisticsDataReferenceCleaner" #62 daemon prio=5 os_prio=0 tid=0x00007f65e12ca000 nid=0x3d70 in Object.wait() [0x00007f65bcf07000]
java.lang.Thread.State: WAITING (on object monitor)
at java.lang.Object.wait(Native Method)
- waiting on <0x000000008050ae90> (a java.lang.ref.ReferenceQueue$Lock)
at java.lang.ref.ReferenceQueue.remove(ReferenceQueue.java:142)
- locked <0x000000008050ae90> (a java.lang.ref.ReferenceQueue$Lock)
at java.lang.ref.ReferenceQueue.remove(ReferenceQueue.java:158)
at org.apache.hadoop.fs.FileSystem$Statistics$StatisticsDataReferenceCleaner.run(FileSystem.java:3116)
at java.lang.Thread.run(Thread.java:744)
"AsyncAppender-Dispatcher-Thread-30" #54 daemon prio=5 os_prio=0 tid=0x00007f65e128a000 nid=0x3d68 in Object.wait() [0x00007f65bd60e000]
java.lang.Thread.State: WAITING (on object monitor)
at java.lang.Object.wait(Native Method)
- waiting on <0x00000000804cfff8> (a java.util.ArrayList)
at java.lang.Object.wait(Object.java:502)
at org.apache.log4j.AsyncAppender$Dispatcher.run(AsyncAppender.java:548)
- locked <0x00000000804cfff8> (a java.util.ArrayList)
at java.lang.Thread.run(Thread.java:744)
"process reaper" #19 daemon prio=10 os_prio=0 tid=0x00007f65e0c7d000 nid=0x3d45 waiting on condition [0x00007f65c0be6000]
java.lang.Thread.State: TIMED_WAITING (parking)
at sun.misc.Unsafe.park(Native Method)
- parking to wait for <0x00000000801f5de0> (a java.util.concurrent.SynchronousQueue$TransferStack)
at java.util.concurrent.locks.LockSupport.parkNanos(LockSupport.java:215)
at java.util.concurrent.SynchronousQueue$TransferStack.awaitFulfill(SynchronousQueue.java:460)
at java.util.concurrent.SynchronousQueue$TransferStack.transfer(SynchronousQueue.java:362)
at java.util.concurrent.SynchronousQueue.poll(SynchronousQueue.java:941)
at java.util.concurrent.ThreadPoolExecutor.getTask(ThreadPoolExecutor.java:1066)
at java.util.concurrent.ThreadPoolExecutor.runWorker(ThreadPoolExecutor.java:1127)
at java.util.concurrent.ThreadPoolExecutor$Worker.run(ThreadPoolExecutor.java:617)
at java.lang.Thread.run(Thread.java:744)
"Service Thread" #17 daemon prio=9 os_prio=0 tid=0x00007f65e02cc800 nid=0x3d42 runnable [0x0000000000000000]
java.lang.Thread.State: RUNNABLE
"C1 CompilerThread11" #16 daemon prio=9 os_prio=0 tid=0x00007f65e02c7800 nid=0x3d41 waiting on condition [0x0000000000000000]
java.lang.Thread.State: RUNNABLE
"C1 CompilerThread10" #15 daemon prio=9 os_prio=0 tid=0x00007f65e02c5000 nid=0x3d40 waiting on condition [0x0000000000000000]
java.lang.Thread.State: RUNNABLE
"C1 CompilerThread9" #14 daemon prio=9 os_prio=0 tid=0x00007f65e02c3000 nid=0x3d3f waiting on condition [0x0000000000000000]
java.lang.Thread.State: RUNNABLE
"C1 CompilerThread8" #13 daemon prio=9 os_prio=0 tid=0x00007f65e02c1000 nid=0x3d3e waiting on condition [0x0000000000000000]
java.lang.Thread.State: RUNNABLE
"C2 CompilerThread7" #12 daemon prio=9 os_prio=0 tid=0x00007f65e02bf000 nid=0x3d3d waiting on condition [0x0000000000000000]
java.lang.Thread.State: RUNNABLE
"C2 CompilerThread6" #11 daemon prio=9 os_prio=0 tid=0x00007f65e02bd000 nid=0x3d3c waiting on condition [0x0000000000000000]
java.lang.Thread.State: RUNNABLE
"C2 CompilerThread5" #10 daemon prio=9 os_prio=0 tid=0x00007f65e02bb000 nid=0x3d3b waiting on condition [0x0000000000000000]
java.lang.Thread.State: RUNNABLE
"C2 CompilerThread4" #9 daemon prio=9 os_prio=0 tid=0x00007f65e02b9000 nid=0x3d3a waiting on condition [0x0000000000000000]
java.lang.Thread.State: RUNNABLE
"C2 CompilerThread3" #8 daemon prio=9 os_prio=0 tid=0x00007f65e02ae800 nid=0x3d39 waiting on condition [0x0000000000000000]
java.lang.Thread.State: RUNNABLE
"C2 CompilerThread2" #7 daemon prio=9 os_prio=0 tid=0x00007f65e02aa000 nid=0x3d38 waiting on condition [0x0000000000000000]
java.lang.Thread.State: RUNNABLE
"C2 CompilerThread1" #6 daemon prio=9 os_prio=0 tid=0x00007f65e02a8800 nid=0x3d37 waiting on condition [0x0000000000000000]
java.lang.Thread.State: RUNNABLE
"C2 CompilerThread0" #5 daemon prio=9 os_prio=0 tid=0x00007f65e02a5800 nid=0x3d36 waiting on condition [0x0000000000000000]
java.lang.Thread.State: RUNNABLE
"Signal Dispatcher" #4 daemon prio=9 os_prio=0 tid=0x00007f65e02a3800 nid=0x3d35 runnable [0x0000000000000000]
java.lang.Thread.State: RUNNABLE
"Finalizer" #3 daemon prio=8 os_prio=0 tid=0x00007f65e0276000 nid=0x3d34 in Object.wait() [0x00007f65c24e3000]
java.lang.Thread.State: WAITING (on object monitor)
at java.lang.Object.wait(Native Method)
at java.lang.ref.ReferenceQueue.remove(ReferenceQueue.java:142)
- locked <0x00000000800389a8> (a java.lang.ref.ReferenceQueue$Lock)
at java.lang.ref.ReferenceQueue.remove(ReferenceQueue.java:158)
at java.lang.ref.Finalizer$FinalizerThread.run(Finalizer.java:209)
"Reference Handler" #2 daemon prio=10 os_prio=0 tid=0x00007f65e0271800 nid=0x3d33 in Object.wait() [0x00007f65c25e4000]
java.lang.Thread.State: WAITING (on object monitor)
at java.lang.Object.wait(Native Method)
at java.lang.Object.wait(Object.java:502)
at java.lang.ref.Reference$ReferenceHandler.run(Reference.java:157)
- locked <0x000000008003af18> (a java.lang.ref.Reference$Lock)
"main" #1 prio=5 os_prio=0 tid=0x00007f65e000a000 nid=0x3d24 runnable [0x00007f65e96c6000]
java.lang.Thread.State: RUNNABLE
at java.lang.Throwable.getStackTraceElement(Native Method)
at java.lang.Throwable.getOurStackTrace(Throwable.java:827)
- locked <0x00000000d725c8e0> (a java.lang.Throwable)
at java.lang.Throwable.getStackTrace(Throwable.java:816)
at sun.reflect.GeneratedMethodAccessor3.invoke(Unknown Source)
at sun.reflect.DelegatingMethodAccessorImpl.invoke(DelegatingMethodAccessorImpl.java:43)
at java.lang.reflect.Method.invoke(Method.java:483)
at org.apache.log4j.spi.LocationInfo.<init>(LocationInfo.java:139)
at org.apache.log4j.spi.LoggingEvent.getLocationInformation(LoggingEvent.java:253)
at org.apache.log4j.helpers.PatternParser$LocationPatternConverter.convert(PatternParser.java:500)
at org.apache.log4j.helpers.PatternConverter.format(PatternConverter.java:65)
at org.apache.log4j.PatternLayout.format(PatternLayout.java:506)
at org.apache.log4j.WriterAppender.subAppend(WriterAppender.java:310)
at org.apache.log4j.WriterAppender.append(WriterAppender.java:162)
at org.apache.log4j.AppenderSkeleton.doAppend(AppenderSkeleton.java:251)
- locked <0x000000008013c118> (a org.apache.log4j.ConsoleAppender)
at org.apache.log4j.helpers.AppenderAttachableImpl.appendLoopOnAppenders(AppenderAttachableImpl.java:66)
at org.apache.log4j.Category.callAppenders(Category.java:206)
- locked <0x00000000801385f8> (a org.apache.log4j.spi.RootLogger)
at org.apache.log4j.Category.forcedLog(Category.java:391)
at org.apache.log4j.Category.log(Category.java:856)
at org.apache.commons.logging.impl.Log4JLogger.info(Log4JLogger.java:176)
at org.apache.hadoop.hdfs.server.namenode.FSImageFormatPBINode$Loader.loadINodeSection(FSImageFormatPBINode.java:265)
at org.apache.hadoop.hdfs.server.namenode.FSImageFormatProtobuf$Loader.loadInternal(FSImageFormatProtobuf.java:254)
at org.apache.hadoop.hdfs.server.namenode.FSImageFormatProtobuf$Loader.load(FSImageFormatProtobuf.java:180)
at org.apache.hadoop.hdfs.server.namenode.FSImageFormat$LoaderDelegator.load(FSImageFormat.java:228)
at org.apache.hadoop.hdfs.server.namenode.FSImage.loadFSImage(FSImage.java:877)
at org.apache.hadoop.hdfs.server.namenode.FSImage.loadFSImage(FSImage.java:861)
at org.apache.hadoop.hdfs.server.namenode.FSImage.loadFSImageFile(FSImage.java:734)
at org.apache.hadoop.hdfs.server.namenode.FSImage.loadFSImage(FSImage.java:672)
at org.apache.hadoop.hdfs.server.namenode.FSImage.recoverTransitionRead(FSImage.java:290)
at org.apache.hadoop.hdfs.server.namenode.FSNamesystem.loadFSImage(FSNamesystem.java:973)
at org.apache.hadoop.hdfs.server.namenode.FSNamesystem.loadFromDisk(FSNamesystem.java:680)
at org.apache.hadoop.hdfs.server.namenode.NameNode.loadNamesystem(NameNode.java:571)
at org.apache.hadoop.hdfs.server.namenode.NameNode.initialize(NameNode.java:628)
at org.apache.hadoop.hdfs.server.namenode.NameNode.<init>(NameNode.java:833)
at org.apache.hadoop.hdfs.server.namenode.NameNode.<init>(NameNode.java:812)
at org.apache.hadoop.hdfs.server.namenode.NameNode.createNameNode(NameNode.java:1505)
at org.apache.hadoop.hdfs.MiniDFSCluster.restartNameNode(MiniDFSCluster.java:1996)
- locked <0x000000008116de90> (a org.apache.hadoop.hdfs.MiniDFSCluster)
at org.apache.hadoop.hdfs.MiniDFSCluster.restartNameNode(MiniDFSCluster.java:1977)
- locked <0x000000008116de90> (a org.apache.hadoop.hdfs.MiniDFSCluster)
at org.apache.hadoop.hdfs.server.blockmanagement.TestBlockTokenWithDFS.doTestRead(TestBlockTokenWithDFS.java:539)
at org.apache.hadoop.hdfs.server.blockmanagement.TestBlockTokenWithDFSStriped.testRead(TestBlockTokenWithDFSStriped.java:62)
at sun.reflect.NativeMethodAccessorImpl.invoke0(Native Method)
at sun.reflect.NativeMethodAccessorImpl.invoke(NativeMethodAccessorImpl.java:62)
at sun.reflect.DelegatingMethodAccessorImpl.invoke(DelegatingMethodAccessorImpl.java:43)
at java.lang.reflect.Method.invoke(Method.java:483)
at org.junit.runners.model.FrameworkMethod$1.runReflectiveCall(FrameworkMethod.java:47)
at org.junit.internal.runners.model.ReflectiveCallable.run(ReflectiveCallable.java:12)
at org.junit.runners.model.FrameworkMethod.invokeExplosively(FrameworkMethod.java:44)
at org.junit.internal.runners.statements.InvokeMethod.evaluate(InvokeMethod.java:17)
at org.junit.runners.ParentRunner.runLeaf(ParentRunner.java:271)
at org.junit.runners.BlockJUnit4ClassRunner.runChild(BlockJUnit4ClassRunner.java:70)
at org.junit.runners.BlockJUnit4ClassRunner.runChild(BlockJUnit4ClassRunner.java:50)
at org.junit.runners.ParentRunner$3.run(ParentRunner.java:238)
at org.junit.runners.ParentRunner$1.schedule(ParentRunner.java:63)
at org.junit.runners.ParentRunner.runChildren(ParentRunner.java:236)
at org.junit.runners.ParentRunner.access$000(ParentRunner.java:53)
at org.junit.runners.ParentRunner$2.evaluate(ParentRunner.java:229)
at org.junit.runners.ParentRunner.run(ParentRunner.java:309)
at org.apache.maven.surefire.junit4.JUnit4Provider.execute(JUnit4Provider.java:264)
at org.apache.maven.surefire.junit4.JUnit4Provider.executeTestSet(JUnit4Provider.java:153)
at org.apache.maven.surefire.junit4.JUnit4Provider.invoke(JUnit4Provider.java:124)
at org.apache.maven.surefire.booter.ForkedBooter.invokeProviderInSameClassLoader(ForkedBooter.java:200)
at org.apache.maven.surefire.booter.ForkedBooter.runSuitesInProcess(ForkedBooter.java:153)
at org.apache.maven.surefire.booter.ForkedBooter.main(ForkedBooter.java:103)
"VM Thread" os_prio=0 tid=0x00007f65e026c800 nid=0x3d32 runnable
"GC task thread#0 (ParallelGC)" os_prio=0 tid=0x00007f65e001f800 nid=0x3d25 runnable
"GC task thread#1 (ParallelGC)" os_prio=0 tid=0x00007f65e0021800 nid=0x3d26 runnable
"GC task thread#2 (ParallelGC)" os_prio=0 tid=0x00007f65e0023000 nid=0x3d27 runnable
"GC task thread#3 (ParallelGC)" os_prio=0 tid=0x00007f65e0024800 nid=0x3d28 runnable
"GC task thread#4 (ParallelGC)" os_prio=0 tid=0x00007f65e0026800 nid=0x3d29 runnable
"GC task thread#5 (ParallelGC)" os_prio=0 tid=0x00007f65e0028000 nid=0x3d2a runnable
"GC task thread#6 (ParallelGC)" os_prio=0 tid=0x00007f65e002a000 nid=0x3d2b runnable
"GC task thread#7 (ParallelGC)" os_prio=0 tid=0x00007f65e002b800 nid=0x3d2c runnable
"GC task thread#8 (ParallelGC)" os_prio=0 tid=0x00007f65e002d800 nid=0x3d2d runnable
"GC task thread#9 (ParallelGC)" os_prio=0 tid=0x00007f65e002f000 nid=0x3d2e runnable
"GC task thread#10 (ParallelGC)" os_prio=0 tid=0x00007f65e0031000 nid=0x3d2f runnable
"GC task thread#11 (ParallelGC)" os_prio=0 tid=0x00007f65e0032800 nid=0x3d30 runnable
"GC task thread#12 (ParallelGC)" os_prio=0 tid=0x00007f65e0034800 nid=0x3d31 runnable
"VM Periodic Task Thread" os_prio=0 tid=0x00007f65e02cf800 nid=0x3d43 waiting on condition
JNI global references: 55
+ echo '************ END zombies jstack extract'
************ END zombies jstack extract
+ JIRA_COMMENT='
{color:red}-1 core zombie tests{color}. There are 1 zombie test(s): at org.apache.hadoop.hdfs.server.blockmanagement.TestBlockTokenWithDFSStriped.testRead(TestBlockTokenWithDFSStriped.java:62)'
+ BAD=1
+ jps
+ grep surefirebooter
+ cut -d ' ' -f 1
+ xargs kill -9
POST BUILD TASK : SUCCESS
END OF POST BUILD TASK : 0
Archiving artifacts
Jenkins build is back to normal : HBase-1.2 » latest1.8,Hadoop #250
Posted by Apache Jenkins Server <je...@builds.apache.org>.
See <https://builds.apache.org/job/HBase-1.2/jdk=latest1.8,label=Hadoop/250/changes>
Build failed in Jenkins: HBase-1.2 » latest1.8,Hadoop #249
Posted by Apache Jenkins Server <je...@builds.apache.org>.
See <https://builds.apache.org/job/HBase-1.2/jdk=latest1.8,label=Hadoop/249/changes>
Changes:
[stack] HBASE-14600 Make #testWalRollOnLowReplication looser still
------------------------------------------
[...truncated 46643 lines...]
Java HotSpot(TM) 64-Bit Server VM warning: ignoring option MaxPermSize=256m; support was removed in 8.0
Tests run: 12, Failures: 0, Errors: 0, Skipped: 0, Time elapsed: 138.834 sec - in org.apache.hadoop.hbase.client.TestMetaWithReplicas
Java HotSpot(TM) 64-Bit Server VM warning: ignoring option MaxPermSize=256m; support was removed in 8.0
Running org.apache.hadoop.hbase.TestZooKeeper
Tests run: 5, Failures: 0, Errors: 0, Skipped: 0, Time elapsed: 23.394 sec - in org.apache.hadoop.hbase.constraint.TestConstraint
Java HotSpot(TM) 64-Bit Server VM warning: ignoring option MaxPermSize=256m; support was removed in 8.0
Running org.apache.hadoop.hbase.snapshot.TestFlushSnapshotFromClient
Running org.apache.hadoop.hbase.snapshot.TestExportSnapshot
Tests run: 5, Failures: 0, Errors: 0, Skipped: 0, Time elapsed: 146.328 sec - in org.apache.hadoop.hbase.client.TestRestoreSnapshotFromClient
Java HotSpot(TM) 64-Bit Server VM warning: ignoring option MaxPermSize=256m; support was removed in 8.0
Tests run: 14, Failures: 0, Errors: 0, Skipped: 0, Time elapsed: 258.565 sec - in org.apache.hadoop.hbase.client.TestReplicasClient
Java HotSpot(TM) 64-Bit Server VM warning: ignoring option MaxPermSize=256m; support was removed in 8.0
Java HotSpot(TM) 64-Bit Server VM warning: ignoring option MaxPermSize=256m; support was removed in 8.0
Running org.apache.hadoop.hbase.snapshot.TestRestoreFlushSnapshotFromClient
Running org.apache.hadoop.hbase.snapshot.TestSecureExportSnapshot
Tests run: 9, Failures: 0, Errors: 0, Skipped: 0, Time elapsed: 76.897 sec - in org.apache.hadoop.hbase.snapshot.TestFlushSnapshotFromClient
Java HotSpot(TM) 64-Bit Server VM warning: ignoring option MaxPermSize=256m; support was removed in 8.0
Running org.apache.hadoop.hbase.snapshot.TestSnapshotClientRetries
Tests run: 2, Failures: 0, Errors: 0, Skipped: 0, Time elapsed: 17.146 sec - in org.apache.hadoop.hbase.snapshot.TestSnapshotClientRetries
Java HotSpot(TM) 64-Bit Server VM warning: ignoring option MaxPermSize=256m; support was removed in 8.0
Running org.apache.hadoop.hbase.snapshot.TestSnapshotDescriptionUtils
Tests run: 2, Failures: 0, Errors: 0, Skipped: 0, Time elapsed: 0.148 sec - in org.apache.hadoop.hbase.snapshot.TestSnapshotDescriptionUtils
Java HotSpot(TM) 64-Bit Server VM warning: ignoring option MaxPermSize=256m; support was removed in 8.0
Running org.apache.hadoop.hbase.TestIOFencing
Tests run: 5, Failures: 0, Errors: 0, Skipped: 0, Time elapsed: 72.492 sec - in org.apache.hadoop.hbase.snapshot.TestRestoreFlushSnapshotFromClient
Java HotSpot(TM) 64-Bit Server VM warning: ignoring option MaxPermSize=256m; support was removed in 8.0
Running org.apache.hadoop.hbase.coprocessor.TestRegionObserverScannerOpenHook
Tests run: 3, Failures: 0, Errors: 0, Skipped: 0, Time elapsed: 13.914 sec - in org.apache.hadoop.hbase.coprocessor.TestRegionObserverScannerOpenHook
Java HotSpot(TM) 64-Bit Server VM warning: ignoring option MaxPermSize=256m; support was removed in 8.0
Running org.apache.hadoop.hbase.coprocessor.TestOpenTableInCoprocessor
Tests run: 12, Failures: 0, Errors: 0, Skipped: 0, Time elapsed: 175.604 sec - in org.apache.hadoop.hbase.TestZooKeeper
Java HotSpot(TM) 64-Bit Server VM warning: ignoring option MaxPermSize=256m; support was removed in 8.0
Tests run: 2, Failures: 0, Errors: 0, Skipped: 0, Time elapsed: 18.435 sec - in org.apache.hadoop.hbase.coprocessor.TestOpenTableInCoprocessor
Java HotSpot(TM) 64-Bit Server VM warning: ignoring option MaxPermSize=256m; support was removed in 8.0
Running org.apache.hadoop.hbase.coprocessor.TestMasterCoprocessorExceptionWithAbort
Running org.apache.hadoop.hbase.coprocessor.TestCoprocessorTableEndpoint
Tests run: 1, Failures: 0, Errors: 0, Skipped: 0, Time elapsed: 17.259 sec - in org.apache.hadoop.hbase.coprocessor.TestMasterCoprocessorExceptionWithAbort
Java HotSpot(TM) 64-Bit Server VM warning: ignoring option MaxPermSize=256m; support was removed in 8.0
Java HotSpot(TM) 64-Bit Server VM warning: ignoring option MaxPermSize=256m; support was removed in 8.0
Tests run: 2, Failures: 0, Errors: 0, Skipped: 0, Time elapsed: 10.704 sec - in org.apache.hadoop.hbase.coprocessor.TestCoprocessorTableEndpoint
Java HotSpot(TM) 64-Bit Server VM warning: ignoring option MaxPermSize=256m; support was removed in 8.0
Java HotSpot(TM) 64-Bit Server VM warning: ignoring option MaxPermSize=256m; support was removed in 8.0
Running org.apache.hadoop.hbase.coprocessor.TestRegionServerCoprocessorEndpoint
Running org.apache.hadoop.hbase.coprocessor.TestRegionObserverInterface
Tests run: 2, Failures: 0, Errors: 0, Skipped: 0, Time elapsed: 1.784 sec - in org.apache.hadoop.hbase.coprocessor.TestRegionServerCoprocessorEndpoint
Java HotSpot(TM) 64-Bit Server VM warning: ignoring option MaxPermSize=256m; support was removed in 8.0
Running org.apache.hadoop.hbase.coprocessor.TestMasterCoprocessorExceptionWithRemove
Tests run: 2, Failures: 0, Errors: 0, Skipped: 0, Time elapsed: 112.469 sec - in org.apache.hadoop.hbase.TestIOFencing
Java HotSpot(TM) 64-Bit Server VM warning: ignoring option MaxPermSize=256m; support was removed in 8.0
Tests run: 1, Failures: 0, Errors: 0, Skipped: 0, Time elapsed: 6.103 sec - in org.apache.hadoop.hbase.coprocessor.TestMasterCoprocessorExceptionWithRemove
Java HotSpot(TM) 64-Bit Server VM warning: ignoring option MaxPermSize=256m; support was removed in 8.0
Running org.apache.hadoop.hbase.coprocessor.TestAggregateProtocol
Running org.apache.hadoop.hbase.coprocessor.TestBatchCoprocessorEndpoint
Tests run: 4, Failures: 0, Errors: 0, Skipped: 0, Time elapsed: 2.153 sec - in org.apache.hadoop.hbase.coprocessor.TestBatchCoprocessorEndpoint
Java HotSpot(TM) 64-Bit Server VM warning: ignoring option MaxPermSize=256m; support was removed in 8.0
Tests run: 44, Failures: 0, Errors: 0, Skipped: 0, Time elapsed: 5.932 sec - in org.apache.hadoop.hbase.coprocessor.TestAggregateProtocol
Java HotSpot(TM) 64-Bit Server VM warning: ignoring option MaxPermSize=256m; support was removed in 8.0
Running org.apache.hadoop.hbase.coprocessor.TestRegionServerObserver
Running org.apache.hadoop.hbase.coprocessor.TestHTableWrapper
Tests run: 1, Failures: 0, Errors: 0, Skipped: 0, Time elapsed: 5.476 sec - in org.apache.hadoop.hbase.coprocessor.TestHTableWrapper
Java HotSpot(TM) 64-Bit Server VM warning: ignoring option MaxPermSize=256m; support was removed in 8.0
Java HotSpot(TM) 64-Bit Server VM warning: ignoring option MaxPermSize=256m; support was removed in 8.0
Java HotSpot(TM) 64-Bit Server VM warning: ignoring option MaxPermSize=256m; support was removed in 8.0
Tests run: 1, Failures: 0, Errors: 0, Skipped: 0, Time elapsed: 17.739 sec - in org.apache.hadoop.hbase.coprocessor.TestRegionServerObserver
Java HotSpot(TM) 64-Bit Server VM warning: ignoring option MaxPermSize=256m; support was removed in 8.0
Running org.apache.hadoop.hbase.coprocessor.TestRegionServerCoprocessorExceptionWithAbort
Running org.apache.hadoop.hbase.coprocessor.TestClassLoading
Tests run: 2, Failures: 0, Errors: 0, Skipped: 0, Time elapsed: 19.546 sec - in org.apache.hadoop.hbase.coprocessor.TestRegionServerCoprocessorExceptionWithAbort
Java HotSpot(TM) 64-Bit Server VM warning: ignoring option MaxPermSize=256m; support was removed in 8.0
Tests run: 14, Failures: 0, Errors: 0, Skipped: 2, Time elapsed: 75.182 sec - in org.apache.hadoop.hbase.coprocessor.TestRegionObserverInterface
Java HotSpot(TM) 64-Bit Server VM warning: ignoring option MaxPermSize=256m; support was removed in 8.0
Running org.apache.hadoop.hbase.coprocessor.TestDoubleColumnInterpreter
Running org.apache.hadoop.hbase.coprocessor.TestRegionObserverBypass
Tests run: 38, Failures: 0, Errors: 0, Skipped: 0, Time elapsed: 4.983 sec - in org.apache.hadoop.hbase.coprocessor.TestDoubleColumnInterpreter
Java HotSpot(TM) 64-Bit Server VM warning: ignoring option MaxPermSize=256m; support was removed in 8.0
Tests run: 2, Failures: 0, Errors: 0, Skipped: 0, Time elapsed: 7.788 sec - in org.apache.hadoop.hbase.coprocessor.TestRegionObserverBypass
Tests run: 9, Failures: 0, Errors: 0, Skipped: 0, Time elapsed: 30.398 sec - in org.apache.hadoop.hbase.coprocessor.TestClassLoading
Java HotSpot(TM) 64-Bit Server VM warning: ignoring option MaxPermSize=256m; support was removed in 8.0
Java HotSpot(TM) 64-Bit Server VM warning: ignoring option MaxPermSize=256m; support was removed in 8.0
Running org.apache.hadoop.hbase.coprocessor.TestRowProcessorEndpoint
Running org.apache.hadoop.hbase.coprocessor.TestCoprocessorStop
Running org.apache.hadoop.hbase.coprocessor.TestRegionServerCoprocessorExceptionWithRemove
Tests run: 9, Failures: 0, Errors: 0, Skipped: 0, Time elapsed: 312.48 sec - in org.apache.hadoop.hbase.snapshot.TestExportSnapshot
Java HotSpot(TM) 64-Bit Server VM warning: ignoring option MaxPermSize=256m; support was removed in 8.0
Tests run: 1, Failures: 0, Errors: 0, Skipped: 0, Time elapsed: 15.861 sec - in org.apache.hadoop.hbase.coprocessor.TestRegionServerCoprocessorExceptionWithRemove
Java HotSpot(TM) 64-Bit Server VM warning: ignoring option MaxPermSize=256m; support was removed in 8.0
Tests run: 1, Failures: 0, Errors: 0, Skipped: 0, Time elapsed: 16.606 sec - in org.apache.hadoop.hbase.coprocessor.TestCoprocessorStop
Java HotSpot(TM) 64-Bit Server VM warning: ignoring option MaxPermSize=256m; support was removed in 8.0
Tests run: 4, Failures: 0, Errors: 0, Skipped: 0, Time elapsed: 22.96 sec - in org.apache.hadoop.hbase.coprocessor.TestRowProcessorEndpoint
Java HotSpot(TM) 64-Bit Server VM warning: ignoring option MaxPermSize=256m; support was removed in 8.0
Running org.apache.hadoop.hbase.coprocessor.TestMasterObserver
Running org.apache.hadoop.hbase.coprocessor.TestBigDecimalColumnInterpreter
Running org.apache.hadoop.hbase.coprocessor.TestCoprocessorEndpoint
Running org.apache.hadoop.hbase.coprocessor.TestWALObserver
Tests run: 6, Failures: 0, Errors: 0, Skipped: 0, Time elapsed: 2.219 sec - in org.apache.hadoop.hbase.coprocessor.TestCoprocessorEndpoint
Java HotSpot(TM) 64-Bit Server VM warning: ignoring option MaxPermSize=256m; support was removed in 8.0
Running org.apache.hadoop.hbase.TestGlobalMemStoreSize
Tests run: 38, Failures: 0, Errors: 0, Skipped: 0, Time elapsed: 5.32 sec - in org.apache.hadoop.hbase.coprocessor.TestBigDecimalColumnInterpreter
Java HotSpot(TM) 64-Bit Server VM warning: ignoring option MaxPermSize=256m; support was removed in 8.0
Tests run: 6, Failures: 0, Errors: 0, Skipped: 0, Time elapsed: 8.56 sec - in org.apache.hadoop.hbase.coprocessor.TestWALObserver
Java HotSpot(TM) 64-Bit Server VM warning: ignoring option MaxPermSize=256m; support was removed in 8.0
Java HotSpot(TM) 64-Bit Server VM warning: ignoring option MaxPermSize=256m; support was removed in 8.0
Java HotSpot(TM) 64-Bit Server VM warning: ignoring option MaxPermSize=256m; support was removed in 8.0
Java HotSpot(TM) 64-Bit Server VM warning: ignoring option MaxPermSize=256m; support was removed in 8.0
Running org.apache.hadoop.hbase.TestMetaTableLocator
Running org.apache.hadoop.hbase.TestJMXListener
Tests run: 7, Failures: 0, Errors: 0, Skipped: 0, Time elapsed: 3.457 sec - in org.apache.hadoop.hbase.TestMetaTableLocator
Java HotSpot(TM) 64-Bit Server VM warning: ignoring option MaxPermSize=256m; support was removed in 8.0
Tests run: 1, Failures: 0, Errors: 0, Skipped: 0, Time elapsed: 15.22 sec - in org.apache.hadoop.hbase.TestGlobalMemStoreSize
Java HotSpot(TM) 64-Bit Server VM warning: ignoring option MaxPermSize=256m; support was removed in 8.0
Running org.apache.hadoop.hbase.zookeeper.TestZKTableStateManager
Tests run: 1, Failures: 0, Errors: 0, Skipped: 0, Time elapsed: 0.625 sec - in org.apache.hadoop.hbase.zookeeper.TestZKTableStateManager
Java HotSpot(TM) 64-Bit Server VM warning: ignoring option MaxPermSize=256m; support was removed in 8.0
Running org.apache.hadoop.hbase.zookeeper.TestZKMulti
Tests run: 12, Failures: 0, Errors: 0, Skipped: 0, Time elapsed: 1.164 sec - in org.apache.hadoop.hbase.zookeeper.TestZKMulti
Java HotSpot(TM) 64-Bit Server VM warning: ignoring option MaxPermSize=256m; support was removed in 8.0
Running org.apache.hadoop.hbase.zookeeper.lock.TestZKInterProcessReadWriteLock
Running org.apache.hadoop.hbase.zookeeper.TestZooKeeperACL
Tests run: 7, Failures: 0, Errors: 0, Skipped: 0, Time elapsed: 0.34 sec - in org.apache.hadoop.hbase.zookeeper.TestZooKeeperACL
Java HotSpot(TM) 64-Bit Server VM warning: ignoring option MaxPermSize=256m; support was removed in 8.0
Running org.apache.hadoop.hbase.zookeeper.TestZKLeaderManager
Tests run: 1, Failures: 0, Errors: 0, Skipped: 0, Time elapsed: 0.112 sec - in org.apache.hadoop.hbase.zookeeper.TestZKLeaderManager
Java HotSpot(TM) 64-Bit Server VM warning: ignoring option MaxPermSize=256m; support was removed in 8.0
Java HotSpot(TM) 64-Bit Server VM warning: ignoring option MaxPermSize=256m; support was removed in 8.0
Tests run: 2, Failures: 0, Errors: 0, Skipped: 0, Time elapsed: 16.015 sec - in org.apache.hadoop.hbase.TestJMXListener
Java HotSpot(TM) 64-Bit Server VM warning: ignoring option MaxPermSize=256m; support was removed in 8.0
Java HotSpot(TM) 64-Bit Server VM warning: ignoring option MaxPermSize=256m; support was removed in 8.0
Running org.apache.hadoop.hbase.zookeeper.TestRecoverableZooKeeper
Running org.apache.hadoop.hbase.zookeeper.TestZooKeeperNodeTracker
Tests run: 1, Failures: 0, Errors: 0, Skipped: 0, Time elapsed: 1.237 sec - in org.apache.hadoop.hbase.zookeeper.TestRecoverableZooKeeper
Java HotSpot(TM) 64-Bit Server VM warning: ignoring option MaxPermSize=256m; support was removed in 8.0
Tests run: 3, Failures: 0, Errors: 0, Skipped: 0, Time elapsed: 0.818 sec - in org.apache.hadoop.hbase.zookeeper.TestZooKeeperNodeTracker
Java HotSpot(TM) 64-Bit Server VM warning: ignoring option MaxPermSize=256m; support was removed in 8.0
Running org.apache.hadoop.hbase.zookeeper.TestHQuorumPeer
Tests run: 4, Failures: 0, Errors: 0, Skipped: 0, Time elapsed: 1.3 sec - in org.apache.hadoop.hbase.zookeeper.TestHQuorumPeer
Java HotSpot(TM) 64-Bit Server VM warning: ignoring option MaxPermSize=256m; support was removed in 8.0
Running org.apache.hadoop.hbase.TestClusterBootOrder
Tests run: 7, Failures: 0, Errors: 0, Skipped: 0, Time elapsed: 39.513 sec - in org.apache.hadoop.hbase.coprocessor.TestMasterObserver
Java HotSpot(TM) 64-Bit Server VM warning: ignoring option MaxPermSize=256m; support was removed in 8.0
Tests run: 9, Failures: 0, Errors: 0, Skipped: 0, Time elapsed: 312.811 sec - in org.apache.hadoop.hbase.snapshot.TestSecureExportSnapshot
Java HotSpot(TM) 64-Bit Server VM warning: ignoring option MaxPermSize=256m; support was removed in 8.0
Java HotSpot(TM) 64-Bit Server VM warning: ignoring option MaxPermSize=256m; support was removed in 8.0
Running org.apache.hadoop.hbase.TestPartialResultsFromClientSide
Running org.apache.hadoop.hbase.TestServerSideScanMetricsFromClientSide
Tests run: 6, Failures: 0, Errors: 0, Skipped: 0, Time elapsed: 24.623 sec - in org.apache.hadoop.hbase.zookeeper.lock.TestZKInterProcessReadWriteLock
Tests run: 2, Failures: 0, Errors: 0, Skipped: 0, Time elapsed: 2.818 sec - in org.apache.hadoop.hbase.TestServerSideScanMetricsFromClientSide
Tests run: 2, Failures: 0, Errors: 0, Skipped: 0, Time elapsed: 28.754 sec - in org.apache.hadoop.hbase.TestClusterBootOrder
Tests run: 13, Failures: 0, Errors: 0, Skipped: 0, Time elapsed: 38.536 sec - in org.apache.hadoop.hbase.TestPartialResultsFromClientSide
Results :
Failed tests:
org.apache.hadoop.hbase.security.access.TestCellACLs.testCellPermissions(org.apache.hadoop.hbase.security.access.TestCellACLs)
Run 1: TestCellACLs.testCellPermissions:230->SecureTestUtil.verifyIfNull:237 Non null results from action for user 'other' : [cellpermtest/f1:q3/1444785297684/Put/vlen=8/seqid=0]
Run 2: TestCellACLs.testCellPermissions:230->SecureTestUtil.verifyIfNull:237 Non null results from action for user 'other' : [cellpermtest/f1:q3/1444785310401/Put/vlen=8/seqid=0]
Run 3: TestCellACLs.testCellPermissions:230->SecureTestUtil.verifyIfNull:237 Non null results from action for user 'other' : [cellpermtest/f1:q3/1444785323446/Put/vlen=8/seqid=0]
Flaked tests:
org.apache.hadoop.hbase.client.TestSnapshotCloneIndependence.testOnlineSnapshotDeleteIndependent(org.apache.hadoop.hbase.client.TestSnapshotCloneIndependence)
Run 1: TestSnapshotCloneIndependence.testOnlineSnapshotDeleteIndependent:191->runTestSnapshotDeleteIndependent:459 expected:<17576> but was:<14046>
Run 2: TestSnapshotCloneIndependence.testOnlineSnapshotDeleteIndependent:191->runTestSnapshotDeleteIndependent:459 expected:<17576> but was:<14046>
Run 3: PASS
Tests run: 2458, Failures: 1, Errors: 0, Skipped: 57, Flakes: 1
[INFO] ------------------------------------------------------------------------
[INFO] Reactor Summary:
[INFO]
[INFO] Apache HBase ...................................... SUCCESS [1:24.893s]
[INFO] Apache HBase - Checkstyle ......................... SUCCESS [8.747s]
[INFO] Apache HBase - Resource Bundle .................... SUCCESS [0.191s]
[INFO] Apache HBase - Annotations ........................ SUCCESS [1.130s]
[INFO] Apache HBase - Protocol ........................... SUCCESS [19.892s]
[INFO] Apache HBase - Common ............................. SUCCESS [3:35.357s]
[INFO] Apache HBase - Procedure .......................... SUCCESS [1:52.906s]
[INFO] Apache HBase - Client ............................. SUCCESS [1:35.047s]
[INFO] Apache HBase - Hadoop Compatibility ............... SUCCESS [8.161s]
[INFO] Apache HBase - Hadoop Two Compatibility ........... SUCCESS [8.249s]
[INFO] Apache HBase - Prefix Tree ........................ SUCCESS [7.750s]
[INFO] Apache HBase - Server ............................. FAILURE [1:25:20.301s]
[INFO] Apache HBase - Testing Util ....................... SKIPPED
[INFO] Apache HBase - Thrift ............................. SKIPPED
[INFO] Apache HBase - Rest ............................... SKIPPED
[INFO] Apache HBase - Shell .............................. SKIPPED
[INFO] Apache HBase - Integration Tests .................. SKIPPED
[INFO] Apache HBase - Examples ........................... SKIPPED
[INFO] Apache HBase - External Block Cache ............... SKIPPED
[INFO] Apache HBase - Assembly ........................... SKIPPED
[INFO] Apache HBase - Shaded ............................. SKIPPED
[INFO] Apache HBase - Shaded - Client .................... SKIPPED
[INFO] Apache HBase - Shaded - Server .................... SKIPPED
[INFO] ------------------------------------------------------------------------
[INFO] BUILD FAILURE
[INFO] ------------------------------------------------------------------------
[INFO] Total time: 1:35:05.817s
[INFO] Finished at: Wed Oct 14 01:55:33 UTC 2015
[INFO] Final Memory: 97M/640M
[INFO] ------------------------------------------------------------------------
[ERROR] Failed to execute goal org.apache.maven.plugins:maven-surefire-plugin:2.18.1:test (secondPartTestsExecution) on project hbase-server: ExecutionException: java.lang.RuntimeException: The forked VM terminated without properly saying goodbye. VM crash or System.exit called?
[ERROR] Command was /bin/sh -c cd <https://builds.apache.org/job/HBase-1.2/jdk=latest1.8,label=Hadoop/ws/hbase-server> && /home/jenkins/jenkins-slave/tools/hudson.model.JDK/latest1.8/jre/bin/java -enableassertions -XX:MaxDirectMemorySize=1G -Xmx2800m -XX:MaxPermSize=256m -Djava.security.egd=file:/dev/./urandom -Djava.net.preferIPv4Stack=true -Djava.awt.headless=true -jar <https://builds.apache.org/job/HBase-1.2/jdk=latest1.8,label=Hadoop/ws/hbase-server/target/surefire/surefirebooter4071454595786438468.jar> <https://builds.apache.org/job/HBase-1.2/jdk=latest1.8,label=Hadoop/ws/hbase-server/target/surefire/surefire6899158035786177965tmp> <https://builds.apache.org/job/HBase-1.2/jdk=latest1.8,label=Hadoop/ws/hbase-server/target/surefire/surefire_940815687269024148945tmp>
[ERROR] -> [Help 1]
[ERROR]
[ERROR] To see the full stack trace of the errors, re-run Maven with the -e switch.
[ERROR] Re-run Maven using the -X switch to enable full debug logging.
[ERROR]
[ERROR] For more information about the errors and possible solutions, please read the following articles:
[ERROR] [Help 1] http://cwiki.apache.org/confluence/display/MAVEN/MojoFailureException
[ERROR]
[ERROR] After correcting the problems, you can resume the build with the command
[ERROR] mvn <goals> -rf :hbase-server
Build step 'Invoke top-level Maven targets' marked build as failure
Performing Post build task...
Match found for :.* : True
Logical operation result is TRUE
Running script : ZOMBIE_TESTS_COUNT=`jps | grep surefirebooter | wc -l`
if [[ $ZOMBIE_TESTS_COUNT != 0 ]] ; then
#It seems sometimes the tests are not dying immediately. Let's give them 10s
echo "Suspicious java process found - waiting 10s to see if there are just slow to stop"
sleep 10
ZOMBIE_TESTS_COUNT=`jps | grep surefirebooter | wc -l`
if [[ $ZOMBIE_TESTS_COUNT != 0 ]] ; then
echo "There are $ZOMBIE_TESTS_COUNT zombie tests, they should have been killed by surefire but survived"
echo "************ BEGIN zombies jstack extract"
ZB_STACK=`jps | grep surefirebooter | cut -d ' ' -f 1 | xargs -n 1 jstack | grep ".test" | grep "\.java"`
jps | grep surefirebooter | cut -d ' ' -f 1 | xargs -n 1 jstack
echo "************ END zombies jstack extract"
JIRA_COMMENT="$JIRA_COMMENT
{color:red}-1 core zombie tests{color}. There are ${ZOMBIE_TESTS_COUNT} zombie test(s): ${ZB_STACK}"
BAD=1
jps | grep surefirebooter | cut -d ' ' -f 1 | xargs kill -9
else
echo "We're ok: there is no zombie test, but some tests took some time to stop"
fi
else
echo "We're ok: there is no zombie test"
fi
[Hadoop] $ /bin/bash -xe /tmp/hudson2119765068870573497.sh
++ jps
++ grep surefirebooter
++ wc -l
+ ZOMBIE_TESTS_COUNT=0
+ [[ 0 != 0 ]]
+ echo 'We'\''re ok: there is no zombie test'
We're ok: there is no zombie test
POST BUILD TASK : SUCCESS
END OF POST BUILD TASK : 0
Archiving artifacts
Build failed in Jenkins: HBase-1.2 » latest1.8,Hadoop #248
Posted by Apache Jenkins Server <je...@builds.apache.org>.
See <https://builds.apache.org/job/HBase-1.2/jdk=latest1.8,label=Hadoop/248/changes>
Changes:
[stack] HBASE-14596 TestCellACLs failing... on1.2 builds; TUNEUP -- ADD DEBUG
------------------------------------------
[...truncated 54740 lines...]
at org.apache.hadoop.net.unix.DomainSocketWatcher.doPoll0(Native Method)
at org.apache.hadoop.net.unix.DomainSocketWatcher.access$900(DomainSocketWatcher.java:52)
at org.apache.hadoop.net.unix.DomainSocketWatcher$2.run(DomainSocketWatcher.java:511)
at java.lang.Thread.run(Thread.java:745)
"nioEventLoopGroup-6-1" prio=10 tid=0x00007fc885f79800 nid=0x185f runnable [0x00007fc868468000]
java.lang.Thread.State: RUNNABLE
at sun.nio.ch.EPollArrayWrapper.epollWait(Native Method)
at sun.nio.ch.EPollArrayWrapper.poll(EPollArrayWrapper.java:269)
at sun.nio.ch.EPollSelectorImpl.doSelect(EPollSelectorImpl.java:79)
at sun.nio.ch.SelectorImpl.lockAndDoSelect(SelectorImpl.java:87)
- locked <0x00000007ef0303a0> (a io.netty.channel.nio.SelectedSelectionKeySet)
- locked <0x00000007ef0303c0> (a java.util.Collections$UnmodifiableSet)
- locked <0x00000007ef030358> (a sun.nio.ch.EPollSelectorImpl)
at sun.nio.ch.SelectorImpl.select(SelectorImpl.java:98)
at io.netty.channel.nio.NioEventLoop.select(NioEventLoop.java:621)
at io.netty.channel.nio.NioEventLoop.run(NioEventLoop.java:309)
at io.netty.util.concurrent.SingleThreadEventExecutor$4.run(SingleThreadEventExecutor.java:703)
at io.netty.util.concurrent.DefaultThreadFactory$DefaultRunnableDecorator.run(DefaultThreadFactory.java:137)
at java.lang.Thread.run(Thread.java:745)
"IPC Parameter Sending Thread #0" daemon prio=10 tid=0x00007fc87c0a2800 nid=0x182e waiting on condition [0x00007fc869e39000]
java.lang.Thread.State: TIMED_WAITING (parking)
at sun.misc.Unsafe.park(Native Method)
- parking to wait for <0x00000007ef038468> (a java.util.concurrent.SynchronousQueue$TransferStack)
at java.util.concurrent.locks.LockSupport.parkNanos(LockSupport.java:226)
at java.util.concurrent.SynchronousQueue$TransferStack.awaitFulfill(SynchronousQueue.java:460)
at java.util.concurrent.SynchronousQueue$TransferStack.transfer(SynchronousQueue.java:359)
at java.util.concurrent.SynchronousQueue.poll(SynchronousQueue.java:942)
at java.util.concurrent.ThreadPoolExecutor.getTask(ThreadPoolExecutor.java:1068)
at java.util.concurrent.ThreadPoolExecutor.runWorker(ThreadPoolExecutor.java:1130)
at java.util.concurrent.ThreadPoolExecutor$Worker.run(ThreadPoolExecutor.java:615)
at java.lang.Thread.run(Thread.java:745)
"IPC Client (104801753) connection to localhost/127.0.0.1:48838 from jenkins" daemon prio=10 tid=0x00007fc87c0a8800 nid=0x182d in Object.wait() [0x00007fc869f3a000]
java.lang.Thread.State: TIMED_WAITING (on object monitor)
at java.lang.Object.wait(Native Method)
- waiting on <0x00000007ef038638> (a org.apache.hadoop.ipc.Client$Connection)
at org.apache.hadoop.ipc.Client$Connection.waitForWork(Client.java:955)
- locked <0x00000007ef038638> (a org.apache.hadoop.ipc.Client$Connection)
at org.apache.hadoop.ipc.Client$Connection.run(Client.java:1000)
"nioEventLoopGroup-4-1" prio=10 tid=0x00007fc885ec1800 nid=0x182c runnable [0x00007fc86a03b000]
java.lang.Thread.State: RUNNABLE
at sun.nio.ch.EPollArrayWrapper.epollWait(Native Method)
at sun.nio.ch.EPollArrayWrapper.poll(EPollArrayWrapper.java:269)
at sun.nio.ch.EPollSelectorImpl.doSelect(EPollSelectorImpl.java:79)
at sun.nio.ch.SelectorImpl.lockAndDoSelect(SelectorImpl.java:87)
- locked <0x00000007ef14fd18> (a io.netty.channel.nio.SelectedSelectionKeySet)
- locked <0x00000007ef14fd38> (a java.util.Collections$UnmodifiableSet)
- locked <0x00000007ef14fcd0> (a sun.nio.ch.EPollSelectorImpl)
at sun.nio.ch.SelectorImpl.select(SelectorImpl.java:98)
at io.netty.channel.nio.NioEventLoop.select(NioEventLoop.java:621)
at io.netty.channel.nio.NioEventLoop.run(NioEventLoop.java:309)
at io.netty.util.concurrent.SingleThreadEventExecutor$4.run(SingleThreadEventExecutor.java:703)
at io.netty.util.concurrent.DefaultThreadFactory$DefaultRunnableDecorator.run(DefaultThreadFactory.java:137)
at java.lang.Thread.run(Thread.java:745)
"AsyncAppender-Dispatcher-Thread-51" daemon prio=10 tid=0x00007fc88583d800 nid=0x17f7 in Object.wait() [0x00007fc86b44f000]
java.lang.Thread.State: WAITING (on object monitor)
at java.lang.Object.wait(Native Method)
- waiting on <0x00000007ef0404d0> (a java.util.ArrayList)
at java.lang.Object.wait(Object.java:503)
at org.apache.log4j.AsyncAppender$Dispatcher.run(AsyncAppender.java:548)
- locked <0x00000007ef0404d0> (a java.util.ArrayList)
at java.lang.Thread.run(Thread.java:745)
"nioEventLoopGroup-2-1" prio=10 tid=0x00007fc8857c9800 nid=0x17d2 runnable [0x00007fc86b954000]
java.lang.Thread.State: RUNNABLE
at sun.nio.ch.EPollArrayWrapper.epollWait(Native Method)
at sun.nio.ch.EPollArrayWrapper.poll(EPollArrayWrapper.java:269)
at sun.nio.ch.EPollSelectorImpl.doSelect(EPollSelectorImpl.java:79)
at sun.nio.ch.SelectorImpl.lockAndDoSelect(SelectorImpl.java:87)
- locked <0x00000007ef028f70> (a io.netty.channel.nio.SelectedSelectionKeySet)
- locked <0x00000007ef028f90> (a java.util.Collections$UnmodifiableSet)
- locked <0x00000007ef028f28> (a sun.nio.ch.EPollSelectorImpl)
at sun.nio.ch.SelectorImpl.select(SelectorImpl.java:98)
at io.netty.channel.nio.NioEventLoop.select(NioEventLoop.java:621)
at io.netty.channel.nio.NioEventLoop.run(NioEventLoop.java:309)
at io.netty.util.concurrent.SingleThreadEventExecutor$4.run(SingleThreadEventExecutor.java:703)
at io.netty.util.concurrent.DefaultThreadFactory$DefaultRunnableDecorator.run(DefaultThreadFactory.java:137)
at java.lang.Thread.run(Thread.java:745)
"org.apache.hadoop.fs.FileSystem$Statistics$StatisticsDataReferenceCleaner" daemon prio=10 tid=0x00007fc88508d000 nid=0x179f in Object.wait() [0x00007fc86bf5a000]
java.lang.Thread.State: WAITING (on object monitor)
at java.lang.Object.wait(Native Method)
- waiting on <0x00000007ef15e660> (a java.lang.ref.ReferenceQueue$Lock)
at java.lang.ref.ReferenceQueue.remove(ReferenceQueue.java:135)
- locked <0x00000007ef15e660> (a java.lang.ref.ReferenceQueue$Lock)
at java.lang.ref.ReferenceQueue.remove(ReferenceQueue.java:151)
at org.apache.hadoop.fs.FileSystem$Statistics$StatisticsDataReferenceCleaner.run(FileSystem.java:3115)
at java.lang.Thread.run(Thread.java:745)
"AsyncAppender-Dispatcher-Thread-30" daemon prio=10 tid=0x00007fc88504d000 nid=0x1797 in Object.wait() [0x00007fc86c661000]
java.lang.Thread.State: WAITING (on object monitor)
at java.lang.Object.wait(Native Method)
- waiting on <0x00000007ef05bd20> (a java.util.ArrayList)
at java.lang.Object.wait(Object.java:503)
at org.apache.log4j.AsyncAppender$Dispatcher.run(AsyncAppender.java:548)
- locked <0x00000007ef05bd20> (a java.util.ArrayList)
at java.lang.Thread.run(Thread.java:745)
"process reaper" daemon prio=10 tid=0x00007fc884bcc000 nid=0x1550 waiting on condition [0x00007fc878239000]
java.lang.Thread.State: TIMED_WAITING (parking)
at sun.misc.Unsafe.park(Native Method)
- parking to wait for <0x00000007eef49a60> (a java.util.concurrent.SynchronousQueue$TransferStack)
at java.util.concurrent.locks.LockSupport.parkNanos(LockSupport.java:226)
at java.util.concurrent.SynchronousQueue$TransferStack.awaitFulfill(SynchronousQueue.java:460)
at java.util.concurrent.SynchronousQueue$TransferStack.transfer(SynchronousQueue.java:359)
at java.util.concurrent.SynchronousQueue.poll(SynchronousQueue.java:942)
at java.util.concurrent.ThreadPoolExecutor.getTask(ThreadPoolExecutor.java:1068)
at java.util.concurrent.ThreadPoolExecutor.runWorker(ThreadPoolExecutor.java:1130)
at java.util.concurrent.ThreadPoolExecutor$Worker.run(ThreadPoolExecutor.java:615)
at java.lang.Thread.run(Thread.java:745)
"Service Thread" daemon prio=10 tid=0x00007fc884291000 nid=0x150e runnable [0x0000000000000000]
java.lang.Thread.State: RUNNABLE
"C2 CompilerThread1" daemon prio=10 tid=0x00007fc88428e800 nid=0x150d waiting on condition [0x0000000000000000]
java.lang.Thread.State: RUNNABLE
"C2 CompilerThread0" daemon prio=10 tid=0x00007fc88428c000 nid=0x150c waiting on condition [0x0000000000000000]
java.lang.Thread.State: RUNNABLE
"Signal Dispatcher" daemon prio=10 tid=0x00007fc884281800 nid=0x150b runnable [0x0000000000000000]
java.lang.Thread.State: RUNNABLE
"Finalizer" daemon prio=10 tid=0x00007fc88426b000 nid=0x150a in Object.wait() [0x00007fc8795d4000]
java.lang.Thread.State: WAITING (on object monitor)
at java.lang.Object.wait(Native Method)
- waiting on <0x00000007eef52380> (a java.lang.ref.ReferenceQueue$Lock)
at java.lang.ref.ReferenceQueue.remove(ReferenceQueue.java:135)
- locked <0x00000007eef52380> (a java.lang.ref.ReferenceQueue$Lock)
at java.lang.ref.ReferenceQueue.remove(ReferenceQueue.java:151)
at java.lang.ref.Finalizer$FinalizerThread.run(Finalizer.java:189)
"Reference Handler" daemon prio=10 tid=0x00007fc884267000 nid=0x1509 in Object.wait() [0x00007fc8796d5000]
java.lang.Thread.State: WAITING (on object monitor)
at java.lang.Object.wait(Native Method)
- waiting on <0x00000007eef51d98> (a java.lang.ref.Reference$Lock)
at java.lang.Object.wait(Object.java:503)
at java.lang.ref.Reference$ReferenceHandler.run(Reference.java:133)
- locked <0x00000007eef51d98> (a java.lang.ref.Reference$Lock)
"main" prio=10 tid=0x00007fc88400a000 nid=0x14fa runnable [0x00007fc88c07b000]
java.lang.Thread.State: RUNNABLE
at sun.management.ThreadImpl.getThreadInfo1(Native Method)
at sun.management.ThreadImpl.getThreadInfo(ThreadImpl.java:174)
at org.apache.hadoop.metrics2.source.JvmMetrics.getThreadUsage(JvmMetrics.java:174)
at org.apache.hadoop.metrics2.source.JvmMetrics.getMetrics(JvmMetrics.java:100)
at org.apache.hadoop.metrics2.impl.MetricsSourceAdapter.getMetrics(MetricsSourceAdapter.java:191)
at org.apache.hadoop.metrics2.impl.MetricsSourceAdapter.updateJmxCache(MetricsSourceAdapter.java:170)
- locked <0x00000007e910bc68> (a org.apache.hadoop.metrics2.impl.MetricsSourceAdapter)
at org.apache.hadoop.metrics2.impl.MetricsSourceAdapter.getMBeanInfo(MetricsSourceAdapter.java:151)
at com.sun.jmx.interceptor.DefaultMBeanServerInterceptor.getNewMBeanClassName(DefaultMBeanServerInterceptor.java:333)
at com.sun.jmx.interceptor.DefaultMBeanServerInterceptor.registerMBean(DefaultMBeanServerInterceptor.java:319)
at com.sun.jmx.mbeanserver.JmxMBeanServer.registerMBean(JmxMBeanServer.java:522)
at org.apache.hadoop.metrics2.util.MBeans.register(MBeans.java:67)
at org.apache.hadoop.metrics2.impl.MetricsSourceAdapter.startMBeans(MetricsSourceAdapter.java:216)
- locked <0x00000007e910bc68> (a org.apache.hadoop.metrics2.impl.MetricsSourceAdapter)
at org.apache.hadoop.metrics2.impl.MetricsSourceAdapter.start(MetricsSourceAdapter.java:96)
at org.apache.hadoop.metrics2.impl.MetricsSystemImpl.registerSource(MetricsSystemImpl.java:268)
- locked <0x00000007f0af5e58> (a org.apache.hadoop.metrics2.impl.MetricsSystemImpl)
at org.apache.hadoop.metrics2.impl.MetricsSystemImpl.register(MetricsSystemImpl.java:234)
- locked <0x00000007f0af5e58> (a org.apache.hadoop.metrics2.impl.MetricsSystemImpl)
at org.apache.hadoop.metrics2.source.JvmMetrics.create(JvmMetrics.java:85)
at org.apache.hadoop.hdfs.server.datanode.metrics.DataNodeMetrics.create(DataNodeMetrics.java:179)
at org.apache.hadoop.hdfs.server.datanode.DataNode.startDataNode(DataNode.java:1216)
at org.apache.hadoop.hdfs.server.datanode.DataNode.<init>(DataNode.java:468)
at org.apache.hadoop.hdfs.server.datanode.DataNode.makeInstance(DataNode.java:2487)
at org.apache.hadoop.hdfs.server.datanode.DataNode.instantiateDataNode(DataNode.java:2375)
at org.apache.hadoop.hdfs.MiniDFSCluster.startDataNodes(MiniDFSCluster.java:1593)
- locked <0x00000007e2f2b410> (a org.apache.hadoop.hdfs.MiniDFSCluster)
at org.apache.hadoop.hdfs.MiniDFSCluster.initMiniDFSCluster(MiniDFSCluster.java:842)
at org.apache.hadoop.hdfs.MiniDFSCluster.<init>(MiniDFSCluster.java:480)
at org.apache.hadoop.hdfs.MiniDFSCluster$Builder.build(MiniDFSCluster.java:439)
at org.apache.hadoop.hdfs.server.datanode.TestReadOnlySharedStorage.setup(TestReadOnlySharedStorage.java:110)
at sun.reflect.NativeMethodAccessorImpl.invoke0(Native Method)
at sun.reflect.NativeMethodAccessorImpl.invoke(NativeMethodAccessorImpl.java:57)
at sun.reflect.DelegatingMethodAccessorImpl.invoke(DelegatingMethodAccessorImpl.java:43)
at java.lang.reflect.Method.invoke(Method.java:606)
at org.junit.runners.model.FrameworkMethod$1.runReflectiveCall(FrameworkMethod.java:47)
at org.junit.internal.runners.model.ReflectiveCallable.run(ReflectiveCallable.java:12)
at org.junit.runners.model.FrameworkMethod.invokeExplosively(FrameworkMethod.java:44)
at org.junit.internal.runners.statements.RunBefores.evaluate(RunBefores.java:24)
at org.junit.internal.runners.statements.RunAfters.evaluate(RunAfters.java:27)
at org.junit.runners.ParentRunner.runLeaf(ParentRunner.java:271)
at org.junit.runners.BlockJUnit4ClassRunner.runChild(BlockJUnit4ClassRunner.java:70)
at org.junit.runners.BlockJUnit4ClassRunner.runChild(BlockJUnit4ClassRunner.java:50)
at org.junit.runners.ParentRunner$3.run(ParentRunner.java:238)
at org.junit.runners.ParentRunner$1.schedule(ParentRunner.java:63)
at org.junit.runners.ParentRunner.runChildren(ParentRunner.java:236)
at org.junit.runners.ParentRunner.access$000(ParentRunner.java:53)
at org.junit.runners.ParentRunner$2.evaluate(ParentRunner.java:229)
at org.junit.runners.ParentRunner.run(ParentRunner.java:309)
at org.apache.maven.surefire.junit4.JUnit4Provider.execute(JUnit4Provider.java:264)
at org.apache.maven.surefire.junit4.JUnit4Provider.executeTestSet(JUnit4Provider.java:153)
at org.apache.maven.surefire.junit4.JUnit4Provider.invoke(JUnit4Provider.java:124)
at org.apache.maven.surefire.booter.ForkedBooter.invokeProviderInSameClassLoader(ForkedBooter.java:200)
at org.apache.maven.surefire.booter.ForkedBooter.runSuitesInProcess(ForkedBooter.java:153)
at org.apache.maven.surefire.booter.ForkedBooter.main(ForkedBooter.java:103)
"VM Thread" prio=10 tid=0x00007fc884264800 nid=0x1508 runnable
"GC task thread#0 (ParallelGC)" prio=10 tid=0x00007fc884020000 nid=0x14fb runnable
"GC task thread#1 (ParallelGC)" prio=10 tid=0x00007fc884022000 nid=0x14fc runnable
"GC task thread#2 (ParallelGC)" prio=10 tid=0x00007fc884024000 nid=0x14fd runnable
"GC task thread#3 (ParallelGC)" prio=10 tid=0x00007fc884025800 nid=0x14fe runnable
"GC task thread#4 (ParallelGC)" prio=10 tid=0x00007fc884027800 nid=0x14ff runnable
"GC task thread#5 (ParallelGC)" prio=10 tid=0x00007fc884029800 nid=0x1500 runnable
"GC task thread#6 (ParallelGC)" prio=10 tid=0x00007fc88402b000 nid=0x1501 runnable
"GC task thread#7 (ParallelGC)" prio=10 tid=0x00007fc88402d000 nid=0x1502 runnable
"GC task thread#8 (ParallelGC)" prio=10 tid=0x00007fc88402f000 nid=0x1503 runnable
"GC task thread#9 (ParallelGC)" prio=10 tid=0x00007fc884031000 nid=0x1504 runnable
"GC task thread#10 (ParallelGC)" prio=10 tid=0x00007fc884032800 nid=0x1505 runnable
"GC task thread#11 (ParallelGC)" prio=10 tid=0x00007fc884034800 nid=0x1506 runnable
"GC task thread#12 (ParallelGC)" prio=10 tid=0x00007fc884036800 nid=0x1507 runnable
"VM Periodic Task Thread" prio=10 tid=0x00007fc88429c000 nid=0x150f waiting on condition
JNI global references: 341
+ echo '************ END zombies jstack extract'
************ END zombies jstack extract
+ JIRA_COMMENT='
{color:red}-1 core zombie tests{color}. There are 4 zombie test(s): at org.apache.hadoop.hdfs.server.datanode.TestBPOfferService.testTrySendErrorReportWhenNNThrowsIOException(TestBPOfferService.java:622)
at org.apache.hadoop.hdfs.server.datanode.TestDataNodeVolumeFailureReporting.testMultipleVolFailuresOnNode(TestDataNodeVolumeFailureReporting.java:294)
at org.apache.hadoop.hdfs.server.datanode.TestBlockReplacement.testDeletedBlockWhenAddBlockIsInEdit(TestBlockReplacement.java:414)'
+ BAD=1
+ jps
+ grep surefirebooter
+ cut -d ' ' -f 1
+ xargs kill -9
POST BUILD TASK : SUCCESS
END OF POST BUILD TASK : 0
Archiving artifacts