You are viewing a plain text version of this content. The canonical link for it is here.
Posted to ci@bigtop.apache.org by Apache Jenkins Server <je...@builds.apache.org> on 2014/10/09 04:31:52 UTC
Build failed in Jenkins: Bigtop-trunk-testartifacts » hadoopsmoke #1517
See <https://builds.apache.org/job/Bigtop-trunk-testartifacts/org.apache.bigtop.itest$hadoop-smoke/1517/changes>
Changes:
[jayunit100] BIGTOP 1388. Use cluster failure tests during other tests ith command line parameterization.
------------------------------------------
[INFO]
[INFO] ------------------------------------------------------------------------
[INFO] Building hadoopsmoke 0.9.0-SNAPSHOT
[INFO] ------------------------------------------------------------------------
Downloading: http://repo.maven.apache.org/maven2/org/apache/hadoop/hadoop-common/2.4.1/hadoop-common-2.4.1.pom
Downloaded: http://repo.maven.apache.org/maven2/org/apache/hadoop/hadoop-common/2.4.1/hadoop-common-2.4.1.pom (28 KB at 198.5 KB/sec)
Downloading: http://repo.maven.apache.org/maven2/org/apache/hadoop/hadoop-project-dist/2.4.1/hadoop-project-dist-2.4.1.pom
Downloaded: http://repo.maven.apache.org/maven2/org/apache/hadoop/hadoop-project-dist/2.4.1/hadoop-project-dist-2.4.1.pom (18 KB at 243.3 KB/sec)
Downloading: http://repo.maven.apache.org/maven2/org/apache/hadoop/hadoop-project/2.4.1/hadoop-project-2.4.1.pom
Downloaded: http://repo.maven.apache.org/maven2/org/apache/hadoop/hadoop-project/2.4.1/hadoop-project-2.4.1.pom (38 KB at 363.4 KB/sec)
Downloading: http://repo.maven.apache.org/maven2/org/apache/hadoop/hadoop-main/2.4.1/hadoop-main-2.4.1.pom
Downloaded: http://repo.maven.apache.org/maven2/org/apache/hadoop/hadoop-main/2.4.1/hadoop-main-2.4.1.pom (18 KB at 244.8 KB/sec)
Downloading: http://repo.maven.apache.org/maven2/org/apache/hadoop/hadoop-annotations/2.4.1/hadoop-annotations-2.4.1.pom
Downloaded: http://repo.maven.apache.org/maven2/org/apache/hadoop/hadoop-annotations/2.4.1/hadoop-annotations-2.4.1.pom (3 KB at 32.4 KB/sec)
Downloading: http://repo.maven.apache.org/maven2/org/apache/hadoop/hadoop-auth/2.4.1/hadoop-auth-2.4.1.pom
Downloaded: http://repo.maven.apache.org/maven2/org/apache/hadoop/hadoop-auth/2.4.1/hadoop-auth-2.4.1.pom (6 KB at 71.6 KB/sec)
Downloading: http://repo.maven.apache.org/maven2/org/apache/hadoop/hadoop-hdfs/2.4.1/hadoop-hdfs-2.4.1.pom
Downloaded: http://repo.maven.apache.org/maven2/org/apache/hadoop/hadoop-hdfs/2.4.1/hadoop-hdfs-2.4.1.pom (26 KB at 242.7 KB/sec)
Downloading: http://repo.maven.apache.org/maven2/org/apache/hadoop/hadoop-common/2.4.1/hadoop-common-2.4.1.jar
Downloading: http://repo.maven.apache.org/maven2/org/apache/hadoop/hadoop-annotations/2.4.1/hadoop-annotations-2.4.1.jar
Downloading: http://repo.maven.apache.org/maven2/org/apache/hadoop/hadoop-auth/2.4.1/hadoop-auth-2.4.1.jar
Downloading: http://repo.maven.apache.org/maven2/org/apache/hadoop/hadoop-common/2.4.1/hadoop-common-2.4.1-tests.jar
Downloading: http://repo.maven.apache.org/maven2/org/apache/hadoop/hadoop-hdfs/2.4.1/hadoop-hdfs-2.4.1.jar
Downloaded: http://repo.maven.apache.org/maven2/org/apache/hadoop/hadoop-annotations/2.4.1/hadoop-annotations-2.4.1.jar (17 KB at 120.6 KB/sec)
Downloaded: http://repo.maven.apache.org/maven2/org/apache/hadoop/hadoop-auth/2.4.1/hadoop-auth-2.4.1.jar (50 KB at 281.9 KB/sec)
Downloaded: http://repo.maven.apache.org/maven2/org/apache/hadoop/hadoop-common/2.4.1/hadoop-common-2.4.1-tests.jar (1476 KB at 1898.8 KB/sec)
Downloaded: http://repo.maven.apache.org/maven2/org/apache/hadoop/hadoop-common/2.4.1/hadoop-common-2.4.1.jar (2841 KB at 3209.7 KB/sec)
Downloaded: http://repo.maven.apache.org/maven2/org/apache/hadoop/hadoop-hdfs/2.4.1/hadoop-hdfs-2.4.1.jar (6670 KB at 5306.0 KB/sec)
[INFO]
[INFO] --- maven-clean-plugin:2.4.1:clean (default-clean) @ hadoop-smoke ---
[INFO] Deleting <https://builds.apache.org/job/Bigtop-trunk-testartifacts/org.apache.bigtop.itest$hadoop-smoke/ws/target>
[INFO]
[INFO] --- groovy-eclipse-compiler:2.8.0-01:add-groovy-build-paths (default-add-groovy-build-paths) @ hadoop-smoke ---
[INFO] Adding /src/main/groovy to the list of source folders
[INFO] Adding /src/test/groovy to the list of test source folders
[INFO]
[INFO] --- maven-remote-resources-plugin:1.1:process (default) @ hadoop-smoke ---
[INFO]
[INFO] --- maven-resources-plugin:2.4.3:resources (default-resources) @ hadoop-smoke ---
[INFO] Using 'UTF-8' encoding to copy filtered resources.
[INFO] Copying 16 resources
[INFO] Copying 3 resources
[INFO]
[INFO] --- maven-compiler-plugin:3.1:compile (default-compile) @ hadoop-smoke ---
[INFO] Changes detected - recompiling the module!
[INFO] Using Groovy-Eclipse compiler to compile both Java and Groovy files
org.codehaus.groovy.control.messages.SyntaxErrorMessage@1933646
org.codehaus.groovy.control.messages.SyntaxErrorMessage@b37db4
org.codehaus.groovy.control.messages.SyntaxErrorMessage@1c010
/x1/jenkins/jenkins-slave/workspace/Bigtop-trunk-testartifacts/bigtop-tests/test-artifacts/hadoop/src/main/groovy/org/apache/bigtop/itest/hadoop/mapreduce/TestHadoopExamples.groovy: 21 Groovy:unable to resolve class org.apache.bigtop.itest.failures.FailureVars
/x1/jenkins/jenkins-slave/workspace/Bigtop-trunk-testartifacts/bigtop-tests/test-artifacts/hadoop/src/main/groovy/org/apache/bigtop/itest/hadoop/mapreduce/TestHadoopExamples.groovy: 160 Groovy:unable to resolve class FailureExecutor
/x1/jenkins/jenkins-slave/workspace/Bigtop-trunk-testartifacts/bigtop-tests/test-artifacts/hadoop/src/main/groovy/org/apache/bigtop/itest/hadoop/mapreduce/TestHadoopExamples.groovy: 160 Groovy:unable to resolve class FailureExecutor
[INFO] -------------------------------------------------------------
[ERROR] COMPILATION ERROR :
[INFO] -------------------------------------------------------------
[ERROR] /x1/jenkins/jenkins-slave/workspace/Bigtop-trunk-testartifacts/bigtop-tests/test-artifacts/hadoop/src/main/groovy/org/apache/bigtop/itest/hadoop/mapreduce/TestHadoopExamples.groovy:[21,41] 1. ERROR in /x1/jenkins/jenkins-slave/workspace/Bigtop-trunk-testartifacts/bigtop-tests/test-artifacts/hadoop/src/main/groovy/org/apache/bigtop/itest/hadoop/mapreduce/TestHadoopExamples.groovy (at line 21)
import org.apache.bigtop.itest.failures.FailureVars
^^^^^^^^^^^
Groovy:unable to resolve class org.apache.bigtop.itest.failures.FailureVars
[ERROR] /x1/jenkins/jenkins-slave/workspace/Bigtop-trunk-testartifacts/bigtop-tests/test-artifacts/hadoop/src/main/groovy/org/apache/bigtop/itest/hadoop/mapreduce/TestHadoopExamples.groovy:[160,1] 2. ERROR in /x1/jenkins/jenkins-slave/workspace/Bigtop-trunk-testartifacts/bigtop-tests/test-artifacts/hadoop/src/main/groovy/org/apache/bigtop/itest/hadoop/mapreduce/TestHadoopExamples.groovy (at line 160)
FailureExecutor failureExecutor = new FailureExecutor();
^^^^^^^^^^^^^^^
Groovy:unable to resolve class FailureExecutor
[ERROR] /x1/jenkins/jenkins-slave/workspace/Bigtop-trunk-testartifacts/bigtop-tests/test-artifacts/hadoop/src/main/groovy/org/apache/bigtop/itest/hadoop/mapreduce/TestHadoopExamples.groovy:[160,39] 3. ERROR in /x1/jenkins/jenkins-slave/workspace/Bigtop-trunk-testartifacts/bigtop-tests/test-artifacts/hadoop/src/main/groovy/org/apache/bigtop/itest/hadoop/mapreduce/TestHadoopExamples.groovy (at line 160)
FailureExecutor failureExecutor = new FailureExecutor();
^^^^^^^^^^^^^^^
Groovy:unable to resolve class FailureExecutor
[ERROR] Found 3 errors and 0 warnings.
[INFO] 4 errors
[INFO] -------------------------------------------------------------
Build failed in Jenkins: Bigtop-trunk-testartifacts » hadoopsmoke #1522
Posted by Apache Jenkins Server <je...@builds.apache.org>.
See <https://builds.apache.org/job/Bigtop-trunk-testartifacts/org.apache.bigtop.itest$hadoop-smoke/1522/>
------------------------------------------
[INFO]
[INFO] ------------------------------------------------------------------------
[INFO] Building hadoopsmoke 0.9.0-SNAPSHOT
[INFO] ------------------------------------------------------------------------
[INFO]
[INFO] --- maven-clean-plugin:2.4.1:clean (default-clean) @ hadoop-smoke ---
[INFO] Deleting <https://builds.apache.org/job/Bigtop-trunk-testartifacts/org.apache.bigtop.itest$hadoop-smoke/ws/target>
[INFO]
[INFO] --- groovy-eclipse-compiler:2.8.0-01:add-groovy-build-paths (default-add-groovy-build-paths) @ hadoop-smoke ---
[INFO] Adding /src/main/groovy to the list of source folders
[INFO] Adding /src/test/groovy to the list of test source folders
[INFO]
[INFO] --- maven-remote-resources-plugin:1.1:process (default) @ hadoop-smoke ---
[INFO]
[INFO] --- maven-resources-plugin:2.4.3:resources (default-resources) @ hadoop-smoke ---
[INFO] Using 'UTF-8' encoding to copy filtered resources.
[INFO] Copying 16 resources
[INFO] Copying 3 resources
[INFO]
[INFO] --- maven-compiler-plugin:3.1:compile (default-compile) @ hadoop-smoke ---
[INFO] Changes detected - recompiling the module!
[INFO] Using Groovy-Eclipse compiler to compile both Java and Groovy files
org.codehaus.groovy.control.messages.SyntaxErrorMessage@105e45c
org.codehaus.groovy.control.messages.SyntaxErrorMessage@1b165c3
<https://builds.apache.org/job/Bigtop-trunk-testartifacts/org.apache.bigtop.itest$hadoop-smoke/ws/src/main/groovy/org/apache/bigtop/itest/hadoop/mapreduce/TestHadoopExamples.groovy>: 160 Groovy:unable to resolve class FailureExecutor
<https://builds.apache.org/job/Bigtop-trunk-testartifacts/org.apache.bigtop.itest$hadoop-smoke/ws/src/main/groovy/org/apache/bigtop/itest/hadoop/mapreduce/TestHadoopExamples.groovy>: 160 Groovy:unable to resolve class FailureExecutor
[INFO] -------------------------------------------------------------
[ERROR] COMPILATION ERROR :
[INFO] -------------------------------------------------------------
[ERROR] <https://builds.apache.org/job/Bigtop-trunk-testartifacts/org.apache.bigtop.itest$hadoop-smoke/ws/src/main/groovy/org/apache/bigtop/itest/hadoop/mapreduce/TestHadoopExamples.groovy>:[160,1] 1. ERROR in <https://builds.apache.org/job/Bigtop-trunk-testartifacts/org.apache.bigtop.itest$hadoop-smoke/ws/src/main/groovy/org/apache/bigtop/itest/hadoop/mapreduce/TestHadoopExamples.groovy> (at line 160)
FailureExecutor failureExecutor = new FailureExecutor();
^^^^^^^^^^^^^^^
Groovy:unable to resolve class FailureExecutor
[ERROR] <https://builds.apache.org/job/Bigtop-trunk-testartifacts/org.apache.bigtop.itest$hadoop-smoke/ws/src/main/groovy/org/apache/bigtop/itest/hadoop/mapreduce/TestHadoopExamples.groovy>:[160,39] 2. ERROR in <https://builds.apache.org/job/Bigtop-trunk-testartifacts/org.apache.bigtop.itest$hadoop-smoke/ws/src/main/groovy/org/apache/bigtop/itest/hadoop/mapreduce/TestHadoopExamples.groovy> (at line 160)
FailureExecutor failureExecutor = new FailureExecutor();
^^^^^^^^^^^^^^^
Groovy:unable to resolve class FailureExecutor
[ERROR] Found 2 errors and 0 warnings.
[INFO] 3 errors
[INFO] -------------------------------------------------------------
Build failed in Jenkins: Bigtop-trunk-testartifacts » hadoopsmoke #1521
Posted by Apache Jenkins Server <je...@builds.apache.org>.
See <https://builds.apache.org/job/Bigtop-trunk-testartifacts/org.apache.bigtop.itest$hadoop-smoke/1521/>
------------------------------------------
[INFO]
[INFO] ------------------------------------------------------------------------
[INFO] Building hadoopsmoke 0.9.0-SNAPSHOT
[INFO] ------------------------------------------------------------------------
Downloading: http://repo.maven.apache.org/maven2/org/apache/maven/plugins/maven-surefire-plugin/2.7/maven-surefire-plugin-2.7.pom
Downloaded: http://repo.maven.apache.org/maven2/org/apache/maven/plugins/maven-surefire-plugin/2.7/maven-surefire-plugin-2.7.pom (10 KB at 35.7 KB/sec)
Downloading: http://repo.maven.apache.org/maven2/org/apache/maven/surefire/surefire/2.7/surefire-2.7.pom
Downloaded: http://repo.maven.apache.org/maven2/org/apache/maven/surefire/surefire/2.7/surefire-2.7.pom (9 KB at 68.6 KB/sec)
Downloading: http://repo.maven.apache.org/maven2/org/apache/maven/plugins/maven-surefire-plugin/2.7/maven-surefire-plugin-2.7.jar
Downloaded: http://repo.maven.apache.org/maven2/org/apache/maven/plugins/maven-surefire-plugin/2.7/maven-surefire-plugin-2.7.jar (29 KB at 148.7 KB/sec)
Downloading: http://repo.maven.apache.org/maven2/org/apache/hadoop/hadoop-common/2.4.1/hadoop-common-2.4.1.pom
Downloaded: http://repo.maven.apache.org/maven2/org/apache/hadoop/hadoop-common/2.4.1/hadoop-common-2.4.1.pom (28 KB at 143.9 KB/sec)
Downloading: http://repo.maven.apache.org/maven2/org/apache/hadoop/hadoop-project-dist/2.4.1/hadoop-project-dist-2.4.1.pom
Downloaded: http://repo.maven.apache.org/maven2/org/apache/hadoop/hadoop-project-dist/2.4.1/hadoop-project-dist-2.4.1.pom (18 KB at 132.9 KB/sec)
Downloading: http://repo.maven.apache.org/maven2/org/apache/hadoop/hadoop-project/2.4.1/hadoop-project-2.4.1.pom
Downloaded: http://repo.maven.apache.org/maven2/org/apache/hadoop/hadoop-project/2.4.1/hadoop-project-2.4.1.pom (38 KB at 199.9 KB/sec)
Downloading: http://repo.maven.apache.org/maven2/org/apache/hadoop/hadoop-main/2.4.1/hadoop-main-2.4.1.pom
Downloaded: http://repo.maven.apache.org/maven2/org/apache/hadoop/hadoop-main/2.4.1/hadoop-main-2.4.1.pom (18 KB at 137.7 KB/sec)
Downloading: http://repo.maven.apache.org/maven2/org/apache/hadoop/hadoop-annotations/2.4.1/hadoop-annotations-2.4.1.pom
Downloaded: http://repo.maven.apache.org/maven2/org/apache/hadoop/hadoop-annotations/2.4.1/hadoop-annotations-2.4.1.pom (3 KB at 18.2 KB/sec)
Downloading: http://repo.maven.apache.org/maven2/org/apache/hadoop/hadoop-auth/2.4.1/hadoop-auth-2.4.1.pom
Downloaded: http://repo.maven.apache.org/maven2/org/apache/hadoop/hadoop-auth/2.4.1/hadoop-auth-2.4.1.pom (6 KB at 41.1 KB/sec)
Downloading: http://repo.maven.apache.org/maven2/org/apache/hadoop/hadoop-hdfs/2.4.1/hadoop-hdfs-2.4.1.pom
Downloaded: http://repo.maven.apache.org/maven2/org/apache/hadoop/hadoop-hdfs/2.4.1/hadoop-hdfs-2.4.1.pom (26 KB at 196.0 KB/sec)
Downloading: http://repo.maven.apache.org/maven2/org/apache/hadoop/hadoop-common/2.4.1/hadoop-common-2.4.1.jar
Downloading: http://repo.maven.apache.org/maven2/org/apache/hadoop/hadoop-annotations/2.4.1/hadoop-annotations-2.4.1.jar
Downloading: http://repo.maven.apache.org/maven2/org/apache/hadoop/hadoop-auth/2.4.1/hadoop-auth-2.4.1.jar
Downloading: http://repo.maven.apache.org/maven2/org/apache/hadoop/hadoop-common/2.4.1/hadoop-common-2.4.1-tests.jar
Downloading: http://repo.maven.apache.org/maven2/org/apache/hadoop/hadoop-hdfs/2.4.1/hadoop-hdfs-2.4.1.jar
Downloaded: http://repo.maven.apache.org/maven2/org/apache/hadoop/hadoop-annotations/2.4.1/hadoop-annotations-2.4.1.jar (17 KB at 66.0 KB/sec)
Downloaded: http://repo.maven.apache.org/maven2/org/apache/hadoop/hadoop-auth/2.4.1/hadoop-auth-2.4.1.jar (50 KB at 158.1 KB/sec)
Downloaded: http://repo.maven.apache.org/maven2/org/apache/hadoop/hadoop-common/2.4.1/hadoop-common-2.4.1-tests.jar (1476 KB at 1362.3 KB/sec)
Downloaded: http://repo.maven.apache.org/maven2/org/apache/hadoop/hadoop-common/2.4.1/hadoop-common-2.4.1.jar (2841 KB at 2190.1 KB/sec)
Downloaded: http://repo.maven.apache.org/maven2/org/apache/hadoop/hadoop-hdfs/2.4.1/hadoop-hdfs-2.4.1.jar (6670 KB at 3744.9 KB/sec)
[INFO]
[INFO] --- maven-clean-plugin:2.4.1:clean (default-clean) @ hadoop-smoke ---
[INFO] Deleting <https://builds.apache.org/job/Bigtop-trunk-testartifacts/org.apache.bigtop.itest$hadoop-smoke/ws/target>
[INFO]
[INFO] --- groovy-eclipse-compiler:2.8.0-01:add-groovy-build-paths (default-add-groovy-build-paths) @ hadoop-smoke ---
[INFO] Adding /src/main/groovy to the list of source folders
[INFO] Adding /src/test/groovy to the list of test source folders
[INFO]
[INFO] --- maven-remote-resources-plugin:1.1:process (default) @ hadoop-smoke ---
[INFO]
[INFO] --- maven-resources-plugin:2.4.3:resources (default-resources) @ hadoop-smoke ---
[INFO] Using 'UTF-8' encoding to copy filtered resources.
[INFO] Copying 16 resources
[INFO] Copying 3 resources
[INFO]
[INFO] --- maven-compiler-plugin:3.1:compile (default-compile) @ hadoop-smoke ---
[INFO] Changes detected - recompiling the module!
[INFO] Using Groovy-Eclipse compiler to compile both Java and Groovy files
org.codehaus.groovy.control.messages.SyntaxErrorMessage@18b92d6
org.codehaus.groovy.control.messages.SyntaxErrorMessage@554866
<https://builds.apache.org/job/Bigtop-trunk-testartifacts/org.apache.bigtop.itest$hadoop-smoke/ws/src/main/groovy/org/apache/bigtop/itest/hadoop/mapreduce/TestHadoopExamples.groovy>: 160 Groovy:unable to resolve class FailureExecutor
<https://builds.apache.org/job/Bigtop-trunk-testartifacts/org.apache.bigtop.itest$hadoop-smoke/ws/src/main/groovy/org/apache/bigtop/itest/hadoop/mapreduce/TestHadoopExamples.groovy>: 160 Groovy:unable to resolve class FailureExecutor
[INFO] -------------------------------------------------------------
[ERROR] COMPILATION ERROR :
[INFO] -------------------------------------------------------------
[ERROR] <https://builds.apache.org/job/Bigtop-trunk-testartifacts/org.apache.bigtop.itest$hadoop-smoke/ws/src/main/groovy/org/apache/bigtop/itest/hadoop/mapreduce/TestHadoopExamples.groovy>:[160,1] 1. ERROR in <https://builds.apache.org/job/Bigtop-trunk-testartifacts/org.apache.bigtop.itest$hadoop-smoke/ws/src/main/groovy/org/apache/bigtop/itest/hadoop/mapreduce/TestHadoopExamples.groovy> (at line 160)
FailureExecutor failureExecutor = new FailureExecutor();
^^^^^^^^^^^^^^^
Groovy:unable to resolve class FailureExecutor
[ERROR] <https://builds.apache.org/job/Bigtop-trunk-testartifacts/org.apache.bigtop.itest$hadoop-smoke/ws/src/main/groovy/org/apache/bigtop/itest/hadoop/mapreduce/TestHadoopExamples.groovy>:[160,39] 2. ERROR in <https://builds.apache.org/job/Bigtop-trunk-testartifacts/org.apache.bigtop.itest$hadoop-smoke/ws/src/main/groovy/org/apache/bigtop/itest/hadoop/mapreduce/TestHadoopExamples.groovy> (at line 160)
FailureExecutor failureExecutor = new FailureExecutor();
^^^^^^^^^^^^^^^
Groovy:unable to resolve class FailureExecutor
[ERROR] Found 2 errors and 0 warnings.
[INFO] 3 errors
[INFO] -------------------------------------------------------------
Build failed in Jenkins: Bigtop-trunk-testartifacts » hadoopsmoke #1520
Posted by Apache Jenkins Server <je...@builds.apache.org>.
See <https://builds.apache.org/job/Bigtop-trunk-testartifacts/org.apache.bigtop.itest$hadoop-smoke/1520/>
------------------------------------------
[INFO]
[INFO] ------------------------------------------------------------------------
[INFO] Building hadoopsmoke 0.9.0-SNAPSHOT
[INFO] ------------------------------------------------------------------------
Downloading: http://repo.maven.apache.org/maven2/org/apache/maven/plugins/maven-surefire-plugin/2.7/maven-surefire-plugin-2.7.pom
Downloaded: http://repo.maven.apache.org/maven2/org/apache/maven/plugins/maven-surefire-plugin/2.7/maven-surefire-plugin-2.7.pom (10 KB at 21.6 KB/sec)
Downloading: http://repo.maven.apache.org/maven2/org/apache/maven/surefire/surefire/2.7/surefire-2.7.pom
Downloaded: http://repo.maven.apache.org/maven2/org/apache/maven/surefire/surefire/2.7/surefire-2.7.pom (9 KB at 162.0 KB/sec)
Downloading: http://repo.maven.apache.org/maven2/org/apache/maven/plugins/maven-surefire-plugin/2.7/maven-surefire-plugin-2.7.jar
Downloaded: http://repo.maven.apache.org/maven2/org/apache/maven/plugins/maven-surefire-plugin/2.7/maven-surefire-plugin-2.7.jar (29 KB at 360.4 KB/sec)
Downloading: http://repo.maven.apache.org/maven2/org/apache/hadoop/hadoop-common/2.4.1/hadoop-common-2.4.1.pom
Downloaded: http://repo.maven.apache.org/maven2/org/apache/hadoop/hadoop-common/2.4.1/hadoop-common-2.4.1.pom (28 KB at 344.3 KB/sec)
Downloading: http://repo.maven.apache.org/maven2/org/apache/hadoop/hadoop-project-dist/2.4.1/hadoop-project-dist-2.4.1.pom
Downloaded: http://repo.maven.apache.org/maven2/org/apache/hadoop/hadoop-project-dist/2.4.1/hadoop-project-dist-2.4.1.pom (18 KB at 308.5 KB/sec)
Downloading: http://repo.maven.apache.org/maven2/org/apache/hadoop/hadoop-project/2.4.1/hadoop-project-2.4.1.pom
Downloaded: http://repo.maven.apache.org/maven2/org/apache/hadoop/hadoop-project/2.4.1/hadoop-project-2.4.1.pom (38 KB at 478.3 KB/sec)
Downloading: http://repo.maven.apache.org/maven2/org/apache/hadoop/hadoop-main/2.4.1/hadoop-main-2.4.1.pom
Downloaded: http://repo.maven.apache.org/maven2/org/apache/hadoop/hadoop-main/2.4.1/hadoop-main-2.4.1.pom (18 KB at 314.7 KB/sec)
Downloading: http://repo.maven.apache.org/maven2/org/apache/hadoop/hadoop-annotations/2.4.1/hadoop-annotations-2.4.1.pom
Downloaded: http://repo.maven.apache.org/maven2/org/apache/hadoop/hadoop-annotations/2.4.1/hadoop-annotations-2.4.1.pom (3 KB at 41.6 KB/sec)
Downloading: http://repo.maven.apache.org/maven2/org/apache/hadoop/hadoop-auth/2.4.1/hadoop-auth-2.4.1.pom
Downloaded: http://repo.maven.apache.org/maven2/org/apache/hadoop/hadoop-auth/2.4.1/hadoop-auth-2.4.1.pom (6 KB at 96.3 KB/sec)
Downloading: http://repo.maven.apache.org/maven2/org/apache/hadoop/hadoop-hdfs/2.4.1/hadoop-hdfs-2.4.1.pom
Downloaded: http://repo.maven.apache.org/maven2/org/apache/hadoop/hadoop-hdfs/2.4.1/hadoop-hdfs-2.4.1.pom (26 KB at 455.1 KB/sec)
Downloading: http://repo.maven.apache.org/maven2/org/apache/hadoop/hadoop-common/2.4.1/hadoop-common-2.4.1.jar
Downloading: http://repo.maven.apache.org/maven2/org/apache/hadoop/hadoop-annotations/2.4.1/hadoop-annotations-2.4.1.jar
Downloading: http://repo.maven.apache.org/maven2/org/apache/hadoop/hadoop-auth/2.4.1/hadoop-auth-2.4.1.jar
Downloading: http://repo.maven.apache.org/maven2/org/apache/hadoop/hadoop-common/2.4.1/hadoop-common-2.4.1-tests.jar
Downloading: http://repo.maven.apache.org/maven2/org/apache/hadoop/hadoop-hdfs/2.4.1/hadoop-hdfs-2.4.1.jar
Downloaded: http://repo.maven.apache.org/maven2/org/apache/hadoop/hadoop-annotations/2.4.1/hadoop-annotations-2.4.1.jar (17 KB at 158.5 KB/sec)
Downloaded: http://repo.maven.apache.org/maven2/org/apache/hadoop/hadoop-auth/2.4.1/hadoop-auth-2.4.1.jar (50 KB at 360.2 KB/sec)
Downloaded: http://repo.maven.apache.org/maven2/org/apache/hadoop/hadoop-common/2.4.1/hadoop-common-2.4.1.jar (2841 KB at 5155.3 KB/sec)
Downloaded: http://repo.maven.apache.org/maven2/org/apache/hadoop/hadoop-hdfs/2.4.1/hadoop-hdfs-2.4.1.jar (6670 KB at 8617.1 KB/sec)
Downloaded: http://repo.maven.apache.org/maven2/org/apache/hadoop/hadoop-common/2.4.1/hadoop-common-2.4.1-tests.jar (1476 KB at 1886.7 KB/sec)
[INFO]
[INFO] --- maven-clean-plugin:2.4.1:clean (default-clean) @ hadoop-smoke ---
[INFO] Deleting <https://builds.apache.org/job/Bigtop-trunk-testartifacts/org.apache.bigtop.itest$hadoop-smoke/ws/target>
[INFO]
[INFO] --- groovy-eclipse-compiler:2.8.0-01:add-groovy-build-paths (default-add-groovy-build-paths) @ hadoop-smoke ---
[INFO] Adding /src/main/groovy to the list of source folders
[INFO] Adding /src/test/groovy to the list of test source folders
[INFO]
[INFO] --- maven-remote-resources-plugin:1.1:process (default) @ hadoop-smoke ---
[INFO]
[INFO] --- maven-resources-plugin:2.4.3:resources (default-resources) @ hadoop-smoke ---
[INFO] Using 'UTF-8' encoding to copy filtered resources.
[INFO] Copying 16 resources
[INFO] Copying 3 resources
[INFO]
[INFO] --- maven-compiler-plugin:3.1:compile (default-compile) @ hadoop-smoke ---
Downloading: http://repo.maven.apache.org/maven2/org/codehaus/groovy/groovy-eclipse-batch/2.1.8-01/groovy-eclipse-batch-2.1.8-01.jar
Downloaded: http://repo.maven.apache.org/maven2/org/codehaus/groovy/groovy-eclipse-batch/2.1.8-01/groovy-eclipse-batch-2.1.8-01.jar (13908 KB at 21528.6 KB/sec)
[INFO] Changes detected - recompiling the module!
[INFO] Using Groovy-Eclipse compiler to compile both Java and Groovy files
org.codehaus.groovy.control.messages.SyntaxErrorMessage@18f3c0
org.codehaus.groovy.control.messages.SyntaxErrorMessage@2afbbe
<https://builds.apache.org/job/Bigtop-trunk-testartifacts/org.apache.bigtop.itest$hadoop-smoke/ws/src/main/groovy/org/apache/bigtop/itest/hadoop/mapreduce/TestHadoopExamples.groovy>: 160 Groovy:unable to resolve class FailureExecutor
<https://builds.apache.org/job/Bigtop-trunk-testartifacts/org.apache.bigtop.itest$hadoop-smoke/ws/src/main/groovy/org/apache/bigtop/itest/hadoop/mapreduce/TestHadoopExamples.groovy>: 160 Groovy:unable to resolve class FailureExecutor
[INFO] -------------------------------------------------------------
[ERROR] COMPILATION ERROR :
[INFO] -------------------------------------------------------------
[ERROR] <https://builds.apache.org/job/Bigtop-trunk-testartifacts/org.apache.bigtop.itest$hadoop-smoke/ws/src/main/groovy/org/apache/bigtop/itest/hadoop/mapreduce/TestHadoopExamples.groovy>:[160,1] 1. ERROR in <https://builds.apache.org/job/Bigtop-trunk-testartifacts/org.apache.bigtop.itest$hadoop-smoke/ws/src/main/groovy/org/apache/bigtop/itest/hadoop/mapreduce/TestHadoopExamples.groovy> (at line 160)
FailureExecutor failureExecutor = new FailureExecutor();
^^^^^^^^^^^^^^^
Groovy:unable to resolve class FailureExecutor
[ERROR] <https://builds.apache.org/job/Bigtop-trunk-testartifacts/org.apache.bigtop.itest$hadoop-smoke/ws/src/main/groovy/org/apache/bigtop/itest/hadoop/mapreduce/TestHadoopExamples.groovy>:[160,39] 2. ERROR in <https://builds.apache.org/job/Bigtop-trunk-testartifacts/org.apache.bigtop.itest$hadoop-smoke/ws/src/main/groovy/org/apache/bigtop/itest/hadoop/mapreduce/TestHadoopExamples.groovy> (at line 160)
FailureExecutor failureExecutor = new FailureExecutor();
^^^^^^^^^^^^^^^
Groovy:unable to resolve class FailureExecutor
[ERROR] Found 2 errors and 0 warnings.
[INFO] 3 errors
[INFO] -------------------------------------------------------------
Build failed in Jenkins: Bigtop-trunk-testartifacts » hadoopsmoke #1519
Posted by Apache Jenkins Server <je...@builds.apache.org>.
See <https://builds.apache.org/job/Bigtop-trunk-testartifacts/org.apache.bigtop.itest$hadoop-smoke/1519/>
------------------------------------------
[INFO]
[INFO] ------------------------------------------------------------------------
[INFO] Building hadoopsmoke 0.9.0-SNAPSHOT
[INFO] ------------------------------------------------------------------------
[INFO]
[INFO] --- maven-clean-plugin:2.4.1:clean (default-clean) @ hadoop-smoke ---
[INFO] Deleting <https://builds.apache.org/job/Bigtop-trunk-testartifacts/org.apache.bigtop.itest$hadoop-smoke/ws/target>
[INFO]
[INFO] --- groovy-eclipse-compiler:2.8.0-01:add-groovy-build-paths (default-add-groovy-build-paths) @ hadoop-smoke ---
[INFO] Adding /src/main/groovy to the list of source folders
[INFO] Adding /src/test/groovy to the list of test source folders
[INFO]
[INFO] --- maven-remote-resources-plugin:1.1:process (default) @ hadoop-smoke ---
[INFO]
[INFO] --- maven-resources-plugin:2.4.3:resources (default-resources) @ hadoop-smoke ---
[INFO] Using 'UTF-8' encoding to copy filtered resources.
[INFO] Copying 16 resources
[INFO] Copying 3 resources
[INFO]
[INFO] --- maven-compiler-plugin:3.1:compile (default-compile) @ hadoop-smoke ---
[INFO] Changes detected - recompiling the module!
[INFO] Using Groovy-Eclipse compiler to compile both Java and Groovy files
org.codehaus.groovy.control.messages.SyntaxErrorMessage@a79f01
org.codehaus.groovy.control.messages.SyntaxErrorMessage@b83261
<https://builds.apache.org/job/Bigtop-trunk-testartifacts/org.apache.bigtop.itest$hadoop-smoke/ws/src/main/groovy/org/apache/bigtop/itest/hadoop/mapreduce/TestHadoopExamples.groovy>: 160 Groovy:unable to resolve class FailureExecutor
<https://builds.apache.org/job/Bigtop-trunk-testartifacts/org.apache.bigtop.itest$hadoop-smoke/ws/src/main/groovy/org/apache/bigtop/itest/hadoop/mapreduce/TestHadoopExamples.groovy>: 160 Groovy:unable to resolve class FailureExecutor
[INFO] -------------------------------------------------------------
[ERROR] COMPILATION ERROR :
[INFO] -------------------------------------------------------------
[ERROR] <https://builds.apache.org/job/Bigtop-trunk-testartifacts/org.apache.bigtop.itest$hadoop-smoke/ws/src/main/groovy/org/apache/bigtop/itest/hadoop/mapreduce/TestHadoopExamples.groovy>:[160,1] 1. ERROR in <https://builds.apache.org/job/Bigtop-trunk-testartifacts/org.apache.bigtop.itest$hadoop-smoke/ws/src/main/groovy/org/apache/bigtop/itest/hadoop/mapreduce/TestHadoopExamples.groovy> (at line 160)
FailureExecutor failureExecutor = new FailureExecutor();
^^^^^^^^^^^^^^^
Groovy:unable to resolve class FailureExecutor
[ERROR] <https://builds.apache.org/job/Bigtop-trunk-testartifacts/org.apache.bigtop.itest$hadoop-smoke/ws/src/main/groovy/org/apache/bigtop/itest/hadoop/mapreduce/TestHadoopExamples.groovy>:[160,39] 2. ERROR in <https://builds.apache.org/job/Bigtop-trunk-testartifacts/org.apache.bigtop.itest$hadoop-smoke/ws/src/main/groovy/org/apache/bigtop/itest/hadoop/mapreduce/TestHadoopExamples.groovy> (at line 160)
FailureExecutor failureExecutor = new FailureExecutor();
^^^^^^^^^^^^^^^
Groovy:unable to resolve class FailureExecutor
[ERROR] Found 2 errors and 0 warnings.
[INFO] 3 errors
[INFO] -------------------------------------------------------------
Build failed in Jenkins: Bigtop-trunk-testartifacts » hadoopsmoke #1518
Posted by Apache Jenkins Server <je...@builds.apache.org>.
See <https://builds.apache.org/job/Bigtop-trunk-testartifacts/org.apache.bigtop.itest$hadoop-smoke/1518/>
------------------------------------------
[INFO]
[INFO] ------------------------------------------------------------------------
[INFO] Building hadoopsmoke 0.9.0-SNAPSHOT
[INFO] ------------------------------------------------------------------------
Downloading: http://repo.maven.apache.org/maven2/org/apache/hadoop/hadoop-common/2.4.1/hadoop-common-2.4.1.pom
Downloaded: http://repo.maven.apache.org/maven2/org/apache/hadoop/hadoop-common/2.4.1/hadoop-common-2.4.1.pom (28 KB at 194.3 KB/sec)
Downloading: http://repo.maven.apache.org/maven2/org/apache/hadoop/hadoop-project-dist/2.4.1/hadoop-project-dist-2.4.1.pom
Downloaded: http://repo.maven.apache.org/maven2/org/apache/hadoop/hadoop-project-dist/2.4.1/hadoop-project-dist-2.4.1.pom (18 KB at 233.5 KB/sec)
Downloading: http://repo.maven.apache.org/maven2/org/apache/hadoop/hadoop-project/2.4.1/hadoop-project-2.4.1.pom
Downloaded: http://repo.maven.apache.org/maven2/org/apache/hadoop/hadoop-project/2.4.1/hadoop-project-2.4.1.pom (38 KB at 356.5 KB/sec)
Downloading: http://repo.maven.apache.org/maven2/org/apache/hadoop/hadoop-main/2.4.1/hadoop-main-2.4.1.pom
Downloaded: http://repo.maven.apache.org/maven2/org/apache/hadoop/hadoop-main/2.4.1/hadoop-main-2.4.1.pom (18 KB at 241.4 KB/sec)
Downloading: http://repo.maven.apache.org/maven2/org/apache/hadoop/hadoop-annotations/2.4.1/hadoop-annotations-2.4.1.pom
Downloaded: http://repo.maven.apache.org/maven2/org/apache/hadoop/hadoop-annotations/2.4.1/hadoop-annotations-2.4.1.pom (3 KB at 31.5 KB/sec)
Downloading: http://repo.maven.apache.org/maven2/org/apache/hadoop/hadoop-auth/2.4.1/hadoop-auth-2.4.1.pom
Downloaded: http://repo.maven.apache.org/maven2/org/apache/hadoop/hadoop-auth/2.4.1/hadoop-auth-2.4.1.pom (6 KB at 71.6 KB/sec)
Downloading: http://repo.maven.apache.org/maven2/org/apache/hadoop/hadoop-hdfs/2.4.1/hadoop-hdfs-2.4.1.pom
Downloaded: http://repo.maven.apache.org/maven2/org/apache/hadoop/hadoop-hdfs/2.4.1/hadoop-hdfs-2.4.1.pom (26 KB at 240.4 KB/sec)
Downloading: http://repo.maven.apache.org/maven2/org/apache/hadoop/hadoop-common/2.4.1/hadoop-common-2.4.1.jar
Downloading: http://repo.maven.apache.org/maven2/org/apache/hadoop/hadoop-annotations/2.4.1/hadoop-annotations-2.4.1.jar
Downloading: http://repo.maven.apache.org/maven2/org/apache/hadoop/hadoop-auth/2.4.1/hadoop-auth-2.4.1.jar
Downloading: http://repo.maven.apache.org/maven2/org/apache/hadoop/hadoop-common/2.4.1/hadoop-common-2.4.1-tests.jar
Downloading: http://repo.maven.apache.org/maven2/org/apache/hadoop/hadoop-hdfs/2.4.1/hadoop-hdfs-2.4.1.jar
Downloaded: http://repo.maven.apache.org/maven2/org/apache/hadoop/hadoop-annotations/2.4.1/hadoop-annotations-2.4.1.jar (17 KB at 111.7 KB/sec)
Downloaded: http://repo.maven.apache.org/maven2/org/apache/hadoop/hadoop-auth/2.4.1/hadoop-auth-2.4.1.jar (50 KB at 269.6 KB/sec)
Downloaded: http://repo.maven.apache.org/maven2/org/apache/hadoop/hadoop-common/2.4.1/hadoop-common-2.4.1.jar (2841 KB at 4098.9 KB/sec)
Downloaded: http://repo.maven.apache.org/maven2/org/apache/hadoop/hadoop-common/2.4.1/hadoop-common-2.4.1-tests.jar (1476 KB at 2119.8 KB/sec)
Downloaded: http://repo.maven.apache.org/maven2/org/apache/hadoop/hadoop-hdfs/2.4.1/hadoop-hdfs-2.4.1.jar (6670 KB at 6210.1 KB/sec)
[INFO]
[INFO] --- maven-clean-plugin:2.4.1:clean (default-clean) @ hadoop-smoke ---
[INFO] Deleting <https://builds.apache.org/job/Bigtop-trunk-testartifacts/org.apache.bigtop.itest$hadoop-smoke/ws/target>
[INFO]
[INFO] --- groovy-eclipse-compiler:2.8.0-01:add-groovy-build-paths (default-add-groovy-build-paths) @ hadoop-smoke ---
[INFO] Adding /src/main/groovy to the list of source folders
[INFO] Adding /src/test/groovy to the list of test source folders
[INFO]
[INFO] --- maven-remote-resources-plugin:1.1:process (default) @ hadoop-smoke ---
[INFO]
[INFO] --- maven-resources-plugin:2.4.3:resources (default-resources) @ hadoop-smoke ---
[INFO] Using 'UTF-8' encoding to copy filtered resources.
[INFO] Copying 16 resources
[INFO] Copying 3 resources
[INFO]
[INFO] --- maven-compiler-plugin:3.1:compile (default-compile) @ hadoop-smoke ---
[INFO] Changes detected - recompiling the module!
[INFO] Using Groovy-Eclipse compiler to compile both Java and Groovy files
org.codehaus.groovy.control.messages.SyntaxErrorMessage@11f578c
org.codehaus.groovy.control.messages.SyntaxErrorMessage@acb63d
<https://builds.apache.org/job/Bigtop-trunk-testartifacts/org.apache.bigtop.itest$hadoop-smoke/ws/src/main/groovy/org/apache/bigtop/itest/hadoop/mapreduce/TestHadoopExamples.groovy>: 160 Groovy:unable to resolve class FailureExecutor
<https://builds.apache.org/job/Bigtop-trunk-testartifacts/org.apache.bigtop.itest$hadoop-smoke/ws/src/main/groovy/org/apache/bigtop/itest/hadoop/mapreduce/TestHadoopExamples.groovy>: 160 Groovy:unable to resolve class FailureExecutor
[INFO] -------------------------------------------------------------
[ERROR] COMPILATION ERROR :
[INFO] -------------------------------------------------------------
[ERROR] <https://builds.apache.org/job/Bigtop-trunk-testartifacts/org.apache.bigtop.itest$hadoop-smoke/ws/src/main/groovy/org/apache/bigtop/itest/hadoop/mapreduce/TestHadoopExamples.groovy>:[160,1] 1. ERROR in <https://builds.apache.org/job/Bigtop-trunk-testartifacts/org.apache.bigtop.itest$hadoop-smoke/ws/src/main/groovy/org/apache/bigtop/itest/hadoop/mapreduce/TestHadoopExamples.groovy> (at line 160)
FailureExecutor failureExecutor = new FailureExecutor();
^^^^^^^^^^^^^^^
Groovy:unable to resolve class FailureExecutor
[ERROR] <https://builds.apache.org/job/Bigtop-trunk-testartifacts/org.apache.bigtop.itest$hadoop-smoke/ws/src/main/groovy/org/apache/bigtop/itest/hadoop/mapreduce/TestHadoopExamples.groovy>:[160,39] 2. ERROR in <https://builds.apache.org/job/Bigtop-trunk-testartifacts/org.apache.bigtop.itest$hadoop-smoke/ws/src/main/groovy/org/apache/bigtop/itest/hadoop/mapreduce/TestHadoopExamples.groovy> (at line 160)
FailureExecutor failureExecutor = new FailureExecutor();
^^^^^^^^^^^^^^^
Groovy:unable to resolve class FailureExecutor
[ERROR] Found 2 errors and 0 warnings.
[INFO] 3 errors
[INFO] -------------------------------------------------------------