You are viewing a plain text version of this content. The canonical link for it is here.
Posted to dev@kafka.apache.org by Apache Jenkins Server <je...@builds.apache.org> on 2015/08/19 11:11:29 UTC
Build failed in Jenkins: Kafka-trunk #591
See <https://builds.apache.org/job/Kafka-trunk/591/changes>
Changes:
[junrao] kafka-1690; Add SSL support to Kafka Broker, Producer and Consumer; patched by Sriharsha Chintalapani; reviewed Rajini Sivaram, Joel Koshy, Michael Herstine, Ismael Juma, Dong Lin, Jiangjie Qin and Jun Rao
------------------------------------------
[...truncated 1559 lines...]
kafka.coordinator.ConsumerCoordinatorResponseTest > testJoinGroupUnknownConsumerExistingGroup PASSED
kafka.integration.TopicMetadataTest > testAliveBrokersListWithNoTopicsAfterNewBrokerStartup PASSED
kafka.coordinator.ConsumerCoordinatorResponseTest > testJoinGroupSessionTimeoutTooSmall PASSED
kafka.log.LogTest > testOpenDeletesObsoleteFiles PASSED
kafka.log.LogTest > testAppendMessageWithNullPayload PASSED
kafka.coordinator.ConsumerCoordinatorResponseTest > testJoinGroupWrongCoordinator PASSED
kafka.admin.DeleteConsumerGroupTest > testTopicWideDeleteInZK PASSED
kafka.coordinator.ConsumerCoordinatorResponseTest > testHeartbeatUnknownGroup PASSED
kafka.coordinator.ConsumerCoordinatorResponseTest > testValidHeartbeat PASSED
kafka.coordinator.ConsumerCoordinatorResponseTest > testJoinGroupUnknownConsumerNewGroup PASSED
kafka.coordinator.ConsumerCoordinatorResponseTest > testHeartbeatDuringRebalanceCausesIllegalGeneration PASSED
kafka.coordinator.ConsumerCoordinatorResponseTest > testHeartbeatIllegalGeneration PASSED
kafka.coordinator.ConsumerCoordinatorResponseTest > testHeartbeatUnknownConsumerExistingGroup PASSED
kafka.coordinator.ConsumerCoordinatorResponseTest > testGenerationIdIncrementsOnRebalance PASSED
kafka.api.ProducerBounceTest > testBrokerFailure PASSED
kafka.admin.DeleteTopicTest > testAddPartitionDuringDeleteTopic PASSED
kafka.coordinator.ConsumerCoordinatorResponseTest > testValidJoinGroup PASSED
kafka.integration.TopicMetadataTest > testBasicTopicMetadata PASSED
kafka.api.ProducerSendTest > testCloseWithZeroTimeoutFromCallerThread PASSED
kafka.utils.timer.TimerTest > testTaskExpiration PASSED
kafka.utils.timer.TimerTest > testAlreadyExpiredTask PASSED
kafka.integration.AutoOffsetResetTest > testResetToEarliestWhenOffsetTooHigh PASSED
kafka.integration.TopicMetadataTest > testGetAllTopicMetadata PASSED
kafka.admin.AdminTest > testPartitionReassignmentNonOverlappingReplicas PASSED
kafka.api.ConsumerBounceTest > testConsumptionWithBrokerFailures PASSED
kafka.admin.AddPartitionsTest > testTopicDoesNotExist PASSED
kafka.integration.TopicMetadataTest > testTopicMetadataRequest PASSED
kafka.admin.DeleteTopicTest > testRecreateTopicAfterDeletion PASSED
kafka.integration.AutoOffsetResetTest > testResetToEarliestWhenOffsetTooLow PASSED
kafka.admin.DeleteConsumerGroupTest > testConsumptionOnRecreatedTopicAfterTopicWideDeleteInZK PASSED
kafka.admin.AdminTest > testReassigningNonExistingPartition PASSED
kafka.integration.FetcherTest > testFetcher PASSED
kafka.common.ConfigTest > testInvalidClientIds PASSED
kafka.common.ConfigTest > testInvalidGroupIds PASSED
kafka.log.LogCleanerIntegrationTest > cleanerTest[0] PASSED
kafka.admin.DeleteTopicTest > testDeleteTopicWithAllAliveReplicas PASSED
kafka.integration.AutoOffsetResetTest > testResetToLatestWhenOffsetTooHigh PASSED
kafka.admin.AddPartitionsTest > testWrongReplicaCount PASSED
kafka.log.LogTest > testCorruptLog PASSED
kafka.log.LogTest > testCleanShutdownFile PASSED
kafka.log.LogTest > testParseTopicPartitionName PASSED
kafka.log.LogTest > testParseTopicPartitionNameForEmptyName PASSED
kafka.log.LogTest > testParseTopicPartitionNameForNull PASSED
kafka.log.LogTest > testParseTopicPartitionNameForMissingSeparator PASSED
kafka.log.LogTest > testParseTopicPartitionNameForMissingTopic PASSED
kafka.log.LogTest > testParseTopicPartitionNameForMissingPartition PASSED
kafka.api.ProducerSendTest > testCloseWithZeroTimeoutFromSenderThread PASSED
kafka.utils.SchedulerTest > testMockSchedulerNonPeriodicTask PASSED
kafka.utils.SchedulerTest > testNonPeriodicTask PASSED
kafka.utils.SchedulerTest > testReentrantTaskInMockScheduler PASSED
kafka.utils.SchedulerTest > testRestart PASSED
kafka.utils.SchedulerTest > testPeriodicTask PASSED
kafka.utils.SchedulerTest > testMockSchedulerPeriodicTask PASSED
kafka.admin.DeleteTopicTest > testDeleteNonExistingTopic PASSED
kafka.integration.AutoOffsetResetTest > testResetToLatestWhenOffsetTooLow PASSED
kafka.api.ProducerFailureHandlingTest > testTooLargeRecordWithAckZero PASSED
kafka.api.ProducerFailureHandlingTest > testTooLargeRecordWithAckOne PASSED
kafka.api.ConsumerBounceTest > testSeekAndCommitWithBrokerFailures PASSED
kafka.utils.IteratorTemplateTest > testIterator PASSED
kafka.integration.RollingBounceTest > testRollingBounce PASSED
kafka.common.TopicTest > testInvalidTopicNames PASSED
kafka.common.TopicTest > testTopicHasCollisionChars PASSED
kafka.common.TopicTest > testTopicHasCollision PASSED
kafka.api.ProducerFailureHandlingTest > testNonExistentTopic PASSED
kafka.integration.UncleanLeaderElectionTest > testCleanLeaderElectionDisabledByTopicOverride PASSED
kafka.log.LogCleanerIntegrationTest > cleanerTest[1] PASSED
kafka.api.ProducerFailureHandlingTest > testWrongBrokerList PASSED
kafka.admin.DeleteTopicTest > testDeleteTopicWithCleaner PASSED
kafka.integration.UncleanLeaderElectionTest > testUncleanLeaderElectionEnabled PASSED
kafka.api.ProducerFailureHandlingTest > testNoResponse PASSED
kafka.integration.UncleanLeaderElectionTest > testUncleanLeaderElectionInvalidTopicOverride PASSED
kafka.api.ProducerFailureHandlingTest > testInvalidPartition PASSED
kafka.admin.DeleteTopicTest > testDeleteTopicAlreadyMarkedAsDeleted PASSED
kafka.api.ProducerFailureHandlingTest > testSendAfterClosed PASSED
kafka.integration.PrimitiveApiTest > testPipelinedProduceRequests PASSED
kafka.integration.PrimitiveApiTest > testFetchRequestCanProperlySerialize PASSED
kafka.api.ProducerFailureHandlingTest > testCannotSendToInternalTopic PASSED
kafka.integration.UncleanLeaderElectionTest > testUncleanLeaderElectionEnabledByTopicOverride PASSED
kafka.integration.PrimitiveApiTest > testEmptyFetchRequest PASSED
kafka.log.LogCleanerIntegrationTest > cleanerTest[2] PASSED
kafka.api.ProducerFailureHandlingTest > testNotEnoughReplicas PASSED
kafka.integration.PrimitiveApiTest > testDefaultEncoderProducerAndFetchWithCompression PASSED
kafka.integration.PrimitiveApiTest > testMultiProduce PASSED
kafka.integration.PrimitiveApiTest > testConsumerEmptyTopic PASSED
kafka.integration.PrimitiveApiTest > testDefaultEncoderProducerAndFetch PASSED
kafka.integration.PrimitiveApiTest > testProduceAndMultiFetch PASSED
kafka.integration.UncleanLeaderElectionTest > testUncleanLeaderElectionDisabled PASSED
kafka.zk.ZKEphemeralTest > testEphemeralNodeCleanup PASSED
kafka.log.LogCleanerIntegrationTest > cleanerTest[3] PASSED
kafka.api.ProducerFailureHandlingTest > testNotEnoughReplicasAfterBrokerShutdown PASSED
kafka.utils.ByteBoundedBlockingQueueTest > testByteBoundedBlockingQueue PASSED
kafka.log.LogManagerTest > testCleanupExpiredSegments PASSED
kafka.log.LogManagerTest > testGetNonExistentLog PASSED
kafka.log.LogManagerTest > testCheckpointRecoveryPoints PASSED
kafka.log.LogManagerTest > testCreateLog PASSED
kafka.log.LogManagerTest > testLeastLoadedAssignment PASSED
kafka.log.LogManagerTest > testTimeBasedFlush PASSED
kafka.log.LogManagerTest > testRecoveryDirectoryMappingWithRelativeDirectory PASSED
kafka.log.LogManagerTest > testTwoLogManagersUsingSameDirFails PASSED
kafka.log.LogManagerTest > testRecoveryDirectoryMappingWithTrailingSlash PASSED
kafka.log.LogManagerTest > testCleanupSegmentsToMaintainSize PASSED
kafka.api.SSLConsumerTest > testSimpleConsumption PASSED
kafka.api.SSLProducerSendTest > testSendOffset PASSED
kafka.api.SSLProducerSendTest > testClose PASSED
kafka.api.SSLConsumerTest > testAutoOffsetReset PASSED
kafka.api.SSLProducerSendTest > testSendToPartition PASSED
kafka.utils.ReplicationUtilsTest > testGetLeaderIsrAndEpochForPartition PASSED
kafka.utils.ReplicationUtilsTest > testUpdateLeaderAndIsr PASSED
kafka.api.SSLConsumerTest > testSeek PASSED
kafka.api.SSLConsumerTest > testGroupConsumption PASSED
kafka.api.SSLConsumerTest > testPositionAndCommit PASSED
kafka.api.SSLConsumerTest > testPartitionsFor PASSED
kafka.message.MessageWriterTest > testWithCompressionAttribute PASSED
kafka.message.MessageWriterTest > testWithNoCompressionAttribute PASSED
kafka.message.MessageWriterTest > testWithKey PASSED
kafka.message.MessageWriterTest > testBufferingOutputStream PASSED
480 tests completed, 1 failed
:core:test FAILED
FAILURE: Build failed with an exception.
* What went wrong:
Execution failed for task ':core:test'.
> Process 'Gradle Test Executor 27' finished with non-zero exit value 1
* Try:
Run with --stacktrace option to get the stack trace. Run with --info or --debug option to get more log output.
BUILD FAILED
Total time: 5 mins 30.851 secs
Build step 'Execute shell' marked build as failure
Setting GRADLE_2_1_HOME=/home/jenkins/jenkins-slave/tools/hudson.plugins.gradle.GradleInstallation/Gradle_2.1
Jenkins build is back to normal : Kafka-trunk #592
Posted by Apache Jenkins Server <je...@builds.apache.org>.
See <https://builds.apache.org/job/Kafka-trunk/592/changes>