You are viewing a plain text version of this content. The canonical link for it is here.
Posted to builds@lucene.apache.org by Apache Jenkins Server <je...@builds.apache.org> on 2019/10/10 04:30:49 UTC
[JENKINS] Lucene-Solr-BadApples-Tests-8.x - Build # 241 - Still
Failing
Build: https://builds.apache.org/job/Lucene-Solr-BadApples-Tests-8.x/241/
All tests passed
Build Log:
[...truncated 12284 lines...]
[javac] Compiling 735 source files to /home/jenkins/jenkins-slave/workspace/Lucene-Solr-BadApples-Tests-8.x/solr/build/solr-solrj/classes/java
[javac] /home/jenkins/jenkins-slave/workspace/Lucene-Solr-BadApples-Tests-8.x/solr/solrj/src/java/org/apache/solr/client/solrj/impl/ConcurrentUpdateHttp2SolrClient.java:298: error: <identifier> expected
[javac] try (is) {
[javac] ^
[javac] /home/jenkins/jenkins-slave/workspace/Lucene-Solr-BadApples-Tests-8.x/solr/solrj/src/java/org/apache/solr/client/solrj/impl/ConcurrentUpdateHttp2SolrClient.java:298: error: ')' expected
[javac] try (is) {
[javac] ^
[javac] /home/jenkins/jenkins-slave/workspace/Lucene-Solr-BadApples-Tests-8.x/solr/solrj/src/java/org/apache/solr/client/solrj/impl/ConcurrentUpdateHttp2SolrClient.java:298: error: '{' expected
[javac] try (is) {
[javac] ^
[javac] /home/jenkins/jenkins-slave/workspace/Lucene-Solr-BadApples-Tests-8.x/solr/solrj/src/java/org/apache/solr/client/solrj/impl/ConcurrentUpdateHttp2SolrClient.java:300: error: illegal start of expression
[javac] is.skip(is.available());
[javac] ^
[javac] /home/jenkins/jenkins-slave/workspace/Lucene-Solr-BadApples-Tests-8.x/solr/solrj/src/java/org/apache/solr/client/solrj/impl/ConcurrentUpdateHttp2SolrClient.java:300: error: ';' expected
[javac] is.skip(is.available());
[javac] ^
[javac] /home/jenkins/jenkins-slave/workspace/Lucene-Solr-BadApples-Tests-8.x/solr/solrj/src/java/org/apache/solr/client/solrj/impl/ConcurrentUpdateHttp2SolrClient.java:300: error: ';' expected
[javac] is.skip(is.available());
[javac] ^
[javac] 6 errors
BUILD FAILED
/home/jenkins/jenkins-slave/workspace/Lucene-Solr-BadApples-Tests-8.x/build.xml:643: The following error occurred while executing this line:
/home/jenkins/jenkins-slave/workspace/Lucene-Solr-BadApples-Tests-8.x/build.xml:578: The following error occurred while executing this line:
/home/jenkins/jenkins-slave/workspace/Lucene-Solr-BadApples-Tests-8.x/build.xml:59: The following error occurred while executing this line:
/home/jenkins/jenkins-slave/workspace/Lucene-Solr-BadApples-Tests-8.x/solr/build.xml:231: The following error occurred while executing this line:
/home/jenkins/jenkins-slave/workspace/Lucene-Solr-BadApples-Tests-8.x/solr/common-build.xml:558: The following error occurred while executing this line:
/home/jenkins/jenkins-slave/workspace/Lucene-Solr-BadApples-Tests-8.x/solr/common-build.xml:506: The following error occurred while executing this line:
/home/jenkins/jenkins-slave/workspace/Lucene-Solr-BadApples-Tests-8.x/solr/common-build.xml:401: The following error occurred while executing this line:
/home/jenkins/jenkins-slave/workspace/Lucene-Solr-BadApples-Tests-8.x/solr/common-build.xml:421: The following error occurred while executing this line:
/home/jenkins/jenkins-slave/workspace/Lucene-Solr-BadApples-Tests-8.x/lucene/common-build.xml:576: The following error occurred while executing this line:
/home/jenkins/jenkins-slave/workspace/Lucene-Solr-BadApples-Tests-8.x/lucene/common-build.xml:2074: Compile failed; see the compiler error output for details.
Total time: 84 minutes 9 seconds
Build step 'Invoke Ant' marked build as failure
Archiving artifacts
Recording test results
Email was triggered for: Failure - Any
Sending email for trigger: Failure - Any