You are viewing a plain text version of this content. The canonical link for it is here.
Posted to dev@lucene.apache.org by Policeman Jenkins Server <je...@thetaphi.de> on 2016/09/05 06:12:02 UTC

[JENKINS] Lucene-Solr-master-MacOSX (64bit/jdk1.8.0) - Build # 3526 - Still Unstable!

Build: http://jenkins.thetaphi.de/job/Lucene-Solr-master-MacOSX/3526/
Java: 64bit/jdk1.8.0 -XX:+UseCompressedOops -XX:+UseConcMarkSweepGC

1 tests failed.
FAILED:  org.apache.solr.cloud.ShardSplitTest.test

Error Message:
Wrong doc count on shard1_0. See SOLR-5309 expected:<116> but was:<117>

Stack Trace:
java.lang.AssertionError: Wrong doc count on shard1_0. See SOLR-5309 expected:<116> but was:<117>
	at __randomizedtesting.SeedInfo.seed([259DE6439FF6E1A9:ADC9D999310A8C51]:0)
	at org.junit.Assert.fail(Assert.java:93)
	at org.junit.Assert.failNotEquals(Assert.java:647)
	at org.junit.Assert.assertEquals(Assert.java:128)
	at org.junit.Assert.assertEquals(Assert.java:472)
	at org.apache.solr.cloud.ShardSplitTest.checkDocCountsAndShardStates(ShardSplitTest.java:516)
	at org.apache.solr.cloud.ShardSplitTest.splitByUniqueKeyTest(ShardSplitTest.java:299)
	at org.apache.solr.cloud.ShardSplitTest.test(ShardSplitTest.java:84)
	at sun.reflect.NativeMethodAccessorImpl.invoke0(Native Method)
	at sun.reflect.NativeMethodAccessorImpl.invoke(NativeMethodAccessorImpl.java:62)
	at sun.reflect.DelegatingMethodAccessorImpl.invoke(DelegatingMethodAccessorImpl.java:43)
	at java.lang.reflect.Method.invoke(Method.java:498)
	at com.carrotsearch.randomizedtesting.RandomizedRunner.invoke(RandomizedRunner.java:1764)
	at com.carrotsearch.randomizedtesting.RandomizedRunner$8.evaluate(RandomizedRunner.java:871)
	at com.carrotsearch.randomizedtesting.RandomizedRunner$9.evaluate(RandomizedRunner.java:907)
	at com.carrotsearch.randomizedtesting.RandomizedRunner$10.evaluate(RandomizedRunner.java:921)
	at org.apache.solr.BaseDistributedSearchTestCase$ShardsRepeatRule$ShardsFixedStatement.callStatement(BaseDistributedSearchTestCase.java:985)
	at org.apache.solr.BaseDistributedSearchTestCase$ShardsRepeatRule$ShardsStatement.evaluate(BaseDistributedSearchTestCase.java:960)
	at com.carrotsearch.randomizedtesting.rules.SystemPropertiesRestoreRule$1.evaluate(SystemPropertiesRestoreRule.java:57)
	at org.apache.lucene.util.TestRuleSetupTeardownChained$1.evaluate(TestRuleSetupTeardownChained.java:49)
	at org.apache.lucene.util.AbstractBeforeAfterRule$1.evaluate(AbstractBeforeAfterRule.java:45)
	at org.apache.lucene.util.TestRuleThreadAndTestName$1.evaluate(TestRuleThreadAndTestName.java:48)
	at org.apache.lucene.util.TestRuleIgnoreAfterMaxFailures$1.evaluate(TestRuleIgnoreAfterMaxFailures.java:64)
	at org.apache.lucene.util.TestRuleMarkFailure$1.evaluate(TestRuleMarkFailure.java:47)
	at com.carrotsearch.randomizedtesting.rules.StatementAdapter.evaluate(StatementAdapter.java:36)
	at com.carrotsearch.randomizedtesting.ThreadLeakControl$StatementRunner.run(ThreadLeakControl.java:367)
	at com.carrotsearch.randomizedtesting.ThreadLeakControl.forkTimeoutingTask(ThreadLeakControl.java:809)
	at com.carrotsearch.randomizedtesting.ThreadLeakControl$3.evaluate(ThreadLeakControl.java:460)
	at com.carrotsearch.randomizedtesting.RandomizedRunner.runSingleTest(RandomizedRunner.java:880)
	at com.carrotsearch.randomizedtesting.RandomizedRunner$5.evaluate(RandomizedRunner.java:781)
	at com.carrotsearch.randomizedtesting.RandomizedRunner$6.evaluate(RandomizedRunner.java:816)
	at com.carrotsearch.randomizedtesting.RandomizedRunner$7.evaluate(RandomizedRunner.java:827)
	at com.carrotsearch.randomizedtesting.rules.StatementAdapter.evaluate(StatementAdapter.java:36)
	at com.carrotsearch.randomizedtesting.rules.SystemPropertiesRestoreRule$1.evaluate(SystemPropertiesRestoreRule.java:57)
	at org.apache.lucene.util.AbstractBeforeAfterRule$1.evaluate(AbstractBeforeAfterRule.java:45)
	at com.carrotsearch.randomizedtesting.rules.StatementAdapter.evaluate(StatementAdapter.java:36)
	at org.apache.lucene.util.TestRuleStoreClassName$1.evaluate(TestRuleStoreClassName.java:41)
	at com.carrotsearch.randomizedtesting.rules.NoShadowingOrOverridesOnMethodsRule$1.evaluate(NoShadowingOrOverridesOnMethodsRule.java:40)
	at com.carrotsearch.randomizedtesting.rules.NoShadowingOrOverridesOnMethodsRule$1.evaluate(NoShadowingOrOverridesOnMethodsRule.java:40)
	at com.carrotsearch.randomizedtesting.rules.StatementAdapter.evaluate(StatementAdapter.java:36)
	at com.carrotsearch.randomizedtesting.rules.StatementAdapter.evaluate(StatementAdapter.java:36)
	at com.carrotsearch.randomizedtesting.rules.StatementAdapter.evaluate(StatementAdapter.java:36)
	at org.apache.lucene.util.TestRuleAssertionsRequired$1.evaluate(TestRuleAssertionsRequired.java:53)
	at org.apache.lucene.util.TestRuleMarkFailure$1.evaluate(TestRuleMarkFailure.java:47)
	at org.apache.lucene.util.TestRuleIgnoreAfterMaxFailures$1.evaluate(TestRuleIgnoreAfterMaxFailures.java:64)
	at org.apache.lucene.util.TestRuleIgnoreTestSuites$1.evaluate(TestRuleIgnoreTestSuites.java:54)
	at com.carrotsearch.randomizedtesting.rules.StatementAdapter.evaluate(StatementAdapter.java:36)
	at com.carrotsearch.randomizedtesting.ThreadLeakControl$StatementRunner.run(ThreadLeakControl.java:367)
	at java.lang.Thread.run(Thread.java:745)




Build Log:
[...truncated 10831 lines...]
   [junit4] Suite: org.apache.solr.cloud.ShardSplitTest
   [junit4]   2> Creating dataDir: /Users/jenkins/workspace/Lucene-Solr-master-MacOSX/solr/build/solr-core/test/J0/temp/solr.cloud.ShardSplitTest_259DE6439FF6E1A9-001/init-core-data-001
   [junit4]   2> 1441974 INFO  (SUITE-ShardSplitTest-seed#[259DE6439FF6E1A9]-worker) [    ] o.a.s.SolrTestCaseJ4 Randomized ssl (false) and clientAuth (false) via: @org.apache.solr.SolrTestCaseJ4$SuppressSSL(bugUrl=https://issues.apache.org/jira/browse/SOLR-5776) w/ MAC_OS_X supressed clientAuth
   [junit4]   2> 1441975 INFO  (SUITE-ShardSplitTest-seed#[259DE6439FF6E1A9]-worker) [    ] o.a.s.BaseDistributedSearchTestCase Setting hostContext system property: /
   [junit4]   2> 1441978 INFO  (TEST-ShardSplitTest.testSplitAfterFailedSplit-seed#[259DE6439FF6E1A9]) [    ] o.a.s.c.ZkTestServer STARTING ZK TEST SERVER
   [junit4]   2> 1441978 INFO  (Thread-1728) [    ] o.a.s.c.ZkTestServer client port:0.0.0.0/0.0.0.0:0
   [junit4]   2> 1441978 INFO  (Thread-1728) [    ] o.a.s.c.ZkTestServer Starting server
   [junit4]   2> 1442083 INFO  (TEST-ShardSplitTest.testSplitAfterFailedSplit-seed#[259DE6439FF6E1A9]) [    ] o.a.s.c.ZkTestServer start zk server on port:58297
   [junit4]   2> 1442084 INFO  (TEST-ShardSplitTest.testSplitAfterFailedSplit-seed#[259DE6439FF6E1A9]) [    ] o.a.s.c.c.SolrZkClient Using default ZkCredentialsProvider
   [junit4]   2> 1442084 INFO  (TEST-ShardSplitTest.testSplitAfterFailedSplit-seed#[259DE6439FF6E1A9]) [    ] o.a.s.c.c.ConnectionManager Waiting for client to connect to ZooKeeper
   [junit4]   2> 1442111 INFO  (zkCallback-1931-thread-1) [    ] o.a.s.c.c.ConnectionManager Watcher org.apache.solr.common.cloud.ConnectionManager@51353889 name:ZooKeeperConnection Watcher:127.0.0.1:58297 got event WatchedEvent state:SyncConnected type:None path:null path:null type:None
   [junit4]   2> 1442112 INFO  (TEST-ShardSplitTest.testSplitAfterFailedSplit-seed#[259DE6439FF6E1A9]) [    ] o.a.s.c.c.ConnectionManager Client is connected to ZooKeeper
   [junit4]   2> 1442112 INFO  (TEST-ShardSplitTest.testSplitAfterFailedSplit-seed#[259DE6439FF6E1A9]) [    ] o.a.s.c.c.SolrZkClient Using default ZkACLProvider
   [junit4]   2> 1442112 INFO  (TEST-ShardSplitTest.testSplitAfterFailedSplit-seed#[259DE6439FF6E1A9]) [    ] o.a.s.c.c.SolrZkClient makePath: /solr
   [junit4]   2> 1442117 INFO  (TEST-ShardSplitTest.testSplitAfterFailedSplit-seed#[259DE6439FF6E1A9]) [    ] o.a.s.c.c.SolrZkClient Using default ZkCredentialsProvider
   [junit4]   2> 1442117 INFO  (TEST-ShardSplitTest.testSplitAfterFailedSplit-seed#[259DE6439FF6E1A9]) [    ] o.a.s.c.c.ConnectionManager Waiting for client to connect to ZooKeeper
   [junit4]   2> 1442119 INFO  (zkCallback-1932-thread-1) [    ] o.a.s.c.c.ConnectionManager Watcher org.apache.solr.common.cloud.ConnectionManager@8a6982a name:ZooKeeperConnection Watcher:127.0.0.1:58297/solr got event WatchedEvent state:SyncConnected type:None path:null path:null type:None
   [junit4]   2> 1442119 INFO  (TEST-ShardSplitTest.testSplitAfterFailedSplit-seed#[259DE6439FF6E1A9]) [    ] o.a.s.c.c.ConnectionManager Client is connected to ZooKeeper
   [junit4]   2> 1442120 INFO  (TEST-ShardSplitTest.testSplitAfterFailedSplit-seed#[259DE6439FF6E1A9]) [    ] o.a.s.c.c.SolrZkClient Using default ZkACLProvider
   [junit4]   2> 1442120 INFO  (TEST-ShardSplitTest.testSplitAfterFailedSplit-seed#[259DE6439FF6E1A9]) [    ] o.a.s.c.c.SolrZkClient makePath: /collections/collection1
   [junit4]   2> 1442123 INFO  (TEST-ShardSplitTest.testSplitAfterFailedSplit-seed#[259DE6439FF6E1A9]) [    ] o.a.s.c.c.SolrZkClient makePath: /collections/collection1/shards
   [junit4]   2> 1442125 INFO  (TEST-ShardSplitTest.testSplitAfterFailedSplit-seed#[259DE6439FF6E1A9]) [    ] o.a.s.c.c.SolrZkClient makePath: /collections/control_collection
   [junit4]   2> 1442128 INFO  (TEST-ShardSplitTest.testSplitAfterFailedSplit-seed#[259DE6439FF6E1A9]) [    ] o.a.s.c.c.SolrZkClient makePath: /collections/control_collection/shards
   [junit4]   2> 1442132 INFO  (TEST-ShardSplitTest.testSplitAfterFailedSplit-seed#[259DE6439FF6E1A9]) [    ] o.a.s.c.AbstractZkTestCase put /Users/jenkins/workspace/Lucene-Solr-master-MacOSX/solr/core/src/test-files/solr/collection1/conf/solrconfig-tlog.xml to /configs/conf1/solrconfig.xml
   [junit4]   2> 1442132 INFO  (TEST-ShardSplitTest.testSplitAfterFailedSplit-seed#[259DE6439FF6E1A9]) [    ] o.a.s.c.c.SolrZkClient makePath: /configs/conf1/solrconfig.xml
   [junit4]   2> 1442136 INFO  (TEST-ShardSplitTest.testSplitAfterFailedSplit-seed#[259DE6439FF6E1A9]) [    ] o.a.s.c.AbstractZkTestCase put /Users/jenkins/workspace/Lucene-Solr-master-MacOSX/solr/core/src/test-files/solr/collection1/conf/schema15.xml to /configs/conf1/schema.xml
   [junit4]   2> 1442136 INFO  (TEST-ShardSplitTest.testSplitAfterFailedSplit-seed#[259DE6439FF6E1A9]) [    ] o.a.s.c.c.SolrZkClient makePath: /configs/conf1/schema.xml
   [junit4]   2> 1442140 INFO  (TEST-ShardSplitTest.testSplitAfterFailedSplit-seed#[259DE6439FF6E1A9]) [    ] o.a.s.c.AbstractZkTestCase put /Users/jenkins/workspace/Lucene-Solr-master-MacOSX/solr/core/src/test-files/solr/collection1/conf/solrconfig.snippet.randomindexconfig.xml to /configs/conf1/solrconfig.snippet.randomindexconfig.xml
   [junit4]   2> 1442140 INFO  (TEST-ShardSplitTest.testSplitAfterFailedSplit-seed#[259DE6439FF6E1A9]) [    ] o.a.s.c.c.SolrZkClient makePath: /configs/conf1/solrconfig.snippet.randomindexconfig.xml
   [junit4]   2> 1442143 INFO  (TEST-ShardSplitTest.testSplitAfterFailedSplit-seed#[259DE6439FF6E1A9]) [    ] o.a.s.c.AbstractZkTestCase put /Users/jenkins/workspace/Lucene-Solr-master-MacOSX/solr/core/src/test-files/solr/collection1/conf/stopwords.txt to /configs/conf1/stopwords.txt
   [junit4]   2> 1442144 INFO  (TEST-ShardSplitTest.testSplitAfterFailedSplit-seed#[259DE6439FF6E1A9]) [    ] o.a.s.c.c.SolrZkClient makePath: /configs/conf1/stopwords.txt
   [junit4]   2> 1442146 INFO  (TEST-ShardSplitTest.testSplitAfterFailedSplit-seed#[259DE6439FF6E1A9]) [    ] o.a.s.c.AbstractZkTestCase put /Users/jenkins/workspace/Lucene-Solr-master-MacOSX/solr/core/src/test-files/solr/collection1/conf/protwords.txt to /configs/conf1/protwords.txt
   [junit4]   2> 1442146 INFO  (TEST-ShardSplitTest.testSplitAfterFailedSplit-seed#[259DE6439FF6E1A9]) [    ] o.a.s.c.c.SolrZkClient makePath: /configs/conf1/protwords.txt
   [junit4]   2> 1442149 INFO  (TEST-ShardSplitTest.testSplitAfterFailedSplit-seed#[259DE6439FF6E1A9]) [    ] o.a.s.c.AbstractZkTestCase put /Users/jenkins/workspace/Lucene-Solr-master-MacOSX/solr/core/src/test-files/solr/collection1/conf/currency.xml to /configs/conf1/currency.xml
   [junit4]   2> 1442150 INFO  (TEST-ShardSplitTest.testSplitAfterFailedSplit-seed#[259DE6439FF6E1A9]) [    ] o.a.s.c.c.SolrZkClient makePath: /configs/conf1/currency.xml
   [junit4]   2> 1442154 INFO  (TEST-ShardSplitTest.testSplitAfterFailedSplit-seed#[259DE6439FF6E1A9]) [    ] o.a.s.c.AbstractZkTestCase put /Users/jenkins/workspace/Lucene-Solr-master-MacOSX/solr/core/src/test-files/solr/collection1/conf/enumsConfig.xml to /configs/conf1/enumsConfig.xml
   [junit4]   2> 1442154 INFO  (TEST-ShardSplitTest.testSplitAfterFailedSplit-seed#[259DE6439FF6E1A9]) [    ] o.a.s.c.c.SolrZkClient makePath: /configs/conf1/enumsConfig.xml
   [junit4]   2> 1442157 INFO  (TEST-ShardSplitTest.testSplitAfterFailedSplit-seed#[259DE6439FF6E1A9]) [    ] o.a.s.c.AbstractZkTestCase put /Users/jenkins/workspace/Lucene-Solr-master-MacOSX/solr/core/src/test-files/solr/collection1/conf/open-exchange-rates.json to /configs/conf1/open-exchange-rates.json
   [junit4]   2> 1442158 INFO  (TEST-ShardSplitTest.testSplitAfterFailedSplit-seed#[259DE6439FF6E1A9]) [    ] o.a.s.c.c.SolrZkClient makePath: /configs/conf1/open-exchange-rates.json
   [junit4]   2> 1442161 INFO  (TEST-ShardSplitTest.testSplitAfterFailedSplit-seed#[259DE6439FF6E1A9]) [    ] o.a.s.c.AbstractZkTestCase put /Users/jenkins/workspace/Lucene-Solr-master-MacOSX/solr/core/src/test-files/solr/collection1/conf/mapping-ISOLatin1Accent.txt to /configs/conf1/mapping-ISOLatin1Accent.txt
   [junit4]   2> 1442161 INFO  (TEST-ShardSplitTest.testSplitAfterFailedSplit-seed#[259DE6439FF6E1A9]) [    ] o.a.s.c.c.SolrZkClient makePath: /configs/conf1/mapping-ISOLatin1Accent.txt
   [junit4]   2> 1442166 INFO  (TEST-ShardSplitTest.testSplitAfterFailedSplit-seed#[259DE6439FF6E1A9]) [    ] o.a.s.c.AbstractZkTestCase put /Users/jenkins/workspace/Lucene-Solr-master-MacOSX/solr/core/src/test-files/solr/collection1/conf/old_synonyms.txt to /configs/conf1/old_synonyms.txt
   [junit4]   2> 1442166 INFO  (TEST-ShardSplitTest.testSplitAfterFailedSplit-seed#[259DE6439FF6E1A9]) [    ] o.a.s.c.c.SolrZkClient makePath: /configs/conf1/old_synonyms.txt
   [junit4]   2> 1442169 INFO  (TEST-ShardSplitTest.testSplitAfterFailedSplit-seed#[259DE6439FF6E1A9]) [    ] o.a.s.c.AbstractZkTestCase put /Users/jenkins/workspace/Lucene-Solr-master-MacOSX/solr/core/src/test-files/solr/collection1/conf/synonyms.txt to /configs/conf1/synonyms.txt
   [junit4]   2> 1442170 INFO  (TEST-ShardSplitTest.testSplitAfterFailedSplit-seed#[259DE6439FF6E1A9]) [    ] o.a.s.c.c.SolrZkClient makePath: /configs/conf1/synonyms.txt
   [junit4]   2> 1442458 INFO  (TEST-ShardSplitTest.testSplitAfterFailedSplit-seed#[259DE6439FF6E1A9]) [    ] o.a.s.SolrTestCaseJ4 Writing core.properties file to /Users/jenkins/workspace/Lucene-Solr-master-MacOSX/solr/build/solr-core/test/J0/temp/solr.cloud.ShardSplitTest_259DE6439FF6E1A9-001/control-001/cores/collection1
   [junit4]   2> 1442460 INFO  (TEST-ShardSplitTest.testSplitAfterFailedSplit-seed#[259DE6439FF6E1A9]) [    ] o.e.j.s.Server jetty-9.3.8.v20160314
   [junit4]   2> 1442464 INFO  (TEST-ShardSplitTest.testSplitAfterFailedSplit-seed#[259DE6439FF6E1A9]) [    ] o.e.j.s.h.ContextHandler Started o.e.j.s.ServletContextHandler@43dd4193{/,null,AVAILABLE}
   [junit4]   2> 1442466 INFO  (TEST-ShardSplitTest.testSplitAfterFailedSplit-seed#[259DE6439FF6E1A9]) [    ] o.e.j.s.ServerConnector Started ServerConnector@58c1a583{HTTP/1.1,[http/1.1]}{127.0.0.1:58300}
   [junit4]   2> 1442466 INFO  (TEST-ShardSplitTest.testSplitAfterFailedSplit-seed#[259DE6439FF6E1A9]) [    ] o.e.j.s.Server Started @1447823ms
   [junit4]   2> 1442466 INFO  (TEST-ShardSplitTest.testSplitAfterFailedSplit-seed#[259DE6439FF6E1A9]) [    ] o.a.s.c.s.e.JettySolrRunner Jetty properties: {solr.data.dir=/Users/jenkins/workspace/Lucene-Solr-master-MacOSX/solr/build/solr-core/test/J0/temp/solr.cloud.ShardSplitTest_259DE6439FF6E1A9-001/tempDir-001/control/data, hostContext=/, hostPort=58300, coreRootDirectory=/Users/jenkins/workspace/Lucene-Solr-master-MacOSX/solr/build/solr-core/test/J0/../../../../../../../../../Users/jenkins/workspace/Lucene-Solr-master-MacOSX/solr/build/solr-core/test/J0/temp/solr.cloud.ShardSplitTest_259DE6439FF6E1A9-001/control-001/cores}
   [junit4]   2> 1442466 INFO  (TEST-ShardSplitTest.testSplitAfterFailedSplit-seed#[259DE6439FF6E1A9]) [    ] o.a.s.s.SolrDispatchFilter SolrDispatchFilter.init(): sun.misc.Launcher$AppClassLoader@4554617c
   [junit4]   2> 1442466 INFO  (TEST-ShardSplitTest.testSplitAfterFailedSplit-seed#[259DE6439FF6E1A9]) [    ] o.a.s.c.SolrResourceLoader new SolrResourceLoader for directory: '/Users/jenkins/workspace/Lucene-Solr-master-MacOSX/solr/build/solr-core/test/J0/temp/solr.cloud.ShardSplitTest_259DE6439FF6E1A9-001/control-001'
   [junit4]   2> 1442467 INFO  (TEST-ShardSplitTest.testSplitAfterFailedSplit-seed#[259DE6439FF6E1A9]) [    ] o.a.s.c.SolrResourceLoader JNDI not configured for solr (NoInitialContextEx)
   [junit4]   2> 1442467 INFO  (TEST-ShardSplitTest.testSplitAfterFailedSplit-seed#[259DE6439FF6E1A9]) [    ] o.a.s.c.SolrResourceLoader solr home defaulted to 'solr/' (could not find system property or JNDI)
   [junit4]   2> 1442467 INFO  (TEST-ShardSplitTest.testSplitAfterFailedSplit-seed#[259DE6439FF6E1A9]) [    ] o.a.s.c.c.SolrZkClient Using default ZkCredentialsProvider
   [junit4]   2> 1442468 INFO  (TEST-ShardSplitTest.testSplitAfterFailedSplit-seed#[259DE6439FF6E1A9]) [    ] o.a.s.c.c.ConnectionManager Waiting for client to connect to ZooKeeper
   [junit4]   2> 1442469 INFO  (zkCallback-1933-thread-1) [    ] o.a.s.c.c.ConnectionManager Watcher org.apache.solr.common.cloud.ConnectionManager@60d54c37 name:ZooKeeperConnection Watcher:127.0.0.1:58297/solr got event WatchedEvent state:SyncConnected type:None path:null path:null type:None
   [junit4]   2> 1442469 INFO  (TEST-ShardSplitTest.testSplitAfterFailedSplit-seed#[259DE6439FF6E1A9]) [    ] o.a.s.c.c.ConnectionManager Client is connected to ZooKeeper
   [junit4]   2> 1442470 INFO  (TEST-ShardSplitTest.testSplitAfterFailedSplit-seed#[259DE6439FF6E1A9]) [    ] o.a.s.c.c.SolrZkClient Using default ZkACLProvider
   [junit4]   2> 1442471 INFO  (TEST-ShardSplitTest.testSplitAfterFailedSplit-seed#[259DE6439FF6E1A9]) [    ] o.a.s.s.SolrDispatchFilter Loading solr.xml from SolrHome (not found in ZooKeeper)
   [junit4]   2> 1442471 INFO  (TEST-ShardSplitTest.testSplitAfterFailedSplit-seed#[259DE6439FF6E1A9]) [    ] o.a.s.c.SolrXmlConfig Loading container configuration from /Users/jenkins/workspace/Lucene-Solr-master-MacOSX/solr/build/solr-core/test/J0/temp/solr.cloud.ShardSplitTest_259DE6439FF6E1A9-001/control-001/solr.xml
   [junit4]   2> 1442488 INFO  (TEST-ShardSplitTest.testSplitAfterFailedSplit-seed#[259DE6439FF6E1A9]) [    ] o.a.s.c.CorePropertiesLocator Config-defined core root directory: /Users/jenkins/workspace/Lucene-Solr-master-MacOSX/solr/build/solr-core/test/J0/../../../../../../../../../Users/jenkins/workspace/Lucene-Solr-master-MacOSX/solr/build/solr-core/test/J0/temp/solr.cloud.ShardSplitTest_259DE6439FF6E1A9-001/control-001/cores
   [junit4]   2> 1442488 INFO  (TEST-ShardSplitTest.testSplitAfterFailedSplit-seed#[259DE6439FF6E1A9]) [    ] o.a.s.c.CoreContainer New CoreContainer 1096792762
   [junit4]   2> 1442488 INFO  (TEST-ShardSplitTest.testSplitAfterFailedSplit-seed#[259DE6439FF6E1A9]) [    ] o.a.s.c.CoreContainer Loading cores into CoreContainer [instanceDir=/Users/jenkins/workspace/Lucene-Solr-master-MacOSX/solr/build/solr-core/test/J0/temp/solr.cloud.ShardSplitTest_259DE6439FF6E1A9-001/control-001]
   [junit4]   2> 1442488 WARN  (TEST-ShardSplitTest.testSplitAfterFailedSplit-seed#[259DE6439FF6E1A9]) [    ] o.a.s.c.CoreContainer Couldn't add files from /Users/jenkins/workspace/Lucene-Solr-master-MacOSX/solr/build/solr-core/test/J0/temp/solr.cloud.ShardSplitTest_259DE6439FF6E1A9-001/control-001/lib to classpath: /Users/jenkins/workspace/Lucene-Solr-master-MacOSX/solr/build/solr-core/test/J0/temp/solr.cloud.ShardSplitTest_259DE6439FF6E1A9-001/control-001/lib
   [junit4]   2> 1442489 INFO  (TEST-ShardSplitTest.testSplitAfterFailedSplit-seed#[259DE6439FF6E1A9]) [    ] o.a.s.h.c.HttpShardHandlerFactory created with socketTimeout : 90000,urlScheme : ,connTimeout : 15000,maxConnectionsPerHost : 20,maxConnections : 10000,corePoolSize : 0,maximumPoolSize : 2147483647,maxThreadIdleTime : 5,sizeOfQueue : -1,fairnessPolicy : false,
   [junit4]   2> 1442494 INFO  (TEST-ShardSplitTest.testSplitAfterFailedSplit-seed#[259DE6439FF6E1A9]) [    ] o.a.s.u.UpdateShardHandler Created UpdateShardHandler HTTP client with params: socketTimeout=340000&connTimeout=45000&maxConnections=100000&maxConnectionsPerHost=100000
   [junit4]   2> 1442494 INFO  (TEST-ShardSplitTest.testSplitAfterFailedSplit-seed#[259DE6439FF6E1A9]) [    ] o.a.s.l.LogWatcher SLF4J impl is org.slf4j.impl.Log4jLoggerFactory
   [junit4]   2> 1442494 INFO  (TEST-ShardSplitTest.testSplitAfterFailedSplit-seed#[259DE6439FF6E1A9]) [    ] o.a.s.l.LogWatcher Registering Log Listener [Log4j (org.slf4j.impl.Log4jLoggerFactory)]
   [junit4]   2> 1442494 INFO  (TEST-ShardSplitTest.testSplitAfterFailedSplit-seed#[259DE6439FF6E1A9]) [    ] o.a.s.c.ZkContainer Zookeeper client=127.0.0.1:58297/solr
   [junit4]   2> 1442494 INFO  (TEST-ShardSplitTest.testSplitAfterFailedSplit-seed#[259DE6439FF6E1A9]) [    ] o.a.s.c.ZkController zkHost includes chroot
   [junit4]   2> 1442494 INFO  (TEST-ShardSplitTest.testSplitAfterFailedSplit-seed#[259DE6439FF6E1A9]) [    ] o.a.s.c.c.SolrZkClient Using default ZkCredentialsProvider
   [junit4]   2> 1442495 INFO  (TEST-ShardSplitTest.testSplitAfterFailedSplit-seed#[259DE6439FF6E1A9]) [    ] o.a.s.c.c.ConnectionManager Waiting for client to connect to ZooKeeper
   [junit4]   2> 1442497 INFO  (zkCallback-1936-thread-1) [    ] o.a.s.c.c.ConnectionManager Watcher org.apache.solr.common.cloud.ConnectionManager@11efd031 name:ZooKeeperConnection Watcher:127.0.0.1:58297 got event WatchedEvent state:SyncConnected type:None path:null path:null type:None
   [junit4]   2> 1442497 INFO  (TEST-ShardSplitTest.testSplitAfterFailedSplit-seed#[259DE6439FF6E1A9]) [    ] o.a.s.c.c.ConnectionManager Client is connected to ZooKeeper
   [junit4]   2> 1442497 INFO  (TEST-ShardSplitTest.testSplitAfterFailedSplit-seed#[259DE6439FF6E1A9]) [    ] o.a.s.c.c.SolrZkClient Using default ZkACLProvider
   [junit4]   2> 1442500 INFO  (TEST-ShardSplitTest.testSplitAfterFailedSplit-seed#[259DE6439FF6E1A9]) [n:127.0.0.1:58300_    ] o.a.s.c.ZkController Added new OnReconnect listener org.apache.solr.cloud.ZkController$$Lambda$67/466469649@4cb83f6c
   [junit4]   2> 1442500 INFO  (TEST-ShardSplitTest.testSplitAfterFailedSplit-seed#[259DE6439FF6E1A9]) [n:127.0.0.1:58300_    ] o.a.s.c.c.ConnectionManager Waiting for client to connect to ZooKeeper
   [junit4]   2> 1442502 INFO  (zkCallback-1937-thread-1-processing-n:127.0.0.1:58300_) [n:127.0.0.1:58300_    ] o.a.s.c.c.ConnectionManager Watcher org.apache.solr.common.cloud.ConnectionManager@42660cfb name:ZooKeeperConnection Watcher:127.0.0.1:58297/solr got event WatchedEvent state:SyncConnected type:None path:null path:null type:None
   [junit4]   2> 1442502 INFO  (TEST-ShardSplitTest.testSplitAfterFailedSplit-seed#[259DE6439FF6E1A9]) [n:127.0.0.1:58300_    ] o.a.s.c.c.ConnectionManager Client is connected to ZooKeeper
   [junit4]   2> 1442503 INFO  (TEST-ShardSplitTest.testSplitAfterFailedSplit-seed#[259DE6439FF6E1A9]) [n:127.0.0.1:58300_    ] o.a.s.c.c.SolrZkClient makePath: /overseer/queue
   [junit4]   2> 1442507 INFO  (TEST-ShardSplitTest.testSplitAfterFailedSplit-seed#[259DE6439FF6E1A9]) [n:127.0.0.1:58300_    ] o.a.s.c.c.SolrZkClient makePath: /overseer/collection-queue-work
   [junit4]   2> 1442514 INFO  (TEST-ShardSplitTest.testSplitAfterFailedSplit-seed#[259DE6439FF6E1A9]) [n:127.0.0.1:58300_    ] o.a.s.c.c.SolrZkClient makePath: /overseer/collection-map-running
   [junit4]   2> 1442517 INFO  (TEST-ShardSplitTest.testSplitAfterFailedSplit-seed#[259DE6439FF6E1A9]) [n:127.0.0.1:58300_    ] o.a.s.c.c.SolrZkClient makePath: /overseer/collection-map-completed
   [junit4]   2> 1442520 INFO  (TEST-ShardSplitTest.testSplitAfterFailedSplit-seed#[259DE6439FF6E1A9]) [n:127.0.0.1:58300_    ] o.a.s.c.c.SolrZkClient makePath: /overseer/collection-map-failure
   [junit4]   2> 1442524 INFO  (TEST-ShardSplitTest.testSplitAfterFailedSplit-seed#[259DE6439FF6E1A9]) [n:127.0.0.1:58300_    ] o.a.s.c.c.SolrZkClient makePath: /live_nodes
   [junit4]   2> 1442527 INFO  (TEST-ShardSplitTest.testSplitAfterFailedSplit-seed#[259DE6439FF6E1A9]) [n:127.0.0.1:58300_    ] o.a.s.c.c.SolrZkClient makePath: /aliases.json
   [junit4]   2> 1442529 INFO  (TEST-ShardSplitTest.testSplitAfterFailedSplit-seed#[259DE6439FF6E1A9]) [n:127.0.0.1:58300_    ] o.a.s.c.c.SolrZkClient makePath: /clusterstate.json
   [junit4]   2> 1442531 INFO  (TEST-ShardSplitTest.testSplitAfterFailedSplit-seed#[259DE6439FF6E1A9]) [n:127.0.0.1:58300_    ] o.a.s.c.c.SolrZkClient makePath: /security.json
   [junit4]   2> 1442533 INFO  (TEST-ShardSplitTest.testSplitAfterFailedSplit-seed#[259DE6439FF6E1A9]) [n:127.0.0.1:58300_    ] o.a.s.c.c.ZkStateReader Updating cluster state from ZooKeeper... 
   [junit4]   2> 1442536 INFO  (TEST-ShardSplitTest.testSplitAfterFailedSplit-seed#[259DE6439FF6E1A9]) [n:127.0.0.1:58300_    ] o.a.s.c.c.ZkStateReader Loaded empty cluster properties
   [junit4]   2> 1442537 INFO  (TEST-ShardSplitTest.testSplitAfterFailedSplit-seed#[259DE6439FF6E1A9]) [n:127.0.0.1:58300_    ] o.a.s.c.c.ZkStateReader Updated live nodes from ZooKeeper... (0) -> (0)
   [junit4]   2> 1442542 INFO  (TEST-ShardSplitTest.testSplitAfterFailedSplit-seed#[259DE6439FF6E1A9]) [n:127.0.0.1:58300_    ] o.a.s.c.c.SolrZkClient makePath: /overseer_elect
   [junit4]   2> 1442544 INFO  (TEST-ShardSplitTest.testSplitAfterFailedSplit-seed#[259DE6439FF6E1A9]) [n:127.0.0.1:58300_    ] o.a.s.c.c.SolrZkClient makePath: /overseer_elect/election
   [junit4]   2> 1442548 INFO  (TEST-ShardSplitTest.testSplitAfterFailedSplit-seed#[259DE6439FF6E1A9]) [n:127.0.0.1:58300_    ] o.a.s.c.Overseer Overseer (id=null) closing
   [junit4]   2> 1442549 INFO  (TEST-ShardSplitTest.testSplitAfterFailedSplit-seed#[259DE6439FF6E1A9]) [n:127.0.0.1:58300_    ] o.a.s.c.LeaderElector Joined leadership election with path: /overseer_elect/election/96537915484733444-127.0.0.1:58300_-n_0000000000
   [junit4]   2> 1442550 INFO  (TEST-ShardSplitTest.testSplitAfterFailedSplit-seed#[259DE6439FF6E1A9]) [n:127.0.0.1:58300_    ] o.a.s.c.OverseerElectionContext I am going to be the leader 127.0.0.1:58300_
   [junit4]   2> 1442550 INFO  (TEST-ShardSplitTest.testSplitAfterFailedSplit-seed#[259DE6439FF6E1A9]) [n:127.0.0.1:58300_    ] o.a.s.c.c.SolrZkClient makePath: /overseer_elect/leader
   [junit4]   2> 1442552 INFO  (TEST-ShardSplitTest.testSplitAfterFailedSplit-seed#[259DE6439FF6E1A9]) [n:127.0.0.1:58300_    ] o.a.s.c.Overseer Overseer (id=96537915484733444-127.0.0.1:58300_-n_0000000000) starting
   [junit4]   2> 1442555 INFO  (TEST-ShardSplitTest.testSplitAfterFailedSplit-seed#[259DE6439FF6E1A9]) [n:127.0.0.1:58300_    ] o.a.s.c.c.SolrZkClient makePath: /overseer/queue-work
   [junit4]   2> 1442567 INFO  (TEST-ShardSplitTest.testSplitAfterFailedSplit-seed#[259DE6439FF6E1A9]) [n:127.0.0.1:58300_    ] o.a.s.c.OverseerAutoReplicaFailoverThread Starting OverseerAutoReplicaFailoverThread autoReplicaFailoverWorkLoopDelay=10000 autoReplicaFailoverWaitAfterExpiration=10000 autoReplicaFailoverBadNodeExpiration=60000
   [junit4]   2> 1442568 INFO  (OverseerCollectionConfigSetProcessor-96537915484733444-127.0.0.1:58300_-n_0000000000) [n:127.0.0.1:58300_    ] o.a.s.c.OverseerTaskProcessor Process current queue of overseer operations
   [junit4]   2> 1442568 INFO  (TEST-ShardSplitTest.testSplitAfterFailedSplit-seed#[259DE6439FF6E1A9]) [n:127.0.0.1:58300_    ] o.a.s.c.ZkController Register node as live in ZooKeeper:/live_nodes/127.0.0.1:58300_
   [junit4]   2> 1442568 INFO  (OverseerStateUpdate-96537915484733444-127.0.0.1:58300_-n_0000000000) [n:127.0.0.1:58300_    ] o.a.s.c.Overseer Starting to work on the main queue
   [junit4]   2> 1442568 INFO  (TEST-ShardSplitTest.testSplitAfterFailedSplit-seed#[259DE6439FF6E1A9]) [n:127.0.0.1:58300_    ] o.a.s.c.c.SolrZkClient makePath: /live_nodes/127.0.0.1:58300_
   [junit4]   2> 1442572 INFO  (zkCallback-1937-thread-1-processing-n:127.0.0.1:58300_) [n:127.0.0.1:58300_    ] o.a.s.c.c.ZkStateReader A live node change: [WatchedEvent state:SyncConnected type:NodeChildrenChanged path:/live_nodes], has occurred - updating... (live nodes size: [0])
   [junit4]   2> 1442572 INFO  (OverseerStateUpdate-96537915484733444-127.0.0.1:58300_-n_0000000000) [n:127.0.0.1:58300_    ] o.a.s.c.c.ZkStateReader Updated live nodes from ZooKeeper... (0) -> (1)
   [junit4]   2> 1442573 INFO  (zkCallback-1937-thread-1-processing-n:127.0.0.1:58300_) [n:127.0.0.1:58300_    ] o.a.s.c.c.ZkStateReader Updated live nodes from ZooKeeper... (1) -> (1)
   [junit4]   2> 1442585 INFO  (TEST-ShardSplitTest.testSplitAfterFailedSplit-seed#[259DE6439FF6E1A9]) [n:127.0.0.1:58300_    ] o.a.s.c.CoreContainer Security conf doesn't exist. Skipping setup for authorization module.
   [junit4]   2> 1442585 INFO  (TEST-ShardSplitTest.testSplitAfterFailedSplit-seed#[259DE6439FF6E1A9]) [n:127.0.0.1:58300_    ] o.a.s.c.CoreContainer No authentication plugin used.
   [junit4]   2> 1442586 INFO  (TEST-ShardSplitTest.testSplitAfterFailedSplit-seed#[259DE6439FF6E1A9]) [n:127.0.0.1:58300_    ] o.a.s.c.CorePropertiesLocator Looking for core definitions underneath /Users/jenkins/workspace/Lucene-Solr-master-MacOSX/solr/build/solr-core/test/J0/../../../../../../../../../Users/jenkins/workspace/Lucene-Solr-master-MacOSX/solr/build/solr-core/test/J0/temp/solr.cloud.ShardSplitTest_259DE6439FF6E1A9-001/control-001/cores
   [junit4]   2> 1442588 INFO  (TEST-ShardSplitTest.testSplitAfterFailedSplit-seed#[259DE6439FF6E1A9]) [n:127.0.0.1:58300_    ] o.a.s.c.CoreDescriptor Created CoreDescriptor: {name=collection1, config=solrconfig.xml, transient=false, schema=schema.xml, loadOnStartup=true, configSetProperties=configsetprops.json, collection=control_collection, coreNodeName=, dataDir=data/, shard=}
   [junit4]   2> 1442588 INFO  (TEST-ShardSplitTest.testSplitAfterFailedSplit-seed#[259DE6439FF6E1A9]) [n:127.0.0.1:58300_    ] o.a.s.c.CorePropertiesLocator Found core collection1 in /Users/jenkins/workspace/Lucene-Solr-master-MacOSX/solr/build/solr-core/test/J0/../../../../../../../../../Users/jenkins/workspace/Lucene-Solr-master-MacOSX/solr/build/solr-core/test/J0/temp/solr.cloud.ShardSplitTest_259DE6439FF6E1A9-001/control-001/cores/collection1
   [junit4]   2> 1442588 INFO  (TEST-ShardSplitTest.testSplitAfterFailedSplit-seed#[259DE6439FF6E1A9]) [n:127.0.0.1:58300_    ] o.a.s.c.CorePropertiesLocator Found 1 core definitions
   [junit4]   2> 1442590 INFO  (coreLoadExecutor-4157-thread-1-processing-n:127.0.0.1:58300_) [n:127.0.0.1:58300_ c:control_collection   x:collection1] o.a.s.c.ZkController publishing state=down
   [junit4]   2> 1442590 INFO  (coreLoadExecutor-4157-thread-1-processing-n:127.0.0.1:58300_) [n:127.0.0.1:58300_ c:control_collection   x:collection1] o.a.s.c.ZkController numShards not found on descriptor - reading it from system property
   [junit4]   2> 1442590 INFO  (TEST-ShardSplitTest.testSplitAfterFailedSplit-seed#[259DE6439FF6E1A9]) [n:127.0.0.1:58300_    ] o.a.s.s.SolrDispatchFilter user.dir=/Users/jenkins/workspace/Lucene-Solr-master-MacOSX/solr/build/solr-core/test/J0
   [junit4]   2> 1442590 INFO  (TEST-ShardSplitTest.testSplitAfterFailedSplit-seed#[259DE6439FF6E1A9]) [n:127.0.0.1:58300_    ] o.a.s.s.SolrDispatchFilter SolrDispatchFilter.init() done
   [junit4]   2> 1442591 INFO  (coreLoadExecutor-4157-thread-1-processing-n:127.0.0.1:58300_) [n:127.0.0.1:58300_ c:control_collection   x:collection1] o.a.s.c.ZkController Collection control_collection not visible yet, but flagging it so a watch is registered when it becomes visible
   [junit4]   2> 1442592 INFO  (coreLoadExecutor-4157-thread-1-processing-n:127.0.0.1:58300_) [n:127.0.0.1:58300_ c:control_collection   x:collection1] o.a.s.c.c.ZkStateReader Deleting data for [control_collection]
   [junit4]   2> 1442592 INFO  (OverseerStateUpdate-96537915484733444-127.0.0.1:58300_-n_0000000000) [n:127.0.0.1:58300_    ] o.a.s.c.Overseer processMessage: queueSize: 1, message = {
   [junit4]   2>   "core":"collection1",
   [junit4]   2>   "roles":null,
   [junit4]   2>   "base_url":"http://127.0.0.1:58300",
   [junit4]   2>   "node_name":"127.0.0.1:58300_",
   [junit4]   2>   "numShards":"1",
   [junit4]   2>   "state":"down",
   [junit4]   2>   "shard":null,
   [junit4]   2>   "collection":"control_collection",
   [junit4]   2>   "operation":"state"} current state version: 0
   [junit4]   2> 1442593 INFO  (OverseerStateUpdate-96537915484733444-127.0.0.1:58300_-n_0000000000) [n:127.0.0.1:58300_    ] o.a.s.c.o.ReplicaMutator Update state numShards=1 message={
   [junit4]   2>   "core":"collection1",
   [junit4]   2>   "roles":null,
   [junit4]   2>   "base_url":"http://127.0.0.1:58300",
   [junit4]   2>   "node_name":"127.0.0.1:58300_",
   [junit4]   2>   "numShards":"1",
   [junit4]   2>   "state":"down",
   [junit4]   2>   "shard":null,
   [junit4]   2>   "collection":"control_collection",
   [junit4]   2>   "operation":"state"}
   [junit4]   2> 1442593 INFO  (OverseerStateUpdate-96537915484733444-127.0.0.1:58300_-n_0000000000) [n:127.0.0.1:58300_    ] o.a.s.c.o.ClusterStateMutator building a new cName: control_collection
   [junit4]   2> 1442594 INFO  (OverseerStateUpdate-96537915484733444-127.0.0.1:58300_-n_0000000000) [n:127.0.0.1:58300_    ] o.a.s.c.o.ReplicaMutator Assigning new node to shard shard=shard1
   [junit4]   2> 1442594 INFO  (coreLoadExecutor-4157-thread-1-processing-n:127.0.0.1:58300_) [n:127.0.0.1:58300_ c:control_collection   x:collection1] o.a.s.c.ZkController look for our core node name
   [junit4]   2> 1442598 INFO  (zkCallback-1937-thread-1-processing-n:127.0.0.1:58300_) [n:127.0.0.1:58300_    ] o.a.s.c.c.ZkStateReader A cluster state change: [WatchedEvent state:SyncConnected type:NodeDataChanged path:/clusterstate.json], has occurred - updating... (live nodes size: [1])
   [junit4]   2> 1443600 INFO  (coreLoadExecutor-4157-thread-1-processing-n:127.0.0.1:58300_) [n:127.0.0.1:58300_ c:control_collection   x:collection1] o.a.s.c.ZkController waiting to find shard id in clusterstate for collection1
   [junit4]   2> 1443600 INFO  (coreLoadExecutor-4157-thread-1-processing-n:127.0.0.1:58300_) [n:127.0.0.1:58300_ c:control_collection   x:collection1] o.a.s.c.ZkController Check for collection zkNode:control_collection
   [junit4]   2> 1443601 INFO  (coreLoadExecutor-4157-thread-1-processing-n:127.0.0.1:58300_) [n:127.0.0.1:58300_ c:control_collection   x:collection1] o.a.s.c.ZkController Collection zkNode exists
   [junit4]   2> 1443601 INFO  (coreLoadExecutor-4157-thread-1-processing-n:127.0.0.1:58300_) [n:127.0.0.1:58300_ c:control_collection   x:collection1] o.a.s.c.c.ZkStateReader Load collection config from: [/collections/control_collection]
   [junit4]   2> 1443602 INFO  (coreLoadExecutor-4157-thread-1-processing-n:127.0.0.1:58300_) [n:127.0.0.1:58300_ c:control_collection   x:collection1] o.a.s.c.c.ZkStateReader path=[/collections/control_collection] [configName]=[conf1] specified config exists in ZooKeeper
   [junit4]   2> 1443602 INFO  (coreLoadExecutor-4157-thread-1-processing-n:127.0.0.1:58300_) [n:127.0.0.1:58300_ c:control_collection   x:collection1] o.a.s.c.SolrResourceLoader new SolrResourceLoader for directory: '/Users/jenkins/workspace/Lucene-Solr-master-MacOSX/solr/build/solr-core/test/J0/temp/solr.cloud.ShardSplitTest_259DE6439FF6E1A9-001/control-001/cores/collection1'
   [junit4]   2> 1443604 INFO  (coreLoadExecutor-4157-thread-1-processing-n:127.0.0.1:58300_) [n:127.0.0.1:58300_ c:control_collection   x:collection1] o.a.s.c.SolrResourceLoader JNDI not configured for solr (NoInitialContextEx)
   [junit4]   2> 1443604 INFO  (coreLoadExecutor-4157-thread-1-processing-n:127.0.0.1:58300_) [n:127.0.0.1:58300_ c:control_collection   x:collection1] o.a.s.c.SolrResourceLoader solr home defaulted to 'solr/' (could not find system property or JNDI)
   [junit4]   2> 1443607 INFO  (coreLoadExecutor-4157-thread-1-processing-n:127.0.0.1:58300_) [n:127.0.0.1:58300_ c:control_collection   x:collection1] o.a.s.c.Config loaded config solrconfig.xml with version 0 
   [junit4]   2> 1443613 INFO  (coreLoadExecutor-4157-thread-1-processing-n:127.0.0.1:58300_) [n:127.0.0.1:58300_ c:control_collection   x:collection1] o.a.s.c.SolrConfig current version of requestparams : -1
   [junit4]   2> 1443622 INFO  (coreLoadExecutor-4157-thread-1-processing-n:127.0.0.1:58300_) [n:127.0.0.1:58300_ c:control_collection   x:collection1] o.a.s.c.SolrConfig Using Lucene MatchVersion: 7.0.0
   [junit4]   2> 1443635 INFO  (coreLoadExecutor-4157-thread-1-processing-n:127.0.0.1:58300_) [n:127.0.0.1:58300_ c:control_collection   x:collection1] o.a.s.c.SolrConfig Loaded SolrConfig: solrconfig.xml
   [junit4]   2> 1443642 INFO  (coreLoadExecutor-4157-thread-1-processing-n:127.0.0.1:58300_) [n:127.0.0.1:58300_ c:control_collection   x:collection1] o.a.s.s.IndexSchema [collection1] Schema name=test
   [junit4]   2> 1443751 INFO  (coreLoadExecutor-4157-thread-1-processing-n:127.0.0.1:58300_) [n:127.0.0.1:58300_ c:control_collection   x:collection1] o.a.s.s.IndexSchema default search field in schema is text
   [junit4]   2> 1443754 INFO  (coreLoadExecutor-4157-thread-1-processing-n:127.0.0.1:58300_) [n:127.0.0.1:58300_ c:control_collection   x:collection1] o.a.s.s.IndexSchema unique key field: id
   [junit4]   2> 1443755 INFO  (coreLoadExecutor-4157-thread-1-processing-n:127.0.0.1:58300_) [n:127.0.0.1:58300_ c:control_collection   x:collection1] o.a.s.s.FileExchangeRateProvider Reloading exchange rates from file currency.xml
   [junit4]   2> 1443757 INFO  (coreLoadExecutor-4157-thread-1-processing-n:127.0.0.1:58300_) [n:127.0.0.1:58300_ c:control_collection   x:collection1] o.a.s.s.FileExchangeRateProvider Reloading exchange rates from file currency.xml
   [junit4]   2> 1443790 INFO  (coreLoadExecutor-4157-thread-1-processing-n:127.0.0.1:58300_) [n:127.0.0.1:58300_ c:control_collection   x:collection1] o.a.s.c.ConfigSetProperties Did not find ConfigSet properties, assuming default properties: Can't find resource 'configsetprops.json' in classpath or '/configs/conf1', cwd=/Users/jenkins/workspace/Lucene-Solr-master-MacOSX/solr/build/solr-core/test/J0
   [junit4]   2> 1443790 INFO  (coreLoadExecutor-4157-thread-1-processing-n:127.0.0.1:58300_) [n:127.0.0.1:58300_ c:control_collection   x:collection1] o.a.s.c.CoreContainer Creating SolrCore 'collection1' using configuration from collection control_collection
   [junit4]   2> 1443790 INFO  (coreLoadExecutor-4157-thread-1-processing-n:127.0.0.1:58300_) [n:127.0.0.1:58300_ c:control_collection s:shard1 r:core_node1 x:collection1] o.a.s.c.SolrCore org.apache.solr.core.MockDirectoryFactory
   [junit4]   2> 1443791 INFO  (coreLoadExecutor-4157-thread-1-processing-n:127.0.0.1:58300_) [n:127.0.0.1:58300_ c:control_collection s:shard1 r:core_node1 x:collection1] o.a.s.c.SolrCore [[collection1] ] Opening new SolrCore at [/Users/jenkins/workspace/Lucene-Solr-master-MacOSX/solr/build/solr-core/test/J0/temp/solr.cloud.ShardSplitTest_259DE6439FF6E1A9-001/control-001/cores/collection1], dataDir=[/Users/jenkins/workspace/Lucene-Solr-master-MacOSX/solr/build/solr-core/test/J0/../../../../../../../../../Users/jenkins/workspace/Lucene-Solr-master-MacOSX/solr/build/solr-core/test/J0/temp/solr.cloud.ShardSplitTest_259DE6439FF6E1A9-001/control-001/cores/collection1/data/]
   [junit4]   2> 1443791 INFO  (coreLoadExecutor-4157-thread-1-processing-n:127.0.0.1:58300_) [n:127.0.0.1:58300_ c:control_collection s:shard1 r:core_node1 x:collection1] o.a.s.c.JmxMonitoredMap JMX monitoring is enabled. Adding Solr mbeans to JMX Server: com.sun.jmx.mbeanserver.JmxMBeanServer@286b5450
   [junit4]   2> 1443791 INFO  (coreLoadExecutor-4157-thread-1-processing-n:127.0.0.1:58300_) [n:127.0.0.1:58300_ c:control_collection s:shard1 r:core_node1 x:collection1] o.a.s.c.CachingDirectoryFactory return new directory for /Users/jenkins/workspace/Lucene-Solr-master-MacOSX/solr/build/solr-core/test/J0/../../../../../../../../../Users/jenkins/workspace/Lucene-Solr-master-MacOSX/solr/build/solr-core/test/J0/temp/solr.cloud.ShardSplitTest_259DE6439FF6E1A9-001/control-001/cores/collection1/data/snapshot_metadata
   [junit4]   2> 1443791 INFO  (coreLoadExecutor-4157-thread-1-processing-n:127.0.0.1:58300_) [n:127.0.0.1:58300_ c:control_collection s:shard1 r:core_node1 x:collection1] o.a.s.c.s.SolrSnapshotMetaDataManager Loading from snapshot metadata file...
   [junit4]   2> 1443791 INFO  (coreLoadExecutor-4157-thread-1-processing-n:127.0.0.1:58300_) [n:127.0.0.1:58300_ c:control_collection s:shard1 r:core_node1 x:collection1] o.a.s.c.CachingDirectoryFactory return new directory for /Users/jenkins/workspace/Lucene-Solr-master-MacOSX/solr/build/solr-core/test/J0/../../../../../../../../../Users/jenkins/workspace/Lucene-Solr-master-MacOSX/solr/build/solr-core/test/J0/temp/solr.cloud.ShardSplitTest_259DE6439FF6E1A9-001/control-001/cores/collection1/data
   [junit4]   2> 1443791 INFO  (coreLoadExecutor-4157-thread-1-processing-n:127.0.0.1:58300_) [n:127.0.0.1:58300_ c:control_collection s:shard1 r:core_node1 x:collection1] o.a.s.c.SolrCore New index directory detected: old=null new=/Users/jenkins/workspace/Lucene-Solr-master-MacOSX/solr/build/solr-core/test/J0/../../../../../../../../../Users/jenkins/workspace/Lucene-Solr-master-MacOSX/solr/build/solr-core/test/J0/temp/solr.cloud.ShardSplitTest_259DE6439FF6E1A9-001/control-001/cores/collection1/data/index/
   [junit4]   2> 1443791 WARN  (coreLoadExecutor-4157-thread-1-processing-n:127.0.0.1:58300_) [n:127.0.0.1:58300_ c:control_collection s:shard1 r:core_node1 x:collection1] o.a.s.c.SolrCore [collection1] Solr index directory '/Users/jenkins/workspace/Lucene-Solr-master-MacOSX/solr/build/solr-core/test/J0/../../../../../../../../../Users/jenkins/workspace/Lucene-Solr-master-MacOSX/solr/build/solr-core/test/J0/temp/solr.cloud.ShardSplitTest_259DE6439FF6E1A9-001/control-001/cores/collection1/data/index' doesn't exist. Creating new index...
   [junit4]   2> 1443792 INFO  (coreLoadExecutor-4157-thread-1-processing-n:127.0.0.1:58300_) [n:127.0.0.1:58300_ c:control_collection s:shard1 r:core_node1 x:collection1] o.a.s.c.CachingDirectoryFactory return new directory for /Users/jenkins/workspace/Lucene-Solr-master-MacOSX/solr/build/solr-core/test/J0/../../../../../../../../../Users/jenkins/workspace/Lucene-Solr-master-MacOSX/solr/build/solr-core/test/J0/temp/solr.cloud.ShardSplitTest_259DE6439FF6E1A9-001/control-001/cores/collection1/data/index
   [junit4]   2> 1443792 INFO  (coreLoadExecutor-4157-thread-1-processing-n:127.0.0.1:58300_) [n:127.0.0.1:58300_ c:control_collection s:shard1 r:core_node1 x:collection1] o.a.s.u.RandomMergePolicy RandomMergePolicy wrapping class org.apache.lucene.index.LogDocMergePolicy: [LogDocMergePolicy: minMergeSize=1000, mergeFactor=47, maxMergeSize=9223372036854775807, maxMergeSizeForForcedMerge=9223372036854775807, calibrateSizeByDeletes=false, maxMergeDocs=2147483647, maxCFSSegmentSizeMB=8.796093022207999E12, noCFSRatio=0.0]
   [junit4]   2> 1443793 INFO  (coreLoadExecutor-4157-thread-1-processing-n:127.0.0.1:58300_) [n:127.0.0.1:58300_ c:control_collection s:shard1 r:core_node1 x:collection1] o.a.s.c.SolrDeletionPolicy SolrDeletionPolicy.onCommit: commits: num=1
   [junit4]   2> 	commit{dir=MockDirectoryWrapper(RAMDirectory@42d898de lockFactory=org.apache.lucene.store.SingleInstanceLockFactory@51ef70a9),segFN=segments_1,generation=1}
   [junit4]   2> 1443793 INFO  (coreLoadExecutor-4157-thread-1-processing-n:127.0.0.1:58300_) [n:127.0.0.1:58300_ c:control_collection s:shard1 r:core_node1 x:collection1] o.a.s.c.SolrDeletionPolicy newest commit generation = 1
   [junit4]   2> 1443793 INFO  (OldIndexDirectoryCleanupThreadForCore-collection1) [n:127.0.0.1:58300_ c:control_collection s:shard1 r:core_node1 x:collection1] o.a.s.c.SolrCore Looking for old index directories to cleanup for core collection1 in /Users/jenkins/workspace/Lucene-Solr-master-MacOSX/solr/build/solr-core/test/J0/../../../../../../../../../Users/jenkins/workspace/Lucene-Solr-master-MacOSX/solr/build/solr-core/test/J0/temp/solr.cloud.ShardSplitTest_259DE6439FF6E1A9-001/control-001/cores/collection1/data/
   [junit4]   2> 1443794 WARN  (OldIndexDirectoryCleanupThreadForCore-collection1) [n:127.0.0.1:58300_ c:control_collection s:shard1 r:core_node1 x:collection1] o.a.s.c.DirectoryFactory /Users/jenkins/workspace/Lucene-Solr-master-MacOSX/solr/build/solr-core/test/J0/../../../../../../../../../Users/jenkins/workspace/Lucene-Solr-master-MacOSX/solr/build/solr-core/test/J0/temp/solr.cloud.ShardSplitTest_259DE6439FF6E1A9-001/control-001/cores/collection1/data/ does not point to a valid data directory; skipping clean-up of old index directories.
   [junit4]   2> 1443796 INFO  (coreLoadExecutor-4157-thread-1-processing-n:127.0.0.1:58300_) [n:127.0.0.1:58300_ c:control_collection s:shard1 r:core_node1 x:collection1] o.a.s.u.p.UpdateRequestProcessorChain creating updateRequestProcessorChain "nodistrib"
   [junit4]   2> 1443797 INFO  (coreLoadExecutor-4157-thread-1-processing-n:127.0.0.1:58300_) [n:127.0.0.1:58300_ c:control_collection s:shard1 r:core_node1 x:collection1] o.a.s.u.p.UpdateRequestProcessorChain creating updateRequestProcessorChain "dedupe"
   [junit4]   2> 1443797 INFO  (coreLoadExecutor-4157-thread-1-processing-n:127.0.0.1:58300_) [n:127.0.0.1:58300_ c:control_collection s:shard1 r:core_node1 x:collection1] o.a.s.u.p.UpdateRequestProcessorChain inserting DistributedUpdateProcessorFactory into updateRequestProcessorChain "dedupe"
   [junit4]   2> 1443797 INFO  (coreLoadExecutor-4157-thread-1-processing-n:127.0.0.1:58300_) [n:127.0.0.1:58300_ c:control_collection s:shard1 r:core_node1 x:collection1] o.a.s.u.p.UpdateRequestProcessorChain creating updateRequestProcessorChain "stored_sig"
   [junit4]   2> 1443797 INFO  (coreLoadExecutor-4157-thread-1-processing-n:127.0.0.1:58300_) [n:127.0.0.1:58300_ c:control_collection s:shard1 r:core_node1 x:collection1] o.a.s.u.p.UpdateRequestProcessorChain inserting DistributedUpdateProcessorFactory into updateRequestProcessorChain "stored_sig"
   [junit4]   2> 1443797 INFO  (coreLoadExecutor-4157-thread-1-processing-n:127.0.0.1:58300_) [n:127.0.0.1:58300_ c:control_collection s:shard1 r:core_node1 x:collection1] o.a.s.u.p.UpdateRequestProcessorChain creating updateRequestProcessorChain "distrib-dup-test-chain-explicit"
   [junit4]   2> 1443797 INFO  (coreLoadExecutor-4157-thread-1-processing-n:127.0.0.1:58300_) [n:127.0.0.1:58300_ c:control_collection s:shard1 r:core_node1 x:collection1] o.a.s.u.p.UpdateRequestProcessorChain creating updateRequestProcessorChain "distrib-dup-test-chain-implicit"
   [junit4]   2> 1443797 INFO  (coreLoadExecutor-4157-thread-1-processing-n:127.0.0.1:58300_) [n:127.0.0.1:58300_ c:control_collection s:shard1 r:core_node1 x:collection1] o.a.s.u.p.UpdateRequestProcessorChain inserting DistributedUpdateProcessorFactory into updateRequestProcessorChain "distrib-dup-test-chain-implicit"
   [junit4]   2> 1443797 INFO  (coreLoadExecutor-4157-thread-1-processing-n:127.0.0.1:58300_) [n:127.0.0.1:58300_ c:control_collection s:shard1 r:core_node1 x:collection1] o.a.s.c.SolrCore no updateRequestProcessorChain defined as default, creating implicit default
   [junit4]   2> 1443797 WARN  (coreLoadExecutor-4157-thread-1-processing-n:127.0.0.1:58300_) [n:127.0.0.1:58300_ c:control_collection s:shard1 r:core_node1 x:collection1] o.a.s.c.RequestHandlers INVALID paramSet a in requestHandler {type = requestHandler,name = /dump,class = DumpRequestHandler,args = {defaults={a=A,b=B}}}
   [junit4]   2> 1443802 INFO  (coreLoadExecutor-4157-thread-1-processing-n:127.0.0.1:58300_) [n:127.0.0.1:58300_ c:control_collection s:shard1 r:core_node1 x:collection1] o.a.s.h.l.XMLLoader xsltCacheLifetimeSeconds=60
   [junit4]   2> 1443803 INFO  (coreLoadExecutor-4157-thread-1-processing-n:127.0.0.1:58300_) [n:127.0.0.1:58300_ c:control_collection s:shard1 r:core_node1 x:collection1] o.a.s.h.l.XMLLoader xsltCacheLifetimeSeconds=60
   [junit4]   2> 1443804 INFO  (coreLoadExecutor-4157-thread-1-processing-n:127.0.0.1:58300_) [n:127.0.0.1:58300_ c:control_collection s:shard1 r:core_node1 x:collection1] o.a.s.h.l.XMLLoader xsltCacheLifetimeSeconds=60
   [junit4]   2> 1443805 INFO  (coreLoadExecutor-4157-thread-1-processing-n:127.0.0.1:58300_) [n:127.0.0.1:58300_ c:control_collection s:shard1 r:core_node1 x:collection1] o.a.s.h.l.XMLLoader xsltCacheLifetimeSeconds=60
   [junit4]   2> 1443813 INFO  (coreLoadExecutor-4157-thread-1-processing-n:127.0.0.1:58300_) [n:127.0.0.1:58300_ c:control_collection s:shard1 r:core_node1 x:collection1] o.a.s.c.RequestHandlers Registered paths: /admin/mbeans,standard,/update/json/docs,/admin/luke,/export,/get,/admin/properties,/update/json,/admin/threads,/dump,/update/csv,/sql,/graph,/admin/segments,/admin/system,/replication,/config,/stream,/schema,/admin/plugins,/admin/logging,/admin/ping,/update,/admin/file,/terms
   [junit4]   2> 1443813 INFO  (coreLoadExecutor-4157-thread-1-processing-n:127.0.0.1:58300_) [n:127.0.0.1:58300_ c:control_collection s:shard1 r:core_node1 x:collection1] o.a.s.c.SolrCore Using default statsCache cache: org.apache.solr.search.stats.LocalStatsCache
   [junit4]   2> 1443813 INFO  (coreLoadExecutor-4157-thread-1-processing-n:127.0.0.1:58300_) [n:127.0.0.1:58300_ c:control_collection s:shard1 r:core_node1 x:collection1] o.a.s.u.UpdateHandler Using UpdateLog implementation: org.apache.solr.update.UpdateLog
   [junit4]   2> 1443814 INFO  (coreLoadExecutor-4157-thread-1-processing-n:127.0.0.1:58300_) [n:127.0.0.1:58300_ c:control_collection s:shard1 r:core_node1 x:collection1] o.a.s.u.UpdateLog Initializing UpdateLog: dataDir= defaultSyncLevel=FLUSH numRecordsToKeep=100 maxNumLogsToKeep=10 numVersionBuckets=65536
   [junit4]   2> 1443815 INFO  (coreLoadExecutor-4157-thread-1-processing-n:127.0.0.1:58300_) [n:127.0.0.1:58300_ c:control_collection s:shard1 r:core_node1 x:collection1] o.a.s.u.CommitTracker Hard AutoCommit: disabled
   [junit4]   2> 1443815 INFO  (coreLoadExecutor-4157-thread-1-processing-n:127.0.0.1:58300_) [n:127.0.0.1:58300_ c:control_collection s:shard1 r:core_node1 x:collection1] o.a.s.u.CommitTracker Soft AutoCommit: disabled
   [junit4]   2> 1443815 INFO  (coreLoadExecutor-4157-thread-1-processing-n:127.0.0.1:58300_) [n:127.0.0.1:58300_ c:control_collection s:shard1 r:core_node1 x:collection1] o.a.s.u.RandomMergePolicy RandomMergePolicy wrapping class org.apache.lucene.index.LogDocMergePolicy: [LogDocMergePolicy: minMergeSize=1000, mergeFactor=30, maxMergeSize=9223372036854775807, maxMergeSizeForForcedMerge=9223372036854775807, calibrateSizeByDeletes=true, maxMergeDocs=2147483647, maxCFSSegmentSizeMB=8.796093022207999E12, noCFSRatio=1.0]
   [junit4]   2> 1443815 INFO  (coreLoadExecutor-4157-thread-1-processing-n:127.0.0.1:58300_) [n:127.0.0.1:58300_ c:control_collection s:shard1 r:core_node1 x:collection1] o.a.s.c.SolrDeletionPolicy SolrDeletionPolicy.onInit: commits: num=1
   [junit4]   2> 	commit{dir=MockDirectoryWrapper(RAMDirectory@42d898de lockFactory=org.apache.lucene.store.SingleInstanceLockFactory@51ef70a9),segFN=segments_1,generation=1}
   [junit4]   2> 1443815 INFO  (coreLoadExecutor-4157-thread-1-processing-n:127.0.0.1:58300_) [n:127.0.0.1:58300_ c:control_collection s:shard1 r:core_node1 x:collection1] o.a.s.c.SolrDeletionPolicy newest commit generation = 1
   [junit4]   2> 1443816 INFO  (coreLoadExecutor-4157-thread-1-processing-n:127.0.0.1:58300_) [n:127.0.0.1:58300_ c:control_collection s:shard1 r:core_node1 x:collection1] o.a.s.s.SolrIndexSearcher Opening [Searcher@55341d71[collection1] main]
   [junit4]   2> 1443816 INFO  (coreLoadExecutor-4157-thread-1-processing-n:127.0.0.1:58300_) [n:127.0.0.1:58300_ c:control_collection s:shard1 r:core_node1 x:collection1] o.a.s.c.c.ZkStateReader Load collection config from: [/collections/control_collection]
   [junit4]   2> 1443817 INFO  (coreLoadExecutor-4157-thread-1-processing-n:127.0.0.1:58300_) [n:127.0.0.1:58300_ c:control_collection s:shard1 r:core_node1 x:collection1] o.a.s.c.c.ZkStateReader path=[/collections/control_collection] [configName]=[conf1] specified config exists in ZooKeeper
   [junit4]   2> 1443817 INFO  (coreLoadExecutor-4157-thread-1-processing-n:127.0.0.1:58300_) [n:127.0.0.1:58300_ c:control_collection s:shard1 r:core_node1 x:collection1] o.a.s.r.ManagedResourceStorage Setting up ZooKeeper-based storage for the RestManager with znodeBase: /configs/conf1
   [junit4]   2> 1443818 INFO  (coreLoadExecutor-4157-thread-1-processing-n:127.0.0.1:58300_) [n:127.0.0.1:58300_ c:control_collection s:shard1 r:core_node1 x:collection1] o.a.s.r.ManagedResourceStorage Configured ZooKeeperStorageIO with znodeBase: /configs/conf1
   [junit4]   2> 1443818 INFO  (coreLoadExecutor-4157-thread-1-processing-n:127.0.0.1:58300_) [n:127.0.0.1:58300_ c:control_collection s:shard1 r:core_node1 x:collection1] o.a.s.r.RestManager Initializing RestManager with initArgs: {}
   [junit4]   2> 1443818 INFO  (coreLoadExecutor-4157-thread-1-processing-n:127.0.0.1:58300_) [n:127.0.0.1:58300_ c:control_collection s:shard1 r:core_node1 x:collection1] o.a.s.r.ManagedResourceStorage Reading _rest_managed.json using ZooKeeperStorageIO:path=/configs/conf1
   [junit4]   2> 1443818 INFO  (coreLoadExecutor-4157-thread-1-processing-n:127.0.0.1:58300_) [n:127.0.0.1:58300_ c:control_collection s:shard1 r:core_node1 x:collection1] o.a.s.r.ManagedResourceStorage No data found for znode /configs/conf1/_rest_managed.json
   [junit4]   2> 1443819 INFO  (coreLoadExecutor-4157-thread-1-processing-n:127.0.0.1:58300_) [n:127.0.0.1:58300_ c:control_collection s:shard1 r:core_node1 x:collection1] o.a.s.r.ManagedResourceStorage Loaded null at path _rest_managed.json using ZooKeeperStorageIO:path=/configs/conf1
   [junit4]   2> 1443819 INFO  (coreLoadExecutor-4157-thread-1-processing-n:127.0.0.1:58300_) [n:127.0.0.1:58300_ c:control_collection s:shard1 r:core_node1 x:collection1] o.a.s.r.RestManager Initializing 0 registered ManagedResources
   [junit4]   2> 1443819 INFO  (coreLoadExecutor-4157-thread-1-processing-n:127.0.0.1:58300_) [n:127.0.0.1:58300_ c:control_collection s:shard1 r:core_node1 x:collection1] o.a.s.h.ReplicationHandler Commits will be reserved for  10000
   [junit4]   2> 1443819 INFO  (searcherExecutor-4158-thread-1-processing-n:127.0.0.1:58300_ x:collection1 s:shard1 c:control_collection r:core_node1) [n:127.0.0.1:58300_ c:control_collection s:shard1 r:core_node1 x:collection1] o.a.s.c.SolrCore [collection1] Registered new searcher Searcher@55341d71[collection1] main{ExitableDirectoryReader(UninvertingDirectoryReader())}
   [junit4]   2> 1443819 INFO  (coreLoadExecutor-4157-thread-1-processing-n:127.0.0.1:58300_) [n:127.0.0.1:58300_ c:control_collection s:shard1 r:core_node1 x:collection1] o.a.s.u.UpdateLog Looking up max value of version field to seed version buckets
   [junit4]   2> 1443819 INFO  (coreLoadExecutor-4157-thread-1-processing-n:127.0.0.1:58300_) [n:127.0.0.1:58300_ c:control_collection s:shard1 r:core_node1 x:collection1] o.a.s.u.VersionInfo Refreshing highest value of _version_ for 65536 version buckets from index
   [junit4]   2> 1443819 INFO  (coreLoadExecutor-4157-thread-1-processing-n:127.0.0.1:58300_) [n:127.0.0.1:58300_ c:control_collection s:shard1 r:core_node1 x:collection1] o.a.s.u.VersionInfo No terms found for _version_, cannot seed version bucket highest value from index
   [junit4]   2> 1443819 INFO  (coreLoadExecutor-4157-thread-1-processing-n:127.0.0.1:58300_) [n:127.0.0.1:58300_ c:control_collection s:shard1 r:core_node1 x:collection1] o.a.s.u.UpdateLog Could not find max version in index or recent updates, using new clock 1544606649683017728
   [junit4]   2> 1443819 INFO  (coreLoadExecutor-4157-thread-1-processing-n:127.0.0.1:58300_) [n:127.0.0.1:58300_ c:control_collection s:shard1 r:core_node1 x:collection1] o.a.s.u.UpdateLog Took 0.0ms to seed version buckets with highest version 1544606649683017728
   [junit4]   2> 1443819 INFO  (coreLoadExecutor-4157-thread-1-processing-n:127.0.0.1:58300_) [n:127.0.0.1:58300_ c:control_collection s:shard1 r:core_node1 x:collection1] o.a.s.c.ZkController watch zkdir /configs/conf1
   [junit4]   2> 1443824 INFO  (coreLoadExecutor-4157-thread-1-processing-n:127.0.0.1:58300_) [n:127.0.0.1:58300_ c:control_collection s:shard1 r:core_node1 x:collection1] o.a.s.c.CoreContainer registering core: collection1
   [junit4]   2> 1443825 INFO  (coreZkRegister-4150-thread-1-processing-n:127.0.0.1:58300_ x:collection1 s:shard1 c:control_collection r:core_node1) [n:127.0.0.1:58300_ c:control_collection s:shard1 r:core_node1 x:collection1] o.a.s.c.ZkController Register replica - core:collection1 address:http://127.0.0.1:58300 collection:control_collection shard:shard1
   [junit4]   2> 1443826 INFO  (coreZkRegister-4150-thread-1-processing-n:127.0.0.1:58300_ x:collection1 s:shard1 c:control_collection r:core_node1) [n:127.0.0.1:58300_ c:control_collection s:shard1 r:core_node1 x:collection1] o.a.s.c.c.SolrZkClient makePath: /collections/control_collection/leader_elect/shard1/election
   [junit4]   2> 1443833 INFO  (coreZkRegister-4150-thread-1-processing-n:127.0.0.1:58300_ x:collection1 s:shard1 c:control_collection r:core_node1) [n:127.0.0.1:58300_ c:control_collection s:shard1 r:core_node1 x:collection1] o.a.s.c.LeaderElector Joined leadership election with path: /collections/control_collection/leader_elect/shard1/election/96537915484733444-core_node1-n_0000000000
   [junit4]   2> 1443833 INFO  (coreZkRegister-4150-thread-1-processing-n:127.0.0.1:58300_ x:collection1 s:shard1 c:control_collection r:core_node1) [n:127.0.0.1:58300_ c:control_collection s:shard1 r:core_node1 x:collection1] o.a.s.c.ShardLeaderElectionContext Running the leader process for shard=shard1 and weAreReplacement=false and leaderVoteWait=10000
   [junit4]   2> 1443836 INFO  (coreZkRegister-4150-thread-1-processing-n:127.0.0.1:58300_ x:collection1 s:shard1 c:control_collection r:core_node1) [n:127.0.0.1:58300_ c:control_collection s:shard1 r:core_node1 x:collection1] o.a.s.c.ShardLeaderElectionContext Enough replicas found to continue.
   [junit4]   2> 1443836 INFO  (coreZkRegister-4150-thread-1-processing-n:127.0.0.1:58300_ x:collection1 s:shard1 c:control_collection r:core_node1) [n:127.0.0.1:58300_ c:control_collection s:shard1 r:core_node1 x:collection1] o.a.s.c.ShardLeaderElectionContext I may be the new leader - try and sync
   [junit4]   2> 1443836 INFO  (coreZkRegister-4150-thread-1-processing-n:127.0.0.1:58300_ x:collection1 s:shard1 c:control_collection r:core_node1) [n:127.0.0.1:58300_ c:control_collection s:shard1 r:core_node1 x:collection1] o.a.s.c.SyncStrategy Sync replicas to http://127.0.0.1:58300/collection1/
   [junit4]   2> 1443836 INFO  (coreZkRegister-4150-thread-1-processing-n:127.0.0.1:58300_ x:collection1 s:shard1 c:control_collection r:core_node1) [n:127.0.0.1:58300_ c:control_collection s:shard1 r:core_node1 x:collection1] o.a.s.c.SyncStrategy Sync Success - now sync replicas to me
   [junit4]   2> 1443837 INFO  (coreZkRegister-4150-thread-1-processing-n:127.0.0.1:58300_ x:collection1 s:shard1 c:control_collection r:core_node1) [n:127.0.0.1:58300_ c:control_collection s:shard1 r:core_node1 x:collection1] o.a.s.c.SyncStrategy http://127.0.0.1:58300/collection1/ has no replicas
   [junit4]   2> 1443837 INFO  (OverseerStateUpdate-96537915484733444-127.0.0.1:58300_-n_0000000000) [n:127.0.0.1:58300_    ] o.a.s.c.Overseer processMessage: queueSize: 1, message = {
   [junit4]   2>   "operation":"leader",
   [junit4]   2>   "shard":"shard1",
   [junit4]   2>   "collection":"control_collection"} current state version: 1
   [junit4]   2> 1443838 INFO  (coreZkRegister-4150-thread-1-processing-n:127.0.0.1:58300_ x:collection1 s:shard1 c:control_collection r:core_node1) [n:127.0.0.1:58300_ c:control_collection s:shard1 r:core_node1 x:collection1] o.a.s.c.c.SolrZkClient makePath: /collections/control_collection/leaders/shard1
   [junit4]   2> 1443842 INFO  (coreZkRegister-4150-thread-1-processing-n:127.0.0.1:58300_ x:collection1 s:shard1 c:control_collection r:core_node1) [n:127.0.0.1:58300_ c:control_collection s:shard1 r:core_node1 x:collection1] o.a.s.c.ShardLeaderElectionContextBase Creating leader registration node /collections/control_collection/leaders/shard1/leader after winning as /collections/control_collection/leader_elect/shard1/election/96537915484733444-core_node1-n_0000000000
   [junit4]   2> 1443846 INFO  (coreZkRegister-4150-thread-1-processing-n:127.0.0.1:58300_ x:collection1 s:shard1 c:control_collection r:core_node1) [n:127.0.0.1:58300_ c:control_collection s:shard1 r:core_node1 x:collection1] o.a.s.c.ShardLeaderElectionContext I am the new leader: http://127.0.0.1:58300/collection1/ shard1
   [junit4]   2> 1443848 INFO  (OverseerStateUpdate-96537915484733444-127.0.0.1:58300_-n_0000000000) [n:127.0.0.1:58300_    ] o.a.s.c.Overseer processMessage: queueSize: 1, message = {
   [junit4]   2>   "operation":"leader",
   [junit4]   2>   "shard":"shard1",
   [junit4]   2>   "collection":"control_collection",
   [junit4]   2>   "base_url":"http://127.0.0.1:58300",
   [junit4]   2>   "core":"collection1",
   [junit4]   2>   "state":"active"} current state version: 1
   [junit4]   2> 1443953 INFO  (zkCallback-1937-thread-1-processing-n:127.0.0.1:58300_) [n:127.0.0.1:58300_    ] o.a.s.c.c.ZkStateReader A cluster state change: [WatchedEvent state:SyncConnected type:NodeDataChanged path:/clusterstate.json], has occurred - updating... (live nodes size: [1])
   [junit4]   2> 1444000 INFO  (coreZkRegister-4150-thread-1-processing-n:127.0.0.1:58300_ x:collection1 s:shard1 c:control_collection r:core_node1) [n:127.0.0.1:58300_ c:control_collection s:shard1 r:core_node1 x:collection1] o.a.s.c.ZkController We are http://127.0.0.1:58300/collection1/ and leader is http://127.0.0.1:58300/collection1/
   [junit4]   2> 1444000 INFO  (coreZkRegister-4150-thread-1-processing-n:127.0.0.1:58300_ x:collection1 s:shard1 c:control_collection r:core_node1) [n:127.0.0.1:58300_ c:control_collection s:shard1 r:core_node1 x:collection1] o.a.s.c.ZkController No LogReplay needed for core=collection1 baseURL=http://127.0.0.1:58300
   [junit4]   2> 1444000 INFO  (coreZkRegister-4150-thread-1-processing-n:127.0.0.1:58300_ x:collection1 s:shard1 c:control_collection r:core_node1) [n:127.0.0.1:58300_ c:control_collection s:shard1 r:core_node1 x:collection1] o.a.s.c.ZkController I am the leader, no recovery necessary
   [junit4]   2> 1444000 INFO  (coreZkRegister-4150-thread-1-processing-n:127.0.0.1:58300_ x:collection1 s:shard1 c:control_collection r:core_node1) [n:127.0.0.1:58300_ c:control_collection s:shard1 r:core_node1 x:collection1] o.a.s.c.ZkController publishing state=active
   [junit4]   2> 1444000 INFO  (coreZkRegister-4150-thread-1-processing-n:127.0.0.1:58300_ x:collection1 s:shard1 c:control_collection r:core_node1) [n:127.0.0.1:58300_ c:control_collection s:shard1 r:core_node1 x:collection1] o.a.s.c.ZkController numShards not found on descriptor - reading it from system property
   [junit4]   2> 1444002 INFO  (coreZkRegister-4150-thread-1-processing-n:127.0.0.1:58300_ x:collection1 s:shard1 c:control_collection r:core_node1) [n:127.0.0.1:58300_ c:control_collection s:shard1 r:core_node1 x:collection1] o.a.s.c.c.ZkStateReader Checking legacy cluster state for collection control_collection
   [junit4]   2> 1444004 INFO  (OverseerStateUpdate-96537915484733444-127.0.0.1:58300_-n_0000000000) [n:127.0.0.1:58300_    ] o.a.s.c.Overseer processMessage: queueSize: 1, message = {
   [junit4]   2>   "core":"collection1",
   [junit4]   2>   "core_node_name":"core_node1",
   [junit4]   2>   "roles":null,
   [junit4]   2>   "base_url":"http://127.0.0.1:58300",
   [junit4]   2>   "node_name":"127.0.0.1:58300_",
   [junit4]   2>   "numShards":"1",
   [junit4]   2>   "state":"active",
   [junit4]   2>   "shard":"shard1",
   [junit4]   2>   "collection":"control_collection",
   [junit4]   2>   "operation":"state"} current state version: 2
   [junit4]   2> 1444004 INFO  (OverseerStateUpdate-96537915484733444-127.0.0.1:58300_-n_0000000000) [n:127.0.0.1:58300_    ] o.a.s.c.o.ReplicaMutator Update state numShards=1 message={
   [junit4]   2>   "core":"collection1",
   [junit4]   2>   "core_node_name":"core_node1",
   [junit4]   2>   "roles":null,
   [junit4]   2>   "base_url":"http://127.0.0.1:58300",
   [junit4]   2>   "node_name":"127.0.0.1:58300_",
   [junit4]   2>   "numShards":"1",
   [junit4]   2>   "state":"active",
   [junit4]   2>   "shard":"shard1",
   [junit4]   2>   "collection":"control_collection",
   [junit4]   2>   "operation":"state"}
   [junit4]   2> 1444099 INFO  (TEST-ShardSplitTest.testSplitAfterFailedSplit-seed#[259DE6439FF6E1A9]) [    ] o.a.s.c.c.SolrZkClient Using default ZkCredentialsProvider
   [junit4]   2> 1444100 INFO  (TEST-ShardSplitTest.testSplitAfterFailedSplit-seed#[259DE6439FF6E1A9]) [    ] o.a.s.c.c.ConnectionManager Waiting for client to connect to ZooKeeper
   [junit4]   2> 1444102 INFO  (zkCallback-1941-thread-1) [    ] o.a.s.c.c.ConnectionManager Watcher org.apache.solr.common.cloud.ConnectionManager@2c5876e5 name:ZooKeeperConnection Watcher:127.0.0.1:58297/solr got event WatchedEvent state:SyncConnected type:None path:null path:null type:None
   [junit4]   2> 1444102 INFO  (TEST-ShardSplitTest.testSplitAfterFailedSplit-seed#[259DE6439FF6E1A9]) [    ] o.a.s.c.c.ConnectionManager Client is connected to ZooKeeper
   [junit4]   2> 1444102 INFO  (TEST-ShardSplitTest.testSplitAfterFailedSplit-seed#[259DE6439FF6E1A9]) [    ] o.a.s.c.c.SolrZkClient Using default ZkACLProvider
   [junit4]   2> 1444102 INFO  (TEST-ShardSplitTest.testSplitAfterFailedSplit-seed#[259DE6439FF6E1A9]) [    ] o.a.s.c.c.ZkStateReader Updating cluster state from ZooKeeper... 
   [junit4]   2> 1444113 INFO  (zkCallback-1937-thread-3-processing-n:127.0.0.1:58300_) [n:127.0.0.1:58300_    ] o.a.s.c.c.ZkStateReader A cluster state change: [WatchedEvent state:SyncConnected type:NodeDataChanged path:/clusterstate.json], has occurred - updating... (live nodes size: [1])
   [junit4]   2> 1444113 INFO  (TEST-ShardSplitTest.testSplitAfterFailedSplit-seed#[259DE6439FF6E1A9]) [    ] o.a.s.c.c.ZkStateReader Loaded empty cluster properties
   [junit4]   2> 1444114 INFO  (TEST-ShardSplitTest.testSplitAfterFailedSplit-seed#[259DE6439FF6E1A9]) [    ] o.a.s.c.c.ZkStateReader Updated live nodes from ZooKeeper... (0) -> (1)
   [junit4]   2> 1444117 INFO  (TEST-ShardSplitTest.testSplitAfterFailedSplit-seed#[259DE6439FF6E1A9]) [    ] o.a.s.c.ChaosMonkey monkey: init - expire sessions:false cause connection loss:false
   [junit4]   2> 1444117 INFO  (TEST-ShardSplitTest.testSplitAfterFailedSplit-seed#[259DE6439FF6E1A9]) [    ] o.a.s.c.AbstractFullDistribZkTestBase Creating collection1 with stateFormat=2
   [junit4]   2> 1444117 INFO  (TEST-ShardSplitTest.testSplitAfterFailedSplit-seed#[259DE6439FF6E1A9]) [    ] o.a.s.c.c.SolrZkClient Using default ZkCredentialsProvider
   [junit4]   2> 1444118 INFO  (TEST-ShardSplitTest.testSplitAfterFailedSplit-seed#[259DE6439FF6E1A9]) [    ] o.a.s.c.c.ConnectionManager Waiting for client to connect to ZooKeeper
   [junit4]   2> 1444120 INFO  (zkCallback-1942-thread-1) [    ] o.a.s.c.c.ConnectionManager Watcher org.apache.solr.common.cloud.ConnectionManager@6e10b79e name:ZooKeeperConnection Watcher:127.0.0.1:58297/solr got event WatchedEvent state:SyncConnected type:None path:null path:null type:None
   [junit4]   2> 1444120 INFO  (TEST-ShardSplitTest.testSplitAfterFailedSplit-seed#[259DE6439FF6E1A9]) [    ] o.a.s.c.c.ConnectionManager Client is connected to ZooKeeper
   [junit4]   2> 1444120 INFO  (TEST-ShardSplitTest.testSplitAfterFailedSplit-seed#[259DE6439FF6E1A9]) [    ] o.a.s.c.c.SolrZkClient Using default ZkACLProvider
   [junit4]   2> 1444123 INFO  (OverseerStateUpdate-96537915484733444-127.0.0.1:58300_-n_0000000000) [n:127.0.0.1:58300_    ] o.a.s.c.Overseer processMessage: queueSize: 1, message = {
   [junit4]   2>   "operation":"create",
   [junit4]   2>   "name":"collection1",
   [junit4]   2>   "numShards":"2",
   [junit4]   2>   "stateFormat":"2"} current state version: 3
   [junit4]   2> 1444123 INFO  (OverseerStateUpdate-96537915484733444-127.0.0.1:58300_-n_0000000000) [n:127.0.0.1:58300_    ] o.a.s.c.o.ClusterStateMutator building a new cName: collection1
   [junit4]   2> 1444229 INFO  (OverseerStateUpdate-96537915484733444-127.0.0.1:58300_-n_0000000000) [n:127.0.0.1:58300_    ] o.a.s.c.o.ZkStateWriter going to create_collection /collections/collection1/state.json
   [junit4]   2> 1444368 INFO  (TEST-ShardSplitTest.testSplitAfterFailedSplit-seed#[259DE6439FF6E1A9]) [    ] o.a.s.SolrTestCaseJ4 Writing core.properties file to /Users/jenkins/workspace/Lucene-Solr-master-MacOSX/solr/build/solr-core/test/J0/temp/solr.cloud.ShardSplitTest_259DE6439FF6E1A9-001/shard-1-001/cores/collection1
   [junit4]   2> 1444369 INFO  (TEST-ShardSplitTest.testSplitAfterFailedSplit-seed#[259DE6439FF6E1A9]) [    ] o.a.s.c.AbstractFullDistribZkTestBase create jetty 1 in directory /Users/jenkins/workspace/Lucene-Solr-master-MacOSX/solr/build/solr-core/test/J0/temp/solr.cloud.ShardSplitTest_259DE6439FF6E1A9-001/shard-1-001
   [junit4]   2> 1444370 INFO  (TEST-ShardSplitTest.testSplitAfterFailedSplit-seed#[259DE6439FF6E1A9]) [    ] o.e.j.s.Server jetty-9.3.8.v20160314
   [junit4]   2> 1444373 INFO  (TEST-ShardSplitTest.testSplitAfterFailedSplit-seed#[259DE6439FF6E1A9]) [    ] o.e.j.s.h.ContextHandler Started o.e.j.s.ServletContextHandler@2ad701c2{/,null,AVAILABLE}
   [junit4]   2> 1444373 INFO  (TEST-ShardSplitTest.testSplitAfterFailedSplit-seed#[259DE6439FF6E1A9]) [    ] o.e.j.s.ServerConnector Started ServerConnector@43b85388{HTTP/1.1,[http/1.1]}{127.0.0.1:58556}
   [junit4]   2> 1444373 INFO  (TEST-ShardSplitTest.testSplitAfterFailedSplit-seed#[259DE6439FF6E1A9]) [    ] o.e.j.s.Server Started @1449730ms
   [junit4]   2> 1444373 INFO  (TEST-ShardSplitTest.testSplitAfterFailedSplit-seed#[259DE6439FF6E1A9]) [    ] o.a.s.c.s.e.JettySolrRunner Jetty properties: {solr.data.dir=/Users/jenkins/workspace/Lucene-Solr-master-MacOSX/solr/build/solr-core/test/J0/temp/solr.cloud.ShardSplitTest_259DE6439FF6E1A9-001/tempDir-001/jetty1, solrconfig=solrconfig.xml, hostContext=/, hostPort=58556, coreRootDirectory=/Users/jenkins/workspace/Lucene-Solr-master-MacOSX/solr/build/solr-core/test/J0/temp/solr.cloud.ShardSplitTest_259DE6439FF6E1A9-001/shard-1-001/cores}
   [junit4]   2> 1444374 INFO  (TEST-ShardSplitTest.testSplitAfterFailedSplit-seed#[259DE6439FF6E1A9]) [    ] o.a.s.s.SolrDispatchFilter SolrDispatchFilter.init(): sun.misc.Launcher$AppClassLoader@4554617c
   [junit4]   2> 1444374 INFO  (TEST-ShardSplitTest.testSplitAfterFailedSplit-seed#[259DE6439FF6E1A9]) [    ] o.a.s.c.SolrResourceLoader new SolrResourceLoader for directory: '/Users/jenkins/workspace/Lucene-Solr-master-MacOSX/solr/build/solr-core/test/J0/temp/solr.cloud.ShardSplitTest_259DE6439FF6E1A9-001/shard-1-001'
   [junit4]   2> 1444374 INFO  (TEST-ShardSplitTest.testSplitAfterFailedSplit-seed#[259DE6439FF6E1A9]) [    ] o.a.s.c.SolrResourceLoader JNDI not configured for solr (NoInitialContextEx)
   [junit4]   2> 1444374 INFO  (TEST-ShardSplitTest.testSplitAfterFailedSplit-seed#[259DE6439FF6E1A9]) [    ] o.a.s.c.SolrResourceLoader solr home defaulted to 'solr/' (could not find system property or JNDI)
   [junit4]   2> 1444375 INFO  (TEST-ShardSplitTest.testSplitAfterFailedSplit-seed#[259DE6439FF6E1A9]) [    ] o.a.s.c.c.SolrZkClient Using default ZkCredentialsProvider
   [junit4]   2> 1444375 INFO  (TEST-ShardSplitTest.testSplitAfterFailedSplit-seed#[259DE6439FF6E1A9]) [    ] o.a.s.c.c.ConnectionManager Waiting for client to connect to ZooKeeper
   [junit4]   2> 1444376 INFO  (zkCallback-1943-thread-1) [    ] o.a.s.c.c.ConnectionManager Watcher org.apache.solr.common.cloud.ConnectionManager@2b4be333 name:ZooKeeperConnection Watcher:127.0.0.1:58297/solr got event WatchedEvent state:SyncConnected type:None path:null path:null type:None
   [junit4]   2> 1444377 INFO  (TEST-ShardSplitTest.testSplitAfterFailedSplit-seed#[259DE6439FF6E1A9]) [    ] o.a.s.c.c.ConnectionManager Client is connected to ZooKeeper
   [junit4]   2> 1444377 INFO  (TEST-ShardSplitTest.testSplitAfterFailedSplit-seed#[259DE6439FF6E1A9]) [    ] o.a.s.c.c.SolrZkClient Using default ZkACLProvider
   [junit4]   2> 1444378 INFO  (TEST-ShardSplitTest.testSplitAfterFailedSplit-seed#[259DE6439FF6E1A9]) [    ] o.a.s.s.SolrDispatchFilter Loading solr.xml from SolrHome (not found in ZooKeeper)
   [junit4]   2> 1444378 INFO  (TEST-ShardSplitTest.testSplitAfterFailedSplit-seed#[259DE6439FF6E1A9]) [    ] o.a.s.c.SolrXmlConfig Loading container configuration from /Users/jenkins/workspace/Lucene-Solr-master-MacOSX/solr/build/solr-core/test/J0/temp/solr.cloud.ShardSplitTest_259DE6439FF6E1A9-001/shard-1-001/solr.xml
   [junit4]   2> 1444392 INFO  (TEST-ShardSplitTest.testSplitAfterFailedSplit-seed#[259DE6439FF6E1A9]) [    ] o.a.s.c.CorePropertiesLocator Config-defined core root directory: /Users/jenkins/workspace/Lucene-Solr-master-MacOSX/solr/build/solr-core/test/J0/temp/solr.cloud.ShardSplitTest_259DE6439FF6E1A9-001/shard-1-001/cores
   [junit4]   2> 1444392 INFO  (TEST-ShardSplitTest.testSplitAfterFailedSplit-seed#[259DE6439FF6E1A9]) [    ] o.a.s.c.CoreContainer New CoreContainer 101661243
   [junit4]   2> 1444392 INFO  (TEST-ShardSplitTest.testSplitAfterFailedSplit-seed#[259DE6439FF6E1A9]) [    ] o.a.s.c.CoreContainer Loading cores into CoreContainer [instanceDir=/Users/jenkins/workspace/Lucene-Solr-master-MacOSX/solr/build/solr-core/test/J0/temp/solr.cloud.ShardSplitTest_259DE6439FF6E1A9-001/shard-1-001]
   [junit4]   2> 1444392 WARN  (TEST-ShardSplitTest.testSplitAfterFailedSplit-seed#[259DE6439FF6E1A9]) [    ] o.a.s.c.CoreContainer Couldn't add files from /Users/jenkins/workspace/Lucene-Solr-master-MacOSX/solr/build/solr-core/test/J0/temp/solr.cloud.ShardSplitTest_259DE6439FF6E1A9-001/shard-1-001/lib to classpath: /Users/jenkins/workspace/Lucene-Solr-master-MacOSX/solr/build/solr-core/test/J0/temp/solr.cloud.ShardSplitTest_259DE6439FF6E1A9-001/shard-1-001/lib
   [junit4]   2> 1444392 INFO  (TEST-ShardSplitTest.testSplitAfterFailedSplit-seed#[259DE6439FF6E1A9]) [    ] o.a.s.h.c.HttpShardHandlerFactory created with socketTimeout : 90000,urlScheme : ,connTimeout : 15000,maxConnectionsPerHost : 20,maxConnections : 10000,corePoolSize : 0,maximumPoolSize : 2147483647,maxThreadIdleTime : 5,sizeOfQueue : -1,fairnessPolicy : false,
   [junit4]   2> 1444396 INFO  (TEST-ShardSplitTest.testSplitAfterFailedSplit-seed#[259DE6439FF6E1A9]) [    ] o.a.s.u.UpdateShardHandler Created UpdateShardHandler HTTP client with params: socketTimeout=340000&connTimeout=45000&maxConnections=100000&maxConnectionsPerHost=100000
   [junit4]   2> 1444396 INFO  (TEST-ShardSplitTest.testSplitAfterFailedSplit-seed#[259DE6439FF6E1A9]) [    ] o.a.s.l.LogWatcher SLF4J impl is org.slf4j.impl.Log4jLoggerFactory
   [junit4]   2> 1444396 INFO  (TEST-ShardSplitTest.testSplitAfterFailedSplit-seed#[259DE6439FF6E1A9]) [    ] o.a.s.l.LogWatcher Registering Log Listener [Log4j (org.slf4j.impl.Log4jLoggerFactory)]
   [junit4]   2> 1444396 INFO  (TEST-ShardSplitTest.testSplitAfterFailedSplit-seed#[259DE6439FF6E1A9]) [    ] o.a.s.c.ZkContainer Zookeeper client=127.0.0.1:58297/solr
   [junit4]   2> 1444397 INFO  (TEST-ShardSplitTest.testSplitAfterFailedSplit-seed#[259DE6439FF6E1A9]) [    ] o.a.s.c.ZkController zkHost includes chroot
   [junit4]   2> 1444397 INFO  (TEST-ShardSplitTest.testSplitAfterFailedSplit-seed#[259DE6439FF6E1A9]) [    ] o.a.s.c.c.SolrZkClient Using default ZkCredentialsProvider
   [junit4]   2> 1444397 INFO  (TEST-ShardSplitTest.testSplitAfterFailedSplit-seed#[259DE6439FF6E1A9]) [    ] o.a.s.c.c.ConnectionManager Waiting for client to connect to ZooKeeper
   [junit4]   2> 1444398 INFO  (zkCallback-1946-thread-1) [    ] o.a.s.c.c.ConnectionManager Watcher org.apache.solr.common.cloud.ConnectionManager@54fb2ba name:ZooKeeperConnection Watcher:127.0.0.1:58297 got event WatchedEvent state:SyncConnected type:None path:null path:null type:None
   [junit4]   2> 1444399 INFO  (TEST-ShardSplitTest.testSplitAfterFailedSplit-seed#[259DE6439FF6E1A9]) [    ] o.a.s.c.c.ConnectionManager Client is connected to ZooKeeper
   [junit4]   2> 1444399 INFO  (TEST-ShardSplitTest.testSplitAfterFailedSplit-seed#[259DE6439FF6E1A9]) [    ] o.a.s.c.c.SolrZkClient Using default ZkACLProvider
   [junit4]   2> 1444400 INFO  (TEST-ShardSplitTest.testSplitAfterFailedSplit-seed#[259DE6439FF6E1A9]) [n:127.0.0.1:58556_    ] o.a.s.c.ZkController Added new OnReconnect listener org.apache.solr.cloud.ZkController$$Lambda$67/466469649@48e222f0
   [junit4]   2> 1444401 INFO  (TEST-ShardSplitTest.testSplitAfterFailedSplit-seed#[259DE6439FF6E1A9]) [n:127.0.0.1:58556_    ] o.a.s.c.c.ConnectionManager Waiting for client to connect to ZooKeeper
   [junit4]   2> 1444402 INFO  (zkCallback-1947-thread-1-processing-n:127.0.0.1:58556_) [n:127.0.0.1:58556_    ] o.a.s.c.c.ConnectionManager Watcher org.apache.solr.common.cloud.ConnectionManager@60703efa name:ZooKeeperConnection Watcher:127.0.0.1:58297/solr got event WatchedEvent state:SyncConnected type:None path:null path:null type:None
   [junit4]   2> 1444402 INFO  (TEST-ShardSplitTest.testSplitAfterFailedSplit-seed#[259DE6439FF6E1A9]) [n:127.0.0.1:58556_    ] o.a.s.c.c.ConnectionManager Client is connected to ZooKeeper
   [junit4]   2> 1444412 INFO  (TEST-ShardSplitTest.testSplitAfterFailedSplit-seed#[259DE6439FF6E1A9]) [n:127.0.0.1:58556_    ] o.a.s.c.c.ZkStateReader Updating cluster state from ZooKeeper... 
   [junit4]   2> 1444413 INFO  (TEST-ShardSplitTest.testSplitAfterFailedSplit-seed#[259DE6439FF6E1A9]) [n:127.0.0.1:58556_    ] o.a.s.c.c.ZkStateReader Loaded empty cluster properties
   [junit4]   2> 1444413 INFO  (TEST-ShardSplitTest.testSplitAfterFailedSplit-seed#[259DE6439FF6E1A9]) [n:127.0.0.1:58556_    ] o.a.s.c.c.ZkStateReader Updated live nodes from ZooKeeper... (0) -> (1)
   [junit4]   2> 1444419 INFO  (TEST-ShardSplitTest.testSplitAfterFailedSplit-seed#[259DE6439FF6E1A9]) [n:127.0.0.1:58556_    ] o.a.s.c.Overseer Overseer (id=null) closing
   [junit4]   2> 1444420 INFO  (TEST-ShardSplitTest.testSplitAfterFailedSplit-seed#[259DE6439FF6E1A9]) [n:127.0.0.1:58556_    ] o.a.s.c.LeaderElector Joined leadership election with path: /overseer_elect/election/96537915484733449-127.0.0.1:58556_-n_0000000001
   [junit4]   2> 1444421 INFO  (TEST-ShardSplitTest.testSplitAfterFailedSplit-seed#[259DE6439FF6E1A9]) [n:127.0.0.1:58556_    ] o.a.s.c.LeaderElector Watching path /overseer_elect/election/96537915484733444-127.0.0.1:58300_-n_0000000000 to know if I could be the leader
   [junit4]   2> 1444421 INFO  (TEST-ShardSplitTest.testSplitAfterFailedSplit-seed#[259DE6439FF6E1A9]) [n:127.0.0.1:58556_    ] o.a.s.c.ZkController Publish node=127.0.0.1:58556_ as DOWN
   [junit4]   2> 1444423 INFO  (TEST-ShardSplitTest.testSplitAfterFailedSplit-seed#[259DE6439FF6E1A9]) [n:127.0.0.1:58556_    ] o.a.s.c.ZkController Register node as live in ZooKeeper:/live_nodes/127.0.0.1:58556_
   [junit4]   2> 1444423 INFO  (TEST-ShardSplitTest.testSplitAfterFailedSplit-seed#[259DE6439FF6E1A9]) [n:127.0.0.1:58556_    ] o.a.s.c.c.SolrZkClient makePath: /live_nodes/127.0.0.1:58556_
   [junit4]   2> 1444424 INFO  (OverseerStateUpdate-96537915484733444-127.0.0.1:58300_-n_0000000000) [n:127.0.0.1:58300_    ] o.a.s.c.Overseer processMessage: queueSize: 1, message = {
   [junit4]   2>   "operation":"downnode",
   [junit4]   2>   "node_name":"127.0.0.1:58556_"} current state version: 3
   [junit4]   2> 1444424 INFO  (OverseerStateUpdate-96537915484733444-127.0.0.1:58300_-n_0000000000) [n:127.0.0.1:58300_    ] o.a.s.c.o.NodeMutator DownNode state invoked for node: 127.0.0.1:58556_
   [junit4]   2> 1444425 INFO  (zkCallback-1937-thread-3-processing-n:127.0.0.1:58300_) [n:127.0.0.1:58300_    ] o.a.s.c.c.ZkStateReader A live node change: [WatchedEvent state:SyncConnected type:NodeChildrenChanged path:/live_nodes], has occurred - updating... (live nodes size: [1])
   [junit4]   2> 1444425 INFO  (zkCallback-1947-thread-1-processing-n:127.0.0.1:58556_) [n:127.0.0.1:58556_    ] o.a.s.c.c.ZkStateReader A live node change: [WatchedEvent state:SyncConnected type:NodeChildrenChanged path:/live_nodes], has occurred - updating... (live nodes size: [1])
   [junit4]   2> 1444425 INFO  (zkCallback-1941-thread-1) [    ] o.a.s.c.c.ZkStateReader A live node change: [WatchedEvent state:SyncConnected type:NodeChildrenChanged path:/live_nodes], has occurred - updating... (live nodes size: [1])
   [junit4]   2> 1444426 INFO  (zkCallback-1937-thread-3-processing-n:127.0.0.1:58300_) [n:127.0.0.1:58300_    ] o.a.s.c.c.ZkStateReader Updated live nodes from ZooKeeper... (1) -> (2)
   [junit4]   2> 1444427 INFO  (zkCallback-1947-thread-1-processing-n:127.0.0.1:58556_) [n:127.0.0.1:58556_    ] o.a.s.c.c.ZkStateReader Updated live nodes from ZooKeeper... (1) -> (2)
   [junit4]   2> 1444427 INFO  (zkCallback-1941-thread-1) [    ] o.a.s.c.c.ZkStateReader Updated live nodes from ZooKeeper... (1) -> (2)
   [junit4]   2> 1444427 INFO  (zkCallback-1937-thread-3-processing-n:127.0.0.1:58300_) [n:127.0.0.1:58300_    ] o.a.s.c.c.ZkStateReader A cluster state change: [WatchedEvent state:SyncConnected type:NodeDataChanged path:/clusterstate.json], has occurred - updating... (live nodes size: [2])
   [junit4]   2> 1444427 INFO  (zkCallback-1941-thread-1) [    ] o.a.s.c.c.ZkStateReader A cluster state change: [WatchedEvent state:SyncConnected type:NodeDataChanged path:/clusterstate.json], has occurred - updating... (live nodes size: [2])
   [junit4]   2> 1444428 INFO  (zkCallback-1947-thread-1-processing-n:127.0.0.1:58556_) [n:127.0.0.1:58556_    ] o.a.s.c.c.ZkStateReader A cluster state change: [WatchedEvent state:SyncConnected type:NodeDataChanged path:/clusterstate.json], has occurred - updating... (live nodes size: [2])
   [junit4]   2> 1444443 INFO  (TEST-ShardSplitTest.testSplitAfterFailedSplit-seed#[259DE6439FF6E1A9]) [n:127.0.0.1:58556_    ] o.a.s.c.CoreContainer Security conf doesn't exist. Skipping setup for authorization module.
   [junit4]   2> 1444443 INFO  (TEST-ShardSplitTest.testSplitAfterFailedSplit-seed#[259DE6439FF6E1A9]) [n:127.0.0.1:58556_    ] o.a.s.c.CoreContainer No authentication plugin used.
   [junit4]   2> 1444444 INFO  (TEST-ShardSplitTest.testSplitAfterFailedSplit-seed#[259DE6439FF6E1A9]) [n:127.0.0.1:58556_    ] o.a.s.c.CorePropertiesLocator Looking for core definitions underneath /Users/jenkins/workspace/Lucene-Solr-master-MacOSX/solr/build/solr-core/test/J0/temp/solr.cloud.ShardSplitTest_259DE6439FF6E1A9-001/shard-1-001/cores
   [junit4]   2> 1444445 INFO  (TEST-ShardSplitTest.testSplitAfterFailedSplit-seed#[259DE6439FF6E1A9]) [n:127.0.0.1:58556_    ] o.a.s.c.CoreDescriptor Created CoreDescriptor: {name=collection1, config=solrconfig.xml, transient=false, schema=schema.xml, loadOnStartup=true, configSetProperties=configsetprops.json, collection=collection1, coreNodeName=, dataDir=data/, shard=}
   [junit4]   2> 1444445 INFO  (TEST-ShardSplitTest.testSplitAfterFailedSplit-seed#[259DE6439FF6E1A9]) [n:127.0.0.1:58556_    ] o.a.s.c.CorePropertiesLocator Found core collection1 in /Users/jenkins/workspace/Lucene-Solr-master-MacOSX/solr/build/solr-core/test/J0/temp/solr.cloud.ShardSplitTest_259DE6439FF6E1A9-001/shard-1-001/cores/collection1
   [junit4]   2> 1444445 INFO  (TEST-ShardSplitTest.testSplitAfterFailedSplit-seed#[259DE6439FF6E1A9]) [n:127.0.0.1:58556_    ] o.a.s.c.CorePropertiesLocator Found 1 core definitions
   [junit4]   2> 1444447 INFO  (TEST-ShardSplitTest.testSplitAfterFailedSplit-seed#[259DE6439FF6E1A9]) [n:127.0.0.1:58556_    ] o.a.s.s.SolrDispatchFilter user.dir=/Users/jenkins/workspace/Lucene-Solr-master-MacOSX/solr/build/solr-core/test/J0
   [junit4]   2> 1444447 INFO  (TEST-ShardSplitTest.testSplitAfterFailedSplit-seed#[259DE6439FF6E1A9]) [n:127.0.0.1:58556_    ] o.a.s.s.SolrDispatchFilter SolrDispatchFilter.init() done
   [junit4]   2> 1444447 INFO  (coreLoadExecutor-4168-thread-1-processing-n:127.0.0.1:58556_) [n:127.0.0.1:58556_ c:collection1   x:collection1] o.a.s.c.ZkController publishing state=down
   [junit4]   2> 1444447 INFO  (coreLoadExecutor-4168-thread-1-processing-n:127.0.0.1:58556_) [n:127.0.0.1:58556_ c:collection1   x:collection1] o.a.s.c.ZkController numShards not found on descriptor - reading it from system property
   [junit4]   2> 1444448 INFO  (coreLoadExecutor-4168-thread-1-processing-n:127.0.0.1:58556_) [n:127.0.0.1:58556_ c:collection1   x:collection1] o.a.s.c.ZkController Registering watch for collection collection1
   [junit4]   2> 1444449 INFO  (coreLoadExecutor-4168-thread-1-processing-n:127.0.0.1:58556_) [n:127.0.0.1:58556_ c:collection1   x:collection1] o.a.s.c.c.ZkStateReader Add data for [collection1] ver [0]
   [junit4]   2> 1444449 INFO  (OverseerStateUpdate-96537915484733444-127.0.0.1:58300_-n_0000000000) [n:127.0.0.1:58300_    ] o.a.s.c.Overseer processMessage: queueSize: 1, message = {
   [junit4]   2>   "core":"collection1",
   [junit4]   2>   "roles":null,
   [junit4]   2>   "base_url":"http://127.0.0.1:58556",
   [junit4]   2>   "node_name":"127.0.0.1:58556_",
   [junit4]   2>   "numShards":"2",
   [junit4]   2>   "state":"down",
   [junit4]   2>   "shard":null,
   [junit4]   2>   "collection":"collection1",
   [junit4]   2>   "operation":"state"} current state version: 4
   [junit4]   2> 1444449 INFO  (coreLoadExecutor-4168-thread-1-processing-n:127.0.0.1:58556_) [n:127.0.0.1:58556_ c:collection1   x:collection1] o.a.s.c.ZkController look for our core node name
   [junit4]   2> 1444449 INFO  (OverseerStateUpdate-96537915484733444-127.0.0.1:58300_-n_0000000000) [n:127.0.0.1:58300_    ] o.a.s.c.o.ReplicaMutator Update state numShards=2 message={
   [junit4]   2>   "core":"collection1",
   [junit4]   2>   "roles":null,
   [junit4]   2>   "base_url":"http://127.0.0.1:58556",
   [junit4]   2>   "node_name":"127.0.0.1:58556_",
   [junit4]   2>   "numShards":"2",
   [junit4]   2>   "state":"down",
   [junit4]   2>   "shard":null,
   [junit4]   2>   "collection":"collection1",
   [junit4]   2>   "operation":"state"}
   [junit4]   2> 1444449 INFO  (OverseerStateUpdate-96537915484733444-127.0.0.1:58300_-n_0000000000) [n:127.0.0.1:58300_    ] o.a.s.c.o.ReplicaMutator Collection already exists with numShards=2
   [junit4]   2> 1444449 INFO  (OverseerStateUpdate-96537915484733444-127.0.0.1:58300_-n_0000000000) [n:127.0.0.1:58300_    ] o.a.s.c.o.ReplicaMutator Assigning new node to shard shard=shard2
   [junit4]   2> 1444563 INFO  (OverseerStateUpdate-96537915484733444-127.0.0.1:58300_-n_0000000000) [n:127.0.0.1:58300_    ] o.a.s.c.o.ZkStateWriter going to update_collection /collections/collection1/state.json version: 0
   [junit4]   2> 1444564 INFO  (zkCallback-1947-thread-1-processing-n:127.0.0.1:58556_) [n:127.0.0.1:58556_    ] o.a.s.c.c.ZkStateReader A cluster state change: [WatchedEvent state:SyncConnected type:NodeDataChanged path:/collections/collection1/state.json] for collection [collection1] has occurred - updating... (live nodes size: [2])
   [junit4]   2> 1444565 INFO  (zkCallback-1947-thread-1-processing-n:127.0.0.1:58556_) [n:127.0.0.1:58556_    ] o.a.s.c.c.ZkStateReader Updating data for [collection1] from [0] to [1]
   [junit4]   2> 1445450 INFO  (coreLoadExecutor-4168-thread-1-processing-n:127.0.0.1:58556_) [n:127.0.0.1:58556_ c:collection1   x:collection1] o.a.s.c.ZkController waiting to find shard id in clusterstate for collection1
   [junit4]   2> 1445450 INFO  (coreLoadExecutor-4168-thread-1-processing-n:127.0.0.1:58556_) [n:127.0.0.1:58556_ c:collection1   x:collection1] o.a.s.c.ZkController Check for collection zkNode:collection1
   [junit4]   2> 1445451 INFO  (coreLoadExecutor-4168-thread-1-processing-n:127.0.0.1:58556_) [n:127.0.0.1:58556_ c:collection1   x:collection1] o.a.s.c.ZkController Collection zkNode exists
   [junit4]   2> 1445451 INFO  (coreLoadExecutor-4168-thread-1-processing-n:127.0.0.1:58556_) [n:127.0.0.1:58556_ c:collection1   x:collection1] o.a.s.c.c.ZkStateReader Load collection config from: [/collections/collection1]
   [junit4]   2> 1445452 INFO  (coreLoadExecutor-4168-thread-1-processing-n:127.0.0.1:58556_) [n:127.0.0.1:58556_ c:collection1   x:collection1] o.a.s.c.c.ZkStateReader path=[/collections/collection1] [configName]=[conf1] specified config exists in ZooKeeper
   [junit4]   2> 1445452 INFO  (coreLoadExecutor-4168-thread-1-processing-n:127.0.0.1:58556_) [n:127.0.0.1:58556_ c:collection1   x:collection1] o.a.s.c.SolrResourceLoader new SolrResourceLoader for directory: '/Users/jenkins/workspace/Lucene-Solr-master-MacOSX/solr/build/solr-core/test/J0/temp/solr.cloud.ShardSplitTest_259DE6439FF6E1A9-001/shard-1-001/cores/collection1'
   [junit4]   2> 1445452 INFO  (coreLoadExecutor-4168-thread-1-processing-n:127.0.0.1:58556_) [n:127.0.0.1:58556_ c:collection1   x:collection1] o.a.s.c.SolrResourceLoader JNDI not configured for solr (NoInitialContextEx)
   [junit4]   2> 1445453 INFO  (coreLoadExecutor-4168-thread-1-processing-n:127.0.0.1:58556_) [n:127.0.0.1:58556_ c:collection1   x:collection1] o.a.s.c.SolrResourceLoader solr home defaulted to 'solr/' (could not find system property or JNDI)
   [junit4]   2> 1445455 INFO  (coreLoadExecutor-4168-thread-1-processing-n:127.0.0.1:58556_) [n:127.0.0.1:58556_ c:collection1   x:collection1] o.a.s.c.Config loaded config solrconfig.xml with version 0 
   [junit4]   2> 1445461 INFO  (coreLoadExecutor-4168-thread-1-processing-n:127.0.0.1:58556_) [n:127.0.0.1:58556_ c:collection1   x:collection1] o.a.s.c.SolrConfig current version of requestparams : -1
   [junit4]   2> 1445465 INFO  (coreLoadExecutor-4168-thread-1-processing-n:127.0.0.1:58556_) [n:127.0.0.1:58556_ c:collection1   x:collection1] o.a.s.c.SolrConfig Using Lucene MatchVersion: 7.0.0
   [junit4]   2> 1445480 INFO  (coreLoadExecutor-4168-thread-1-processi

[...truncated too long message...]

junit4]   2> 1589633 INFO  (coreCloseExecutor-4457-thread-1) [n:127.0.0.1:52288_ c:collection1 s:shard1 r:core_node4 x:collection1] o.a.s.c.CachingDirectoryFactory looking to close /Users/jenkins/workspace/Lucene-Solr-master-MacOSX/solr/build/solr-core/test/J0/temp/solr.cloud.ShardSplitTest_259DE6439FF6E1A9-001/shard-4-003/cores/collection1/data/index [CachedDir<<refCount=0;path=/Users/jenkins/workspace/Lucene-Solr-master-MacOSX/solr/build/solr-core/test/J0/temp/solr.cloud.ShardSplitTest_259DE6439FF6E1A9-001/shard-4-003/cores/collection1/data/index;done=false>>]
   [junit4]   2> 1589633 INFO  (coreCloseExecutor-4457-thread-1) [n:127.0.0.1:52288_ c:collection1 s:shard1 r:core_node4 x:collection1] o.a.s.c.CachingDirectoryFactory Closing directory, CoreContainer#isShutdown=true
   [junit4]   2> 1589633 INFO  (coreCloseExecutor-4457-thread-1) [n:127.0.0.1:52288_ c:collection1 s:shard1 r:core_node4 x:collection1] o.a.s.c.CachingDirectoryFactory Closing directory: /Users/jenkins/workspace/Lucene-Solr-master-MacOSX/solr/build/solr-core/test/J0/temp/solr.cloud.ShardSplitTest_259DE6439FF6E1A9-001/shard-4-003/cores/collection1/data/index
   [junit4]   2> 1589633 INFO  (coreCloseExecutor-4457-thread-1) [n:127.0.0.1:52288_ c:collection1 s:shard1 r:core_node4 x:collection1] o.a.s.c.CachingDirectoryFactory looking to close /Users/jenkins/workspace/Lucene-Solr-master-MacOSX/solr/build/solr-core/test/J0/temp/solr.cloud.ShardSplitTest_259DE6439FF6E1A9-001/shard-4-003/cores/collection1/data [CachedDir<<refCount=0;path=/Users/jenkins/workspace/Lucene-Solr-master-MacOSX/solr/build/solr-core/test/J0/temp/solr.cloud.ShardSplitTest_259DE6439FF6E1A9-001/shard-4-003/cores/collection1/data;done=false>>]
   [junit4]   2> 1589633 INFO  (coreCloseExecutor-4457-thread-1) [n:127.0.0.1:52288_ c:collection1 s:shard1 r:core_node4 x:collection1] o.a.s.c.CachingDirectoryFactory Closing directory, CoreContainer#isShutdown=true
   [junit4]   2> 1589633 INFO  (coreCloseExecutor-4457-thread-1) [n:127.0.0.1:52288_ c:collection1 s:shard1 r:core_node4 x:collection1] o.a.s.c.CachingDirectoryFactory Closing directory: /Users/jenkins/workspace/Lucene-Solr-master-MacOSX/solr/build/solr-core/test/J0/temp/solr.cloud.ShardSplitTest_259DE6439FF6E1A9-001/shard-4-003/cores/collection1/data
   [junit4]   2> 1589635 INFO  (coreCloseExecutor-4457-thread-1) [n:127.0.0.1:52288_ c:collection1 s:shard1 r:core_node4 x:collection1] o.a.s.c.CachingDirectoryFactory looking to close /Users/jenkins/workspace/Lucene-Solr-master-MacOSX/solr/build/solr-core/test/J0/temp/solr.cloud.ShardSplitTest_259DE6439FF6E1A9-001/shard-4-003/cores/collection1/data/snapshot_metadata [CachedDir<<refCount=0;path=/Users/jenkins/workspace/Lucene-Solr-master-MacOSX/solr/build/solr-core/test/J0/temp/solr.cloud.ShardSplitTest_259DE6439FF6E1A9-001/shard-4-003/cores/collection1/data/snapshot_metadata;done=false>>]
   [junit4]   2> 1589635 INFO  (coreCloseExecutor-4457-thread-1) [n:127.0.0.1:52288_ c:collection1 s:shard1 r:core_node4 x:collection1] o.a.s.c.CachingDirectoryFactory Closing directory, CoreContainer#isShutdown=true
   [junit4]   2> 1589635 INFO  (coreCloseExecutor-4457-thread-1) [n:127.0.0.1:52288_ c:collection1 s:shard1 r:core_node4 x:collection1] o.a.s.c.CachingDirectoryFactory Closing directory: /Users/jenkins/workspace/Lucene-Solr-master-MacOSX/solr/build/solr-core/test/J0/temp/solr.cloud.ShardSplitTest_259DE6439FF6E1A9-001/shard-4-003/cores/collection1/data/snapshot_metadata
   [junit4]   2> 1589636 INFO  (TEST-ShardSplitTest.test-seed#[259DE6439FF6E1A9]) [    ] o.a.s.c.Overseer Overseer (id=96537922431549458-127.0.0.1:52288_-n_0000000004) closing
   [junit4]   2> 1589636 INFO  (OverseerStateUpdate-96537922431549458-127.0.0.1:52288_-n_0000000004) [n:127.0.0.1:52288_    ] o.a.s.c.Overseer Overseer Loop exiting : 127.0.0.1:52288_
   [junit4]   2> 1589638 INFO  (zkCallback-2047-thread-2-processing-n:127.0.0.1:52288_) [n:127.0.0.1:52288_    ] o.a.s.c.c.ZkStateReader A live node change: [WatchedEvent state:SyncConnected type:NodeChildrenChanged path:/live_nodes], has occurred - updating... (live nodes size: [1])
   [junit4]   2> 1589639 WARN  (zkCallback-2047-thread-2-processing-n:127.0.0.1:52288_) [n:127.0.0.1:52288_    ] o.a.s.c.c.ZkStateReader ZooKeeper watch triggered, but Solr cannot talk to ZK: [KeeperErrorCode = Session expired for /live_nodes]
   [junit4]   2> 1589641 INFO  (TEST-ShardSplitTest.test-seed#[259DE6439FF6E1A9]) [    ] o.e.j.s.ServerConnector Stopped ServerConnector@6793151b{HTTP/1.1,[http/1.1]}{127.0.0.1:0}
   [junit4]   2> 1589641 INFO  (TEST-ShardSplitTest.test-seed#[259DE6439FF6E1A9]) [    ] o.e.j.s.h.ContextHandler Stopped o.e.j.s.ServletContextHandler@4c97ec7d{/,null,UNAVAILABLE}
   [junit4]   2> 1589644 INFO  (TEST-ShardSplitTest.test-seed#[259DE6439FF6E1A9]) [    ] o.a.s.c.ZkTestServer connecting to 127.0.0.1:52250 52250
   [junit4]   2> 1589653 INFO  (Thread-1841) [    ] o.a.s.c.ZkTestServer connecting to 127.0.0.1:52250 52250
   [junit4]   2> 1591816 WARN  (Thread-1841) [    ] o.a.s.c.ZkTestServer Watch limit violations: 
   [junit4]   2> Maximum concurrent create/delete watches above limit:
   [junit4]   2> 
   [junit4]   2> 	7	/solr/aliases.json
   [junit4]   2> 	6	/solr/clusterprops.json
   [junit4]   2> 	5	/solr/security.json
   [junit4]   2> 	5	/solr/configs/conf1
   [junit4]   2> 
   [junit4]   2> Maximum concurrent data watches above limit:
   [junit4]   2> 
   [junit4]   2> 	7	/solr/clusterstate.json
   [junit4]   2> 	7	/solr/clusterprops.json
   [junit4]   2> 	5	/solr/collections/collection1/state.json
   [junit4]   2> 
   [junit4]   2> Maximum concurrent children watches above limit:
   [junit4]   2> 
   [junit4]   2> 	70	/solr/overseer/queue
   [junit4]   2> 	35	/solr/overseer/collection-queue-work
   [junit4]   2> 	17	/solr/overseer/queue-work
   [junit4]   2> 	7	/solr/live_nodes
   [junit4]   2> 	7	/solr/collections
   [junit4]   2> 
   [junit4]   2> NOTE: reproduce with: ant test  -Dtestcase=ShardSplitTest -Dtests.method=test -Dtests.seed=259DE6439FF6E1A9 -Dtests.slow=true -Dtests.locale=cs -Dtests.timezone=Australia/Currie -Dtests.asserts=true -Dtests.file.encoding=ISO-8859-1
   [junit4] FAILURE 43.9s J0 | ShardSplitTest.test <<<
   [junit4]    > Throwable #1: java.lang.AssertionError: Wrong doc count on shard1_0. See SOLR-5309 expected:<116> but was:<117>
   [junit4]    > 	at __randomizedtesting.SeedInfo.seed([259DE6439FF6E1A9:ADC9D999310A8C51]:0)
   [junit4]    > 	at org.apache.solr.cloud.ShardSplitTest.checkDocCountsAndShardStates(ShardSplitTest.java:516)
   [junit4]    > 	at org.apache.solr.cloud.ShardSplitTest.splitByUniqueKeyTest(ShardSplitTest.java:299)
   [junit4]    > 	at org.apache.solr.cloud.ShardSplitTest.test(ShardSplitTest.java:84)
   [junit4]    > 	at org.apache.solr.BaseDistributedSearchTestCase$ShardsRepeatRule$ShardsFixedStatement.callStatement(BaseDistributedSearchTestCase.java:985)
   [junit4]    > 	at org.apache.solr.BaseDistributedSearchTestCase$ShardsRepeatRule$ShardsStatement.evaluate(BaseDistributedSearchTestCase.java:960)
   [junit4]    > 	at java.lang.Thread.run(Thread.java:745)
   [junit4]   2> 1591820 INFO  (SUITE-ShardSplitTest-seed#[259DE6439FF6E1A9]-worker) [    ] o.a.s.SolrTestCaseJ4 ###deleteCore
   [junit4]   2> NOTE: leaving temporary files on disk at: /Users/jenkins/workspace/Lucene-Solr-master-MacOSX/solr/build/solr-core/test/J0/temp/solr.cloud.ShardSplitTest_259DE6439FF6E1A9-001
   [junit4]   2> NOTE: test params are: codec=Asserting(Lucene62), sim=RandomSimilarity(queryNorm=true): {}, locale=cs, timezone=Australia/Currie
   [junit4]   2> NOTE: Mac OS X 10.11.6 x86_64/Oracle Corporation 1.8.0_102 (64-bit)/cpus=3,threads=1,free=123689576,total=246243328
   [junit4]   2> NOTE: All tests run in this JVM: [TestImplicitCoreProperties, TestSurroundQueryParser, TestLeaderInitiatedRecoveryThread, ReturnFieldsTest, TestExpandComponent, FullHLLTest, TestJsonFacets, RuleEngineTest, TestRuleBasedAuthorizationPlugin, TestCursorMarkWithoutUniqueKey, TestElisionMultitermQuery, GraphQueryTest, AsyncMigrateRouteKeyTest, TestDistributedSearch, TestCollectionAPI, DistributedQueryComponentCustomSortTest, TestSchemaSimilarityResource, TestFileDictionaryLookup, TestAuthorizationFramework, TestDistribIDF, TestFieldCollectionResource, HLLUtilTest, OverseerTest, TestHdfsUpdateLog, JsonLoaderTest, TestCloudManagedSchema, MergeStrategyTest, TestJmxIntegration, TestCSVLoader, UnloadDistributedZkTest, HdfsTlogReplayBufferedWhileIndexingTest, SpatialFilterTest, TestLFUCache, CollectionReloadTest, DocValuesMultiTest, TestOrdValues, TestStressReorder, ScriptEngineTest, TestDownShardTolerantSearch, CdcrBootstrapTest, HighlighterTest, TestMaxScoreQueryParser, TestSolrConfigHandlerCloud, DocumentBuilderTest, TestPartialUpdateDeduplication, HdfsNNFailoverTest, AssignTest, CircularListTest, MigrateRouteKeyTest, TestMergePolicyConfig, RegexBoostProcessorTest, HttpPartitionTest, TestSolrQueryParserResource, SpatialRPTFieldTypeTest, TimeZoneUtilsTest, ActionThrottleTest, QueryEqualityTest, SystemInfoHandlerTest, CollectionTooManyReplicasTest, TestLMDirichletSimilarityFactory, TestConfigSets, SolrIndexConfigTest, DistributedVersionInfoTest, TestGroupingSearch, TestRestoreCore, DocValuesTest, PreAnalyzedFieldTest, HdfsSyncSliceTest, TestPhraseSuggestions, TestStressLucene, BlockJoinFacetRandomTest, DistributedFacetPivotLongTailTest, DocValuesMissingTest, TestSizeLimitedDistributedMap, CdcrVersionReplicationTest, TestInitParams, TestSchemaManager, TestLazyCores, TestReplicationHandlerBackup, SolrRequestParserTest, ClusterStateUpdateTest, DistribCursorPagingTest, TestConfigReload, TestSerializedLuceneMatchVersion, PrimUtilsTest, TestDocBasedVersionConstraints, TestSweetSpotSimilarityFactory, ResponseHeaderTest, TestScoreJoinQPScore, TestXmlQParser, TestComplexPhraseQParserPlugin, BJQParserTest, TestFieldCacheReopen, ShardSplitTest]
   [junit4] Completed [118/633 (1!)] on J0 in 149.88s, 3 tests, 1 failure <<< FAILURES!

[...truncated 61784 lines...]


[JENKINS] Lucene-Solr-master-MacOSX (64bit/jdk1.8.0) - Build # 3527 - Still Unstable!

Posted by Policeman Jenkins Server <je...@thetaphi.de>.
Build: http://jenkins.thetaphi.de/job/Lucene-Solr-master-MacOSX/3527/
Java: 64bit/jdk1.8.0 -XX:+UseCompressedOops -XX:+UseParallelGC

3 tests failed.
FAILED:  junit.framework.TestSuite.org.apache.solr.handler.TestSolrConfigHandlerCloud

Error Message:
ObjectTracker found 5 object(s) that were not released!!! [MockDirectoryWrapper, MockDirectoryWrapper, MockDirectoryWrapper, SolrCore, MDCAwareThreadPoolExecutor]

Stack Trace:
java.lang.AssertionError: ObjectTracker found 5 object(s) that were not released!!! [MockDirectoryWrapper, MockDirectoryWrapper, MockDirectoryWrapper, SolrCore, MDCAwareThreadPoolExecutor]
	at __randomizedtesting.SeedInfo.seed([5035DE0607C64413]:0)
	at org.junit.Assert.fail(Assert.java:93)
	at org.junit.Assert.assertTrue(Assert.java:43)
	at org.junit.Assert.assertNull(Assert.java:551)
	at org.apache.solr.SolrTestCaseJ4.teardownTestCases(SolrTestCaseJ4.java:257)
	at sun.reflect.GeneratedMethodAccessor19.invoke(Unknown Source)
	at sun.reflect.DelegatingMethodAccessorImpl.invoke(DelegatingMethodAccessorImpl.java:43)
	at java.lang.reflect.Method.invoke(Method.java:498)
	at com.carrotsearch.randomizedtesting.RandomizedRunner.invoke(RandomizedRunner.java:1764)
	at com.carrotsearch.randomizedtesting.RandomizedRunner$7.evaluate(RandomizedRunner.java:834)
	at com.carrotsearch.randomizedtesting.rules.StatementAdapter.evaluate(StatementAdapter.java:36)
	at com.carrotsearch.randomizedtesting.rules.SystemPropertiesRestoreRule$1.evaluate(SystemPropertiesRestoreRule.java:57)
	at org.apache.lucene.util.AbstractBeforeAfterRule$1.evaluate(AbstractBeforeAfterRule.java:45)
	at com.carrotsearch.randomizedtesting.rules.StatementAdapter.evaluate(StatementAdapter.java:36)
	at org.apache.lucene.util.TestRuleStoreClassName$1.evaluate(TestRuleStoreClassName.java:41)
	at com.carrotsearch.randomizedtesting.rules.NoShadowingOrOverridesOnMethodsRule$1.evaluate(NoShadowingOrOverridesOnMethodsRule.java:40)
	at com.carrotsearch.randomizedtesting.rules.NoShadowingOrOverridesOnMethodsRule$1.evaluate(NoShadowingOrOverridesOnMethodsRule.java:40)
	at com.carrotsearch.randomizedtesting.rules.StatementAdapter.evaluate(StatementAdapter.java:36)
	at com.carrotsearch.randomizedtesting.rules.StatementAdapter.evaluate(StatementAdapter.java:36)
	at com.carrotsearch.randomizedtesting.rules.StatementAdapter.evaluate(StatementAdapter.java:36)
	at org.apache.lucene.util.TestRuleAssertionsRequired$1.evaluate(TestRuleAssertionsRequired.java:53)
	at org.apache.lucene.util.TestRuleMarkFailure$1.evaluate(TestRuleMarkFailure.java:47)
	at org.apache.lucene.util.TestRuleIgnoreAfterMaxFailures$1.evaluate(TestRuleIgnoreAfterMaxFailures.java:64)
	at org.apache.lucene.util.TestRuleIgnoreTestSuites$1.evaluate(TestRuleIgnoreTestSuites.java:54)
	at com.carrotsearch.randomizedtesting.rules.StatementAdapter.evaluate(StatementAdapter.java:36)
	at com.carrotsearch.randomizedtesting.ThreadLeakControl$StatementRunner.run(ThreadLeakControl.java:367)
	at java.lang.Thread.run(Thread.java:745)


FAILED:  junit.framework.TestSuite.org.apache.solr.handler.TestSolrConfigHandlerCloud

Error Message:
1 thread leaked from SUITE scope at org.apache.solr.handler.TestSolrConfigHandlerCloud:     1) Thread[id=50734, name=searcherExecutor-12010-thread-1, state=WAITING, group=TGRP-TestSolrConfigHandlerCloud]         at sun.misc.Unsafe.park(Native Method)         at java.util.concurrent.locks.LockSupport.park(LockSupport.java:175)         at java.util.concurrent.locks.AbstractQueuedSynchronizer$ConditionObject.await(AbstractQueuedSynchronizer.java:2039)         at java.util.concurrent.LinkedBlockingQueue.take(LinkedBlockingQueue.java:442)         at java.util.concurrent.ThreadPoolExecutor.getTask(ThreadPoolExecutor.java:1067)         at java.util.concurrent.ThreadPoolExecutor.runWorker(ThreadPoolExecutor.java:1127)         at java.util.concurrent.ThreadPoolExecutor$Worker.run(ThreadPoolExecutor.java:617)         at java.lang.Thread.run(Thread.java:745)

Stack Trace:
com.carrotsearch.randomizedtesting.ThreadLeakError: 1 thread leaked from SUITE scope at org.apache.solr.handler.TestSolrConfigHandlerCloud: 
   1) Thread[id=50734, name=searcherExecutor-12010-thread-1, state=WAITING, group=TGRP-TestSolrConfigHandlerCloud]
        at sun.misc.Unsafe.park(Native Method)
        at java.util.concurrent.locks.LockSupport.park(LockSupport.java:175)
        at java.util.concurrent.locks.AbstractQueuedSynchronizer$ConditionObject.await(AbstractQueuedSynchronizer.java:2039)
        at java.util.concurrent.LinkedBlockingQueue.take(LinkedBlockingQueue.java:442)
        at java.util.concurrent.ThreadPoolExecutor.getTask(ThreadPoolExecutor.java:1067)
        at java.util.concurrent.ThreadPoolExecutor.runWorker(ThreadPoolExecutor.java:1127)
        at java.util.concurrent.ThreadPoolExecutor$Worker.run(ThreadPoolExecutor.java:617)
        at java.lang.Thread.run(Thread.java:745)
	at __randomizedtesting.SeedInfo.seed([5035DE0607C64413]:0)


FAILED:  junit.framework.TestSuite.org.apache.solr.handler.TestSolrConfigHandlerCloud

Error Message:
There are still zombie threads that couldn't be terminated:    1) Thread[id=50734, name=searcherExecutor-12010-thread-1, state=WAITING, group=TGRP-TestSolrConfigHandlerCloud]         at sun.misc.Unsafe.park(Native Method)         at java.util.concurrent.locks.LockSupport.park(LockSupport.java:175)         at java.util.concurrent.locks.AbstractQueuedSynchronizer$ConditionObject.await(AbstractQueuedSynchronizer.java:2039)         at java.util.concurrent.LinkedBlockingQueue.take(LinkedBlockingQueue.java:442)         at java.util.concurrent.ThreadPoolExecutor.getTask(ThreadPoolExecutor.java:1067)         at java.util.concurrent.ThreadPoolExecutor.runWorker(ThreadPoolExecutor.java:1127)         at java.util.concurrent.ThreadPoolExecutor$Worker.run(ThreadPoolExecutor.java:617)         at java.lang.Thread.run(Thread.java:745)

Stack Trace:
com.carrotsearch.randomizedtesting.ThreadLeakError: There are still zombie threads that couldn't be terminated:
   1) Thread[id=50734, name=searcherExecutor-12010-thread-1, state=WAITING, group=TGRP-TestSolrConfigHandlerCloud]
        at sun.misc.Unsafe.park(Native Method)
        at java.util.concurrent.locks.LockSupport.park(LockSupport.java:175)
        at java.util.concurrent.locks.AbstractQueuedSynchronizer$ConditionObject.await(AbstractQueuedSynchronizer.java:2039)
        at java.util.concurrent.LinkedBlockingQueue.take(LinkedBlockingQueue.java:442)
        at java.util.concurrent.ThreadPoolExecutor.getTask(ThreadPoolExecutor.java:1067)
        at java.util.concurrent.ThreadPoolExecutor.runWorker(ThreadPoolExecutor.java:1127)
        at java.util.concurrent.ThreadPoolExecutor$Worker.run(ThreadPoolExecutor.java:617)
        at java.lang.Thread.run(Thread.java:745)
	at __randomizedtesting.SeedInfo.seed([5035DE0607C64413]:0)




Build Log:
[...truncated 12280 lines...]
   [junit4] Suite: org.apache.solr.handler.TestSolrConfigHandlerCloud
   [junit4]   2> Creating dataDir: /Users/jenkins/workspace/Lucene-Solr-master-MacOSX/solr/build/solr-core/test/J0/temp/solr.handler.TestSolrConfigHandlerCloud_5035DE0607C64413-001/init-core-data-001
   [junit4]   2> 3489522 INFO  (SUITE-TestSolrConfigHandlerCloud-seed#[5035DE0607C64413]-worker) [    ] o.a.s.SolrTestCaseJ4 Randomized ssl (false) and clientAuth (false) via: @org.apache.solr.util.RandomizeSSL(reason=, value=NaN, ssl=NaN, clientAuth=NaN) w/ MAC_OS_X supressed clientAuth
   [junit4]   2> 3489522 INFO  (SUITE-TestSolrConfigHandlerCloud-seed#[5035DE0607C64413]-worker) [    ] o.a.s.BaseDistributedSearchTestCase Setting hostContext system property: /
   [junit4]   2> 3489524 INFO  (TEST-TestSolrConfigHandlerCloud.test-seed#[5035DE0607C64413]) [    ] o.a.s.c.ZkTestServer STARTING ZK TEST SERVER
   [junit4]   2> 3489525 INFO  (Thread-4997) [    ] o.a.s.c.ZkTestServer client port:0.0.0.0/0.0.0.0:0
   [junit4]   2> 3489525 INFO  (Thread-4997) [    ] o.a.s.c.ZkTestServer Starting server
   [junit4]   2> 3489634 INFO  (TEST-TestSolrConfigHandlerCloud.test-seed#[5035DE0607C64413]) [    ] o.a.s.c.ZkTestServer start zk server on port:55225
   [junit4]   2> 3489634 INFO  (TEST-TestSolrConfigHandlerCloud.test-seed#[5035DE0607C64413]) [    ] o.a.s.c.c.SolrZkClient Using default ZkCredentialsProvider
   [junit4]   2> 3489635 INFO  (TEST-TestSolrConfigHandlerCloud.test-seed#[5035DE0607C64413]) [    ] o.a.s.c.c.ConnectionManager Waiting for client to connect to ZooKeeper
   [junit4]   2> 3489657 INFO  (zkCallback-11030-thread-1) [    ] o.a.s.c.c.ConnectionManager Watcher org.apache.solr.common.cloud.ConnectionManager@39bb2a5 name:ZooKeeperConnection Watcher:127.0.0.1:55225 got event WatchedEvent state:SyncConnected type:None path:null path:null type:None
   [junit4]   2> 3489657 INFO  (TEST-TestSolrConfigHandlerCloud.test-seed#[5035DE0607C64413]) [    ] o.a.s.c.c.ConnectionManager Client is connected to ZooKeeper
   [junit4]   2> 3489657 INFO  (TEST-TestSolrConfigHandlerCloud.test-seed#[5035DE0607C64413]) [    ] o.a.s.c.c.SolrZkClient Using default ZkACLProvider
   [junit4]   2> 3489657 INFO  (TEST-TestSolrConfigHandlerCloud.test-seed#[5035DE0607C64413]) [    ] o.a.s.c.c.SolrZkClient makePath: /solr
   [junit4]   2> 3489661 INFO  (TEST-TestSolrConfigHandlerCloud.test-seed#[5035DE0607C64413]) [    ] o.a.s.c.c.SolrZkClient Using default ZkCredentialsProvider
   [junit4]   2> 3489661 INFO  (TEST-TestSolrConfigHandlerCloud.test-seed#[5035DE0607C64413]) [    ] o.a.s.c.c.ConnectionManager Waiting for client to connect to ZooKeeper
   [junit4]   2> 3489663 INFO  (zkCallback-11031-thread-1) [    ] o.a.s.c.c.ConnectionManager Watcher org.apache.solr.common.cloud.ConnectionManager@31655d87 name:ZooKeeperConnection Watcher:127.0.0.1:55225/solr got event WatchedEvent state:SyncConnected type:None path:null path:null type:None
   [junit4]   2> 3489663 INFO  (TEST-TestSolrConfigHandlerCloud.test-seed#[5035DE0607C64413]) [    ] o.a.s.c.c.ConnectionManager Client is connected to ZooKeeper
   [junit4]   2> 3489663 INFO  (TEST-TestSolrConfigHandlerCloud.test-seed#[5035DE0607C64413]) [    ] o.a.s.c.c.SolrZkClient Using default ZkACLProvider
   [junit4]   2> 3489663 INFO  (TEST-TestSolrConfigHandlerCloud.test-seed#[5035DE0607C64413]) [    ] o.a.s.c.c.SolrZkClient makePath: /collections/collection1
   [junit4]   2> 3489666 INFO  (TEST-TestSolrConfigHandlerCloud.test-seed#[5035DE0607C64413]) [    ] o.a.s.c.c.SolrZkClient makePath: /collections/collection1/shards
   [junit4]   2> 3489669 INFO  (TEST-TestSolrConfigHandlerCloud.test-seed#[5035DE0607C64413]) [    ] o.a.s.c.c.SolrZkClient makePath: /collections/control_collection
   [junit4]   2> 3489671 INFO  (TEST-TestSolrConfigHandlerCloud.test-seed#[5035DE0607C64413]) [    ] o.a.s.c.c.SolrZkClient makePath: /collections/control_collection/shards
   [junit4]   2> 3489673 INFO  (TEST-TestSolrConfigHandlerCloud.test-seed#[5035DE0607C64413]) [    ] o.a.s.c.AbstractZkTestCase put /Users/jenkins/workspace/Lucene-Solr-master-MacOSX/solr/core/src/test-files/solr/collection1/conf/solrconfig-tlog.xml to /configs/conf1/solrconfig.xml
   [junit4]   2> 3489674 INFO  (TEST-TestSolrConfigHandlerCloud.test-seed#[5035DE0607C64413]) [    ] o.a.s.c.c.SolrZkClient makePath: /configs/conf1/solrconfig.xml
   [junit4]   2> 3489677 INFO  (TEST-TestSolrConfigHandlerCloud.test-seed#[5035DE0607C64413]) [    ] o.a.s.c.AbstractZkTestCase put /Users/jenkins/workspace/Lucene-Solr-master-MacOSX/solr/core/src/test-files/solr/collection1/conf/schema.xml to /configs/conf1/schema.xml
   [junit4]   2> 3489678 INFO  (TEST-TestSolrConfigHandlerCloud.test-seed#[5035DE0607C64413]) [    ] o.a.s.c.c.SolrZkClient makePath: /configs/conf1/schema.xml
   [junit4]   2> 3489680 INFO  (TEST-TestSolrConfigHandlerCloud.test-seed#[5035DE0607C64413]) [    ] o.a.s.c.AbstractZkTestCase put /Users/jenkins/workspace/Lucene-Solr-master-MacOSX/solr/core/src/test-files/solr/collection1/conf/solrconfig.snippet.randomindexconfig.xml to /configs/conf1/solrconfig.snippet.randomindexconfig.xml
   [junit4]   2> 3489681 INFO  (TEST-TestSolrConfigHandlerCloud.test-seed#[5035DE0607C64413]) [    ] o.a.s.c.c.SolrZkClient makePath: /configs/conf1/solrconfig.snippet.randomindexconfig.xml
   [junit4]   2> 3489683 INFO  (TEST-TestSolrConfigHandlerCloud.test-seed#[5035DE0607C64413]) [    ] o.a.s.c.AbstractZkTestCase put /Users/jenkins/workspace/Lucene-Solr-master-MacOSX/solr/core/src/test-files/solr/collection1/conf/stopwords.txt to /configs/conf1/stopwords.txt
   [junit4]   2> 3489683 INFO  (TEST-TestSolrConfigHandlerCloud.test-seed#[5035DE0607C64413]) [    ] o.a.s.c.c.SolrZkClient makePath: /configs/conf1/stopwords.txt
   [junit4]   2> 3489687 INFO  (TEST-TestSolrConfigHandlerCloud.test-seed#[5035DE0607C64413]) [    ] o.a.s.c.AbstractZkTestCase put /Users/jenkins/workspace/Lucene-Solr-master-MacOSX/solr/core/src/test-files/solr/collection1/conf/protwords.txt to /configs/conf1/protwords.txt
   [junit4]   2> 3489687 INFO  (TEST-TestSolrConfigHandlerCloud.test-seed#[5035DE0607C64413]) [    ] o.a.s.c.c.SolrZkClient makePath: /configs/conf1/protwords.txt
   [junit4]   2> 3489690 INFO  (TEST-TestSolrConfigHandlerCloud.test-seed#[5035DE0607C64413]) [    ] o.a.s.c.AbstractZkTestCase put /Users/jenkins/workspace/Lucene-Solr-master-MacOSX/solr/core/src/test-files/solr/collection1/conf/currency.xml to /configs/conf1/currency.xml
   [junit4]   2> 3489690 INFO  (TEST-TestSolrConfigHandlerCloud.test-seed#[5035DE0607C64413]) [    ] o.a.s.c.c.SolrZkClient makePath: /configs/conf1/currency.xml
   [junit4]   2> 3489693 INFO  (TEST-TestSolrConfigHandlerCloud.test-seed#[5035DE0607C64413]) [    ] o.a.s.c.AbstractZkTestCase put /Users/jenkins/workspace/Lucene-Solr-master-MacOSX/solr/core/src/test-files/solr/collection1/conf/enumsConfig.xml to /configs/conf1/enumsConfig.xml
   [junit4]   2> 3489693 INFO  (TEST-TestSolrConfigHandlerCloud.test-seed#[5035DE0607C64413]) [    ] o.a.s.c.c.SolrZkClient makePath: /configs/conf1/enumsConfig.xml
   [junit4]   2> 3489698 INFO  (TEST-TestSolrConfigHandlerCloud.test-seed#[5035DE0607C64413]) [    ] o.a.s.c.AbstractZkTestCase put /Users/jenkins/workspace/Lucene-Solr-master-MacOSX/solr/core/src/test-files/solr/collection1/conf/open-exchange-rates.json to /configs/conf1/open-exchange-rates.json
   [junit4]   2> 3489698 INFO  (TEST-TestSolrConfigHandlerCloud.test-seed#[5035DE0607C64413]) [    ] o.a.s.c.c.SolrZkClient makePath: /configs/conf1/open-exchange-rates.json
   [junit4]   2> 3489703 INFO  (TEST-TestSolrConfigHandlerCloud.test-seed#[5035DE0607C64413]) [    ] o.a.s.c.AbstractZkTestCase put /Users/jenkins/workspace/Lucene-Solr-master-MacOSX/solr/core/src/test-files/solr/collection1/conf/mapping-ISOLatin1Accent.txt to /configs/conf1/mapping-ISOLatin1Accent.txt
   [junit4]   2> 3489704 INFO  (TEST-TestSolrConfigHandlerCloud.test-seed#[5035DE0607C64413]) [    ] o.a.s.c.c.SolrZkClient makePath: /configs/conf1/mapping-ISOLatin1Accent.txt
   [junit4]   2> 3489706 INFO  (TEST-TestSolrConfigHandlerCloud.test-seed#[5035DE0607C64413]) [    ] o.a.s.c.AbstractZkTestCase put /Users/jenkins/workspace/Lucene-Solr-master-MacOSX/solr/core/src/test-files/solr/collection1/conf/old_synonyms.txt to /configs/conf1/old_synonyms.txt
   [junit4]   2> 3489707 INFO  (TEST-TestSolrConfigHandlerCloud.test-seed#[5035DE0607C64413]) [    ] o.a.s.c.c.SolrZkClient makePath: /configs/conf1/old_synonyms.txt
   [junit4]   2> 3489709 INFO  (TEST-TestSolrConfigHandlerCloud.test-seed#[5035DE0607C64413]) [    ] o.a.s.c.AbstractZkTestCase put /Users/jenkins/workspace/Lucene-Solr-master-MacOSX/solr/core/src/test-files/solr/collection1/conf/synonyms.txt to /configs/conf1/synonyms.txt
   [junit4]   2> 3489710 INFO  (TEST-TestSolrConfigHandlerCloud.test-seed#[5035DE0607C64413]) [    ] o.a.s.c.c.SolrZkClient makePath: /configs/conf1/synonyms.txt
   [junit4]   2> 3490215 INFO  (TEST-TestSolrConfigHandlerCloud.test-seed#[5035DE0607C64413]) [    ] o.a.s.SolrTestCaseJ4 Writing core.properties file to /Users/jenkins/workspace/Lucene-Solr-master-MacOSX/solr/build/solr-core/test/J0/temp/solr.handler.TestSolrConfigHandlerCloud_5035DE0607C64413-001/control-001/cores/collection1
   [junit4]   2> 3490217 INFO  (TEST-TestSolrConfigHandlerCloud.test-seed#[5035DE0607C64413]) [    ] o.e.j.s.Server jetty-9.3.8.v20160314
   [junit4]   2> 3490220 INFO  (TEST-TestSolrConfigHandlerCloud.test-seed#[5035DE0607C64413]) [    ] o.e.j.s.h.ContextHandler Started o.e.j.s.ServletContextHandler@308b8f9a{/,null,AVAILABLE}
   [junit4]   2> 3490221 INFO  (TEST-TestSolrConfigHandlerCloud.test-seed#[5035DE0607C64413]) [    ] o.e.j.s.ServerConnector Started ServerConnector@6d5bd4e0{HTTP/1.1,[http/1.1]}{127.0.0.1:55228}
   [junit4]   2> 3490221 INFO  (TEST-TestSolrConfigHandlerCloud.test-seed#[5035DE0607C64413]) [    ] o.e.j.s.Server Started @3495462ms
   [junit4]   2> 3490221 INFO  (TEST-TestSolrConfigHandlerCloud.test-seed#[5035DE0607C64413]) [    ] o.a.s.c.s.e.JettySolrRunner Jetty properties: {solr.data.dir=/Users/jenkins/workspace/Lucene-Solr-master-MacOSX/solr/build/solr-core/test/J0/temp/solr.handler.TestSolrConfigHandlerCloud_5035DE0607C64413-001/tempDir-001/control/data, hostContext=/, hostPort=55228, coreRootDirectory=/Users/jenkins/workspace/Lucene-Solr-master-MacOSX/solr/build/solr-core/test/J0/../../../../../../../../../Users/jenkins/workspace/Lucene-Solr-master-MacOSX/solr/build/solr-core/test/J0/temp/solr.handler.TestSolrConfigHandlerCloud_5035DE0607C64413-001/control-001/cores}
   [junit4]   2> 3490222 INFO  (TEST-TestSolrConfigHandlerCloud.test-seed#[5035DE0607C64413]) [    ] o.a.s.s.SolrDispatchFilter SolrDispatchFilter.init(): sun.misc.Launcher$AppClassLoader@4554617c
   [junit4]   2> 3490222 INFO  (TEST-TestSolrConfigHandlerCloud.test-seed#[5035DE0607C64413]) [    ] o.a.s.c.SolrResourceLoader new SolrResourceLoader for directory: '/Users/jenkins/workspace/Lucene-Solr-master-MacOSX/solr/build/solr-core/test/J0/temp/solr.handler.TestSolrConfigHandlerCloud_5035DE0607C64413-001/control-001'
   [junit4]   2> 3490222 INFO  (TEST-TestSolrConfigHandlerCloud.test-seed#[5035DE0607C64413]) [    ] o.a.s.c.SolrResourceLoader JNDI not configured for solr (NoInitialContextEx)
   [junit4]   2> 3490222 INFO  (TEST-TestSolrConfigHandlerCloud.test-seed#[5035DE0607C64413]) [    ] o.a.s.c.SolrResourceLoader solr home defaulted to 'solr/' (could not find system property or JNDI)
   [junit4]   2> 3490223 INFO  (TEST-TestSolrConfigHandlerCloud.test-seed#[5035DE0607C64413]) [    ] o.a.s.c.c.SolrZkClient Using default ZkCredentialsProvider
   [junit4]   2> 3490223 INFO  (TEST-TestSolrConfigHandlerCloud.test-seed#[5035DE0607C64413]) [    ] o.a.s.c.c.ConnectionManager Waiting for client to connect to ZooKeeper
   [junit4]   2> 3490225 INFO  (zkCallback-11032-thread-1) [    ] o.a.s.c.c.ConnectionManager Watcher org.apache.solr.common.cloud.ConnectionManager@5ff7ae56 name:ZooKeeperConnection Watcher:127.0.0.1:55225/solr got event WatchedEvent state:SyncConnected type:None path:null path:null type:None
   [junit4]   2> 3490225 INFO  (TEST-TestSolrConfigHandlerCloud.test-seed#[5035DE0607C64413]) [    ] o.a.s.c.c.ConnectionManager Client is connected to ZooKeeper
   [junit4]   2> 3490225 INFO  (TEST-TestSolrConfigHandlerCloud.test-seed#[5035DE0607C64413]) [    ] o.a.s.c.c.SolrZkClient Using default ZkACLProvider
   [junit4]   2> 3490228 INFO  (TEST-TestSolrConfigHandlerCloud.test-seed#[5035DE0607C64413]) [    ] o.a.s.s.SolrDispatchFilter Loading solr.xml from SolrHome (not found in ZooKeeper)
   [junit4]   2> 3490228 INFO  (TEST-TestSolrConfigHandlerCloud.test-seed#[5035DE0607C64413]) [    ] o.a.s.c.SolrXmlConfig Loading container configuration from /Users/jenkins/workspace/Lucene-Solr-master-MacOSX/solr/build/solr-core/test/J0/temp/solr.handler.TestSolrConfigHandlerCloud_5035DE0607C64413-001/control-001/solr.xml
   [junit4]   2> 3490234 INFO  (TEST-TestSolrConfigHandlerCloud.test-seed#[5035DE0607C64413]) [    ] o.a.s.c.CorePropertiesLocator Config-defined core root directory: /Users/jenkins/workspace/Lucene-Solr-master-MacOSX/solr/build/solr-core/test/J0/../../../../../../../../../Users/jenkins/workspace/Lucene-Solr-master-MacOSX/solr/build/solr-core/test/J0/temp/solr.handler.TestSolrConfigHandlerCloud_5035DE0607C64413-001/control-001/cores
   [junit4]   2> 3490234 INFO  (TEST-TestSolrConfigHandlerCloud.test-seed#[5035DE0607C64413]) [    ] o.a.s.c.CoreContainer New CoreContainer 148929562
   [junit4]   2> 3490234 INFO  (TEST-TestSolrConfigHandlerCloud.test-seed#[5035DE0607C64413]) [    ] o.a.s.c.CoreContainer Loading cores into CoreContainer [instanceDir=/Users/jenkins/workspace/Lucene-Solr-master-MacOSX/solr/build/solr-core/test/J0/temp/solr.handler.TestSolrConfigHandlerCloud_5035DE0607C64413-001/control-001]
   [junit4]   2> 3490234 WARN  (TEST-TestSolrConfigHandlerCloud.test-seed#[5035DE0607C64413]) [    ] o.a.s.c.CoreContainer Couldn't add files from /Users/jenkins/workspace/Lucene-Solr-master-MacOSX/solr/build/solr-core/test/J0/temp/solr.handler.TestSolrConfigHandlerCloud_5035DE0607C64413-001/control-001/lib to classpath: /Users/jenkins/workspace/Lucene-Solr-master-MacOSX/solr/build/solr-core/test/J0/temp/solr.handler.TestSolrConfigHandlerCloud_5035DE0607C64413-001/control-001/lib
   [junit4]   2> 3490234 INFO  (TEST-TestSolrConfigHandlerCloud.test-seed#[5035DE0607C64413]) [    ] o.a.s.h.c.HttpShardHandlerFactory created with socketTimeout : 90000,urlScheme : ,connTimeout : 15000,maxConnectionsPerHost : 20,maxConnections : 10000,corePoolSize : 0,maximumPoolSize : 2147483647,maxThreadIdleTime : 5,sizeOfQueue : -1,fairnessPolicy : false,
   [junit4]   2> 3490241 INFO  (TEST-TestSolrConfigHandlerCloud.test-seed#[5035DE0607C64413]) [    ] o.a.s.u.UpdateShardHandler Created UpdateShardHandler HTTP client with params: socketTimeout=340000&connTimeout=45000&maxConnections=100000&maxConnectionsPerHost=100000
   [junit4]   2> 3490241 INFO  (TEST-TestSolrConfigHandlerCloud.test-seed#[5035DE0607C64413]) [    ] o.a.s.l.LogWatcher SLF4J impl is org.slf4j.impl.Log4jLoggerFactory
   [junit4]   2> 3490241 INFO  (TEST-TestSolrConfigHandlerCloud.test-seed#[5035DE0607C64413]) [    ] o.a.s.l.LogWatcher Registering Log Listener [Log4j (org.slf4j.impl.Log4jLoggerFactory)]
   [junit4]   2> 3490241 INFO  (TEST-TestSolrConfigHandlerCloud.test-seed#[5035DE0607C64413]) [    ] o.a.s.c.ZkContainer Zookeeper client=127.0.0.1:55225/solr
   [junit4]   2> 3490241 INFO  (TEST-TestSolrConfigHandlerCloud.test-seed#[5035DE0607C64413]) [    ] o.a.s.c.ZkController zkHost includes chroot
   [junit4]   2> 3490241 INFO  (TEST-TestSolrConfigHandlerCloud.test-seed#[5035DE0607C64413]) [    ] o.a.s.c.c.SolrZkClient Using default ZkCredentialsProvider
   [junit4]   2> 3490241 INFO  (TEST-TestSolrConfigHandlerCloud.test-seed#[5035DE0607C64413]) [    ] o.a.s.c.c.ConnectionManager Waiting for client to connect to ZooKeeper
   [junit4]   2> 3490243 INFO  (zkCallback-11035-thread-1) [    ] o.a.s.c.c.ConnectionManager Watcher org.apache.solr.common.cloud.ConnectionManager@359b3490 name:ZooKeeperConnection Watcher:127.0.0.1:55225 got event WatchedEvent state:SyncConnected type:None path:null path:null type:None
   [junit4]   2> 3490243 INFO  (TEST-TestSolrConfigHandlerCloud.test-seed#[5035DE0607C64413]) [    ] o.a.s.c.c.ConnectionManager Client is connected to ZooKeeper
   [junit4]   2> 3490244 INFO  (TEST-TestSolrConfigHandlerCloud.test-seed#[5035DE0607C64413]) [    ] o.a.s.c.c.SolrZkClient Using default ZkACLProvider
   [junit4]   2> 3490245 INFO  (TEST-TestSolrConfigHandlerCloud.test-seed#[5035DE0607C64413]) [n:127.0.0.1:55228_    ] o.a.s.c.ZkController Added new OnReconnect listener org.apache.solr.cloud.ZkController$$Lambda$69/1764319329@769683a6
   [junit4]   2> 3490245 INFO  (TEST-TestSolrConfigHandlerCloud.test-seed#[5035DE0607C64413]) [n:127.0.0.1:55228_    ] o.a.s.c.c.ConnectionManager Waiting for client to connect to ZooKeeper
   [junit4]   2> 3490246 INFO  (zkCallback-11036-thread-1-processing-n:127.0.0.1:55228_) [n:127.0.0.1:55228_    ] o.a.s.c.c.ConnectionManager Watcher org.apache.solr.common.cloud.ConnectionManager@3758e444 name:ZooKeeperConnection Watcher:127.0.0.1:55225/solr got event WatchedEvent state:SyncConnected type:None path:null path:null type:None
   [junit4]   2> 3490247 INFO  (TEST-TestSolrConfigHandlerCloud.test-seed#[5035DE0607C64413]) [n:127.0.0.1:55228_    ] o.a.s.c.c.ConnectionManager Client is connected to ZooKeeper
   [junit4]   2> 3490248 INFO  (TEST-TestSolrConfigHandlerCloud.test-seed#[5035DE0607C64413]) [n:127.0.0.1:55228_    ] o.a.s.c.c.SolrZkClient makePath: /overseer/queue
   [junit4]   2> 3490252 INFO  (TEST-TestSolrConfigHandlerCloud.test-seed#[5035DE0607C64413]) [n:127.0.0.1:55228_    ] o.a.s.c.c.SolrZkClient makePath: /overseer/collection-queue-work
   [junit4]   2> 3490257 INFO  (TEST-TestSolrConfigHandlerCloud.test-seed#[5035DE0607C64413]) [n:127.0.0.1:55228_    ] o.a.s.c.c.SolrZkClient makePath: /overseer/collection-map-running
   [junit4]   2> 3490260 INFO  (TEST-TestSolrConfigHandlerCloud.test-seed#[5035DE0607C64413]) [n:127.0.0.1:55228_    ] o.a.s.c.c.SolrZkClient makePath: /overseer/collection-map-completed
   [junit4]   2> 3490263 INFO  (TEST-TestSolrConfigHandlerCloud.test-seed#[5035DE0607C64413]) [n:127.0.0.1:55228_    ] o.a.s.c.c.SolrZkClient makePath: /overseer/collection-map-failure
   [junit4]   2> 3490265 INFO  (TEST-TestSolrConfigHandlerCloud.test-seed#[5035DE0607C64413]) [n:127.0.0.1:55228_    ] o.a.s.c.c.SolrZkClient makePath: /live_nodes
   [junit4]   2> 3490268 INFO  (TEST-TestSolrConfigHandlerCloud.test-seed#[5035DE0607C64413]) [n:127.0.0.1:55228_    ] o.a.s.c.c.SolrZkClient makePath: /aliases.json
   [junit4]   2> 3490270 INFO  (TEST-TestSolrConfigHandlerCloud.test-seed#[5035DE0607C64413]) [n:127.0.0.1:55228_    ] o.a.s.c.c.SolrZkClient makePath: /clusterstate.json
   [junit4]   2> 3490272 INFO  (TEST-TestSolrConfigHandlerCloud.test-seed#[5035DE0607C64413]) [n:127.0.0.1:55228_    ] o.a.s.c.c.SolrZkClient makePath: /security.json
   [junit4]   2> 3490273 INFO  (TEST-TestSolrConfigHandlerCloud.test-seed#[5035DE0607C64413]) [n:127.0.0.1:55228_    ] o.a.s.c.c.ZkStateReader Updating cluster state from ZooKeeper... 
   [junit4]   2> 3490274 INFO  (TEST-TestSolrConfigHandlerCloud.test-seed#[5035DE0607C64413]) [n:127.0.0.1:55228_    ] o.a.s.c.c.ZkStateReader Loaded empty cluster properties
   [junit4]   2> 3490276 INFO  (TEST-TestSolrConfigHandlerCloud.test-seed#[5035DE0607C64413]) [n:127.0.0.1:55228_    ] o.a.s.c.c.ZkStateReader Updated live nodes from ZooKeeper... (0) -> (0)
   [junit4]   2> 3490280 INFO  (TEST-TestSolrConfigHandlerCloud.test-seed#[5035DE0607C64413]) [n:127.0.0.1:55228_    ] o.a.s.c.c.SolrZkClient makePath: /overseer_elect
   [junit4]   2> 3490283 INFO  (TEST-TestSolrConfigHandlerCloud.test-seed#[5035DE0607C64413]) [n:127.0.0.1:55228_    ] o.a.s.c.c.SolrZkClient makePath: /overseer_elect/election
   [junit4]   2> 3490285 INFO  (TEST-TestSolrConfigHandlerCloud.test-seed#[5035DE0607C64413]) [n:127.0.0.1:55228_    ] o.a.s.c.Overseer Overseer (id=null) closing
   [junit4]   2> 3490285 INFO  (TEST-TestSolrConfigHandlerCloud.test-seed#[5035DE0607C64413]) [n:127.0.0.1:55228_    ] o.a.s.c.LeaderElector Joined leadership election with path: /overseer_elect/election/96541357836075012-127.0.0.1:55228_-n_0000000000
   [junit4]   2> 3490287 INFO  (TEST-TestSolrConfigHandlerCloud.test-seed#[5035DE0607C64413]) [n:127.0.0.1:55228_    ] o.a.s.c.OverseerElectionContext I am going to be the leader 127.0.0.1:55228_
   [junit4]   2> 3490287 INFO  (TEST-TestSolrConfigHandlerCloud.test-seed#[5035DE0607C64413]) [n:127.0.0.1:55228_    ] o.a.s.c.c.SolrZkClient makePath: /overseer_elect/leader
   [junit4]   2> 3490289 INFO  (TEST-TestSolrConfigHandlerCloud.test-seed#[5035DE0607C64413]) [n:127.0.0.1:55228_    ] o.a.s.c.Overseer Overseer (id=96541357836075012-127.0.0.1:55228_-n_0000000000) starting
   [junit4]   2> 3490291 INFO  (TEST-TestSolrConfigHandlerCloud.test-seed#[5035DE0607C64413]) [n:127.0.0.1:55228_    ] o.a.s.c.c.SolrZkClient makePath: /overseer/queue-work
   [junit4]   2> 3490301 INFO  (TEST-TestSolrConfigHandlerCloud.test-seed#[5035DE0607C64413]) [n:127.0.0.1:55228_    ] o.a.s.c.OverseerAutoReplicaFailoverThread Starting OverseerAutoReplicaFailoverThread autoReplicaFailoverWorkLoopDelay=10000 autoReplicaFailoverWaitAfterExpiration=10000 autoReplicaFailoverBadNodeExpiration=60000
   [junit4]   2> 3490302 INFO  (OverseerCollectionConfigSetProcessor-96541357836075012-127.0.0.1:55228_-n_0000000000) [n:127.0.0.1:55228_    ] o.a.s.c.OverseerTaskProcessor Process current queue of overseer operations
   [junit4]   2> 3490302 INFO  (OverseerStateUpdate-96541357836075012-127.0.0.1:55228_-n_0000000000) [n:127.0.0.1:55228_    ] o.a.s.c.Overseer Starting to work on the main queue
   [junit4]   2> 3490302 INFO  (TEST-TestSolrConfigHandlerCloud.test-seed#[5035DE0607C64413]) [n:127.0.0.1:55228_    ] o.a.s.c.ZkController Register node as live in ZooKeeper:/live_nodes/127.0.0.1:55228_
   [junit4]   2> 3490302 INFO  (TEST-TestSolrConfigHandlerCloud.test-seed#[5035DE0607C64413]) [n:127.0.0.1:55228_    ] o.a.s.c.c.SolrZkClient makePath: /live_nodes/127.0.0.1:55228_
   [junit4]   2> 3490305 INFO  (OverseerStateUpdate-96541357836075012-127.0.0.1:55228_-n_0000000000) [n:127.0.0.1:55228_    ] o.a.s.c.c.ZkStateReader Updated live nodes from ZooKeeper... (0) -> (0)
   [junit4]   2> 3490305 INFO  (zkCallback-11036-thread-1-processing-n:127.0.0.1:55228_) [n:127.0.0.1:55228_    ] o.a.s.c.c.ZkStateReader A live node change: [WatchedEvent state:SyncConnected type:NodeChildrenChanged path:/live_nodes], has occurred - updating... (live nodes size: [0])
   [junit4]   2> 3490306 INFO  (zkCallback-11036-thread-1-processing-n:127.0.0.1:55228_) [n:127.0.0.1:55228_    ] o.a.s.c.c.ZkStateReader Updated live nodes from ZooKeeper... (0) -> (1)
   [junit4]   2> 3490315 INFO  (TEST-TestSolrConfigHandlerCloud.test-seed#[5035DE0607C64413]) [n:127.0.0.1:55228_    ] o.a.s.c.CoreContainer Security conf doesn't exist. Skipping setup for authorization module.
   [junit4]   2> 3490315 INFO  (TEST-TestSolrConfigHandlerCloud.test-seed#[5035DE0607C64413]) [n:127.0.0.1:55228_    ] o.a.s.c.CoreContainer No authentication plugin used.
   [junit4]   2> 3490318 INFO  (TEST-TestSolrConfigHandlerCloud.test-seed#[5035DE0607C64413]) [n:127.0.0.1:55228_    ] o.a.s.c.CorePropertiesLocator Looking for core definitions underneath /Users/jenkins/workspace/Lucene-Solr-master-MacOSX/solr/build/solr-core/test/J0/../../../../../../../../../Users/jenkins/workspace/Lucene-Solr-master-MacOSX/solr/build/solr-core/test/J0/temp/solr.handler.TestSolrConfigHandlerCloud_5035DE0607C64413-001/control-001/cores
   [junit4]   2> 3490319 INFO  (TEST-TestSolrConfigHandlerCloud.test-seed#[5035DE0607C64413]) [n:127.0.0.1:55228_    ] o.a.s.c.CoreDescriptor Created CoreDescriptor: {name=collection1, config=solrconfig.xml, transient=false, schema=schema.xml, loadOnStartup=true, configSetProperties=configsetprops.json, collection=control_collection, coreNodeName=, dataDir=data/, shard=}
   [junit4]   2> 3490319 INFO  (TEST-TestSolrConfigHandlerCloud.test-seed#[5035DE0607C64413]) [n:127.0.0.1:55228_    ] o.a.s.c.CorePropertiesLocator Found core collection1 in /Users/jenkins/workspace/Lucene-Solr-master-MacOSX/solr/build/solr-core/test/J0/../../../../../../../../../Users/jenkins/workspace/Lucene-Solr-master-MacOSX/solr/build/solr-core/test/J0/temp/solr.handler.TestSolrConfigHandlerCloud_5035DE0607C64413-001/control-001/cores/collection1
   [junit4]   2> 3490320 INFO  (TEST-TestSolrConfigHandlerCloud.test-seed#[5035DE0607C64413]) [n:127.0.0.1:55228_    ] o.a.s.c.CorePropertiesLocator Found 1 core definitions
   [junit4]   2> 3490321 INFO  (coreLoadExecutor-11312-thread-1-processing-n:127.0.0.1:55228_) [n:127.0.0.1:55228_ c:control_collection   x:collection1] o.a.s.c.ZkController publishing state=down
   [junit4]   2> 3490321 INFO  (TEST-TestSolrConfigHandlerCloud.test-seed#[5035DE0607C64413]) [n:127.0.0.1:55228_    ] o.a.s.s.SolrDispatchFilter user.dir=/Users/jenkins/workspace/Lucene-Solr-master-MacOSX/solr/build/solr-core/test/J0
   [junit4]   2> 3490321 INFO  (coreLoadExecutor-11312-thread-1-processing-n:127.0.0.1:55228_) [n:127.0.0.1:55228_ c:control_collection   x:collection1] o.a.s.c.ZkController numShards not found on descriptor - reading it from system property
   [junit4]   2> 3490321 INFO  (TEST-TestSolrConfigHandlerCloud.test-seed#[5035DE0607C64413]) [n:127.0.0.1:55228_    ] o.a.s.s.SolrDispatchFilter SolrDispatchFilter.init() done
   [junit4]   2> 3490323 INFO  (coreLoadExecutor-11312-thread-1-processing-n:127.0.0.1:55228_) [n:127.0.0.1:55228_ c:control_collection   x:collection1] o.a.s.c.ZkController Collection control_collection not visible yet, but flagging it so a watch is registered when it becomes visible
   [junit4]   2> 3490323 INFO  (OverseerStateUpdate-96541357836075012-127.0.0.1:55228_-n_0000000000) [n:127.0.0.1:55228_    ] o.a.s.c.Overseer processMessage: queueSize: 1, message = {
   [junit4]   2>   "core":"collection1",
   [junit4]   2>   "roles":null,
   [junit4]   2>   "base_url":"http://127.0.0.1:55228",
   [junit4]   2>   "node_name":"127.0.0.1:55228_",
   [junit4]   2>   "numShards":"1",
   [junit4]   2>   "state":"down",
   [junit4]   2>   "shard":null,
   [junit4]   2>   "collection":"control_collection",
   [junit4]   2>   "operation":"state"} current state version: 0
   [junit4]   2> 3490324 INFO  (OverseerStateUpdate-96541357836075012-127.0.0.1:55228_-n_0000000000) [n:127.0.0.1:55228_    ] o.a.s.c.o.ReplicaMutator Update state numShards=1 message={
   [junit4]   2>   "core":"collection1",
   [junit4]   2>   "roles":null,
   [junit4]   2>   "base_url":"http://127.0.0.1:55228",
   [junit4]   2>   "node_name":"127.0.0.1:55228_",
   [junit4]   2>   "numShards":"1",
   [junit4]   2>   "state":"down",
   [junit4]   2>   "shard":null,
   [junit4]   2>   "collection":"control_collection",
   [junit4]   2>   "operation":"state"}
   [junit4]   2> 3490324 INFO  (coreLoadExecutor-11312-thread-1-processing-n:127.0.0.1:55228_) [n:127.0.0.1:55228_ c:control_collection   x:collection1] o.a.s.c.c.ZkStateReader Deleting data for [control_collection]
   [junit4]   2> 3490324 INFO  (OverseerStateUpdate-96541357836075012-127.0.0.1:55228_-n_0000000000) [n:127.0.0.1:55228_    ] o.a.s.c.o.ClusterStateMutator building a new cName: control_collection
   [junit4]   2> 3490325 INFO  (OverseerStateUpdate-96541357836075012-127.0.0.1:55228_-n_0000000000) [n:127.0.0.1:55228_    ] o.a.s.c.o.ReplicaMutator Assigning new node to shard shard=shard1
   [junit4]   2> 3490326 INFO  (coreLoadExecutor-11312-thread-1-processing-n:127.0.0.1:55228_) [n:127.0.0.1:55228_ c:control_collection   x:collection1] o.a.s.c.ZkController look for our core node name
   [junit4]   2> 3490327 INFO  (zkCallback-11036-thread-1-processing-n:127.0.0.1:55228_) [n:127.0.0.1:55228_    ] o.a.s.c.c.ZkStateReader A cluster state change: [WatchedEvent state:SyncConnected type:NodeDataChanged path:/clusterstate.json], has occurred - updating... (live nodes size: [1])
   [junit4]   2> 3491333 INFO  (coreLoadExecutor-11312-thread-1-processing-n:127.0.0.1:55228_) [n:127.0.0.1:55228_ c:control_collection   x:collection1] o.a.s.c.ZkController waiting to find shard id in clusterstate for collection1
   [junit4]   2> 3491333 INFO  (coreLoadExecutor-11312-thread-1-processing-n:127.0.0.1:55228_) [n:127.0.0.1:55228_ c:control_collection   x:collection1] o.a.s.c.ZkController Check for collection zkNode:control_collection
   [junit4]   2> 3491334 INFO  (coreLoadExecutor-11312-thread-1-processing-n:127.0.0.1:55228_) [n:127.0.0.1:55228_ c:control_collection   x:collection1] o.a.s.c.ZkController Collection zkNode exists
   [junit4]   2> 3491334 INFO  (coreLoadExecutor-11312-thread-1-processing-n:127.0.0.1:55228_) [n:127.0.0.1:55228_ c:control_collection   x:collection1] o.a.s.c.c.ZkStateReader Load collection config from: [/collections/control_collection]
   [junit4]   2> 3491335 INFO  (coreLoadExecutor-11312-thread-1-processing-n:127.0.0.1:55228_) [n:127.0.0.1:55228_ c:control_collection   x:collection1] o.a.s.c.c.ZkStateReader path=[/collections/control_collection] [configName]=[conf1] specified config exists in ZooKeeper
   [junit4]   2> 3491335 INFO  (coreLoadExecutor-11312-thread-1-processing-n:127.0.0.1:55228_) [n:127.0.0.1:55228_ c:control_collection   x:collection1] o.a.s.c.SolrResourceLoader new SolrResourceLoader for directory: '/Users/jenkins/workspace/Lucene-Solr-master-MacOSX/solr/build/solr-core/test/J0/temp/solr.handler.TestSolrConfigHandlerCloud_5035DE0607C64413-001/control-001/cores/collection1'
   [junit4]   2> 3491335 INFO  (coreLoadExecutor-11312-thread-1-processing-n:127.0.0.1:55228_) [n:127.0.0.1:55228_ c:control_collection   x:collection1] o.a.s.c.SolrResourceLoader JNDI not configured for solr (NoInitialContextEx)
   [junit4]   2> 3491335 INFO  (coreLoadExecutor-11312-thread-1-processing-n:127.0.0.1:55228_) [n:127.0.0.1:55228_ c:control_collection   x:collection1] o.a.s.c.SolrResourceLoader solr home defaulted to 'solr/' (could not find system property or JNDI)
   [junit4]   2> 3491337 INFO  (coreLoadExecutor-11312-thread-1-processing-n:127.0.0.1:55228_) [n:127.0.0.1:55228_ c:control_collection   x:collection1] o.a.s.c.Config loaded config solrconfig.xml with version 0 
   [junit4]   2> 3491344 INFO  (coreLoadExecutor-11312-thread-1-processing-n:127.0.0.1:55228_) [n:127.0.0.1:55228_ c:control_collection   x:collection1] o.a.s.c.SolrConfig current version of requestparams : -1
   [junit4]   2> 3491346 WARN  (coreLoadExecutor-11312-thread-1-processing-n:127.0.0.1:55228_) [n:127.0.0.1:55228_ c:control_collection   x:collection1] o.a.s.c.Config Beginning with Solr 5.5, <mergePolicy> is deprecated, use <mergePolicyFactory> instead.
   [junit4]   2> 3491346 INFO  (coreLoadExecutor-11312-thread-1-processing-n:127.0.0.1:55228_) [n:127.0.0.1:55228_ c:control_collection   x:collection1] o.a.s.c.SolrConfig Using Lucene MatchVersion: 7.0.0
   [junit4]   2> 3491366 INFO  (coreLoadExecutor-11312-thread-1-processing-n:127.0.0.1:55228_) [n:127.0.0.1:55228_ c:control_collection   x:collection1] o.a.s.c.SolrConfig Loaded SolrConfig: solrconfig.xml
   [junit4]   2> 3491372 INFO  (coreLoadExecutor-11312-thread-1-processing-n:127.0.0.1:55228_) [n:127.0.0.1:55228_ c:control_collection   x:collection1] o.a.s.s.IndexSchema [collection1] Schema name=test
   [junit4]   2> 3491436 INFO  (coreLoadExecutor-11312-thread-1-processing-n:127.0.0.1:55228_) [n:127.0.0.1:55228_ c:control_collection   x:collection1] o.a.s.s.OpenExchangeRatesOrgProvider Initialized with rates=open-exchange-rates.json, refreshInterval=1440.
   [junit4]   2> 3491443 INFO  (coreLoadExecutor-11312-thread-1-processing-n:127.0.0.1:55228_) [n:127.0.0.1:55228_ c:control_collection   x:collection1] o.a.s.s.IndexSchema default search field in schema is text
   [junit4]   2> 3491443 INFO  (coreLoadExecutor-11312-thread-1-processing-n:127.0.0.1:55228_) [n:127.0.0.1:55228_ c:control_collection   x:collection1] o.a.s.s.IndexSchema unique key field: id
   [junit4]   2> 3491457 INFO  (coreLoadExecutor-11312-thread-1-processing-n:127.0.0.1:55228_) [n:127.0.0.1:55228_ c:control_collection   x:collection1] o.a.s.s.FileExchangeRateProvider Reloading exchange rates from file currency.xml
   [junit4]   2> 3491460 INFO  (coreLoadExecutor-11312-thread-1-processing-n:127.0.0.1:55228_) [n:127.0.0.1:55228_ c:control_collection   x:collection1] o.a.s.s.FileExchangeRateProvider Reloading exchange rates from file currency.xml
   [junit4]   2> 3491462 INFO  (coreLoadExecutor-11312-thread-1-processing-n:127.0.0.1:55228_) [n:127.0.0.1:55228_ c:control_collection   x:collection1] o.a.s.s.OpenExchangeRatesOrgProvider Reloading exchange rates from open-exchange-rates.json
   [junit4]   2> 3491463 INFO  (coreLoadExecutor-11312-thread-1-processing-n:127.0.0.1:55228_) [n:127.0.0.1:55228_ c:control_collection   x:collection1] o.a.s.s.OpenExchangeRatesOrgProvider Reloading exchange rates from open-exchange-rates.json
   [junit4]   2> 3491466 INFO  (coreLoadExecutor-11312-thread-1-processing-n:127.0.0.1:55228_) [n:127.0.0.1:55228_ c:control_collection   x:collection1] o.a.s.c.ConfigSetProperties Did not find ConfigSet properties, assuming default properties: Can't find resource 'configsetprops.json' in classpath or '/configs/conf1', cwd=/Users/jenkins/workspace/Lucene-Solr-master-MacOSX/solr/build/solr-core/test/J0
   [junit4]   2> 3491467 INFO  (coreLoadExecutor-11312-thread-1-processing-n:127.0.0.1:55228_) [n:127.0.0.1:55228_ c:control_collection   x:collection1] o.a.s.c.CoreContainer Creating SolrCore 'collection1' using configuration from collection control_collection
   [junit4]   2> 3491467 INFO  (coreLoadExecutor-11312-thread-1-processing-n:127.0.0.1:55228_) [n:127.0.0.1:55228_ c:control_collection s:shard1 r:core_node1 x:collection1] o.a.s.c.SolrCore org.apache.solr.core.MockDirectoryFactory
   [junit4]   2> 3491467 INFO  (coreLoadExecutor-11312-thread-1-processing-n:127.0.0.1:55228_) [n:127.0.0.1:55228_ c:control_collection s:shard1 r:core_node1 x:collection1] o.a.s.c.SolrCore [[collection1] ] Opening new SolrCore at [/Users/jenkins/workspace/Lucene-Solr-master-MacOSX/solr/build/solr-core/test/J0/temp/solr.handler.TestSolrConfigHandlerCloud_5035DE0607C64413-001/control-001/cores/collection1], dataDir=[/Users/jenkins/workspace/Lucene-Solr-master-MacOSX/solr/build/solr-core/test/J0/../../../../../../../../../Users/jenkins/workspace/Lucene-Solr-master-MacOSX/solr/build/solr-core/test/J0/temp/solr.handler.TestSolrConfigHandlerCloud_5035DE0607C64413-001/control-001/cores/collection1/data/]
   [junit4]   2> 3491467 INFO  (coreLoadExecutor-11312-thread-1-processing-n:127.0.0.1:55228_) [n:127.0.0.1:55228_ c:control_collection s:shard1 r:core_node1 x:collection1] o.a.s.c.JmxMonitoredMap JMX monitoring is enabled. Adding Solr mbeans to JMX Server: com.sun.jmx.mbeanserver.JmxMBeanServer@7fa56e13
   [junit4]   2> 3491467 INFO  (coreLoadExecutor-11312-thread-1-processing-n:127.0.0.1:55228_) [n:127.0.0.1:55228_ c:control_collection s:shard1 r:core_node1 x:collection1] o.a.s.c.CachingDirectoryFactory return new directory for /Users/jenkins/workspace/Lucene-Solr-master-MacOSX/solr/build/solr-core/test/J0/../../../../../../../../../Users/jenkins/workspace/Lucene-Solr-master-MacOSX/solr/build/solr-core/test/J0/temp/solr.handler.TestSolrConfigHandlerCloud_5035DE0607C64413-001/control-001/cores/collection1/data/snapshot_metadata
   [junit4]   2> 3491467 INFO  (coreLoadExecutor-11312-thread-1-processing-n:127.0.0.1:55228_) [n:127.0.0.1:55228_ c:control_collection s:shard1 r:core_node1 x:collection1] o.a.s.c.s.SolrSnapshotMetaDataManager Loading from snapshot metadata file...
   [junit4]   2> 3491468 INFO  (coreLoadExecutor-11312-thread-1-processing-n:127.0.0.1:55228_) [n:127.0.0.1:55228_ c:control_collection s:shard1 r:core_node1 x:collection1] o.a.s.c.CachingDirectoryFactory return new directory for /Users/jenkins/workspace/Lucene-Solr-master-MacOSX/solr/build/solr-core/test/J0/../../../../../../../../../Users/jenkins/workspace/Lucene-Solr-master-MacOSX/solr/build/solr-core/test/J0/temp/solr.handler.TestSolrConfigHandlerCloud_5035DE0607C64413-001/control-001/cores/collection1/data
   [junit4]   2> 3491468 INFO  (coreLoadExecutor-11312-thread-1-processing-n:127.0.0.1:55228_) [n:127.0.0.1:55228_ c:control_collection s:shard1 r:core_node1 x:collection1] o.a.s.c.SolrCore New index directory detected: old=null new=/Users/jenkins/workspace/Lucene-Solr-master-MacOSX/solr/build/solr-core/test/J0/../../../../../../../../../Users/jenkins/workspace/Lucene-Solr-master-MacOSX/solr/build/solr-core/test/J0/temp/solr.handler.TestSolrConfigHandlerCloud_5035DE0607C64413-001/control-001/cores/collection1/data/index/
   [junit4]   2> 3491468 WARN  (coreLoadExecutor-11312-thread-1-processing-n:127.0.0.1:55228_) [n:127.0.0.1:55228_ c:control_collection s:shard1 r:core_node1 x:collection1] o.a.s.c.SolrCore [collection1] Solr index directory '/Users/jenkins/workspace/Lucene-Solr-master-MacOSX/solr/build/solr-core/test/J0/../../../../../../../../../Users/jenkins/workspace/Lucene-Solr-master-MacOSX/solr/build/solr-core/test/J0/temp/solr.handler.TestSolrConfigHandlerCloud_5035DE0607C64413-001/control-001/cores/collection1/data/index' doesn't exist. Creating new index...
   [junit4]   2> 3491468 INFO  (coreLoadExecutor-11312-thread-1-processing-n:127.0.0.1:55228_) [n:127.0.0.1:55228_ c:control_collection s:shard1 r:core_node1 x:collection1] o.a.s.c.CachingDirectoryFactory return new directory for /Users/jenkins/workspace/Lucene-Solr-master-MacOSX/solr/build/solr-core/test/J0/../../../../../../../../../Users/jenkins/workspace/Lucene-Solr-master-MacOSX/solr/build/solr-core/test/J0/temp/solr.handler.TestSolrConfigHandlerCloud_5035DE0607C64413-001/control-001/cores/collection1/data/index
   [junit4]   2> 3491469 INFO  (coreLoadExecutor-11312-thread-1-processing-n:127.0.0.1:55228_) [n:127.0.0.1:55228_ c:control_collection s:shard1 r:core_node1 x:collection1] o.a.s.u.RandomMergePolicy RandomMergePolicy wrapping class org.apache.lucene.index.AlcoholicMergePolicy: [AlcoholicMergePolicy: minMergeSize=0, mergeFactor=10, maxMergeSize=460820933, maxMergeSizeForForcedMerge=9223372036854775807, calibrateSizeByDeletes=true, maxMergeDocs=2147483647, maxCFSSegmentSizeMB=8.796093022207999E12, noCFSRatio=0.1]
   [junit4]   2> 3491470 INFO  (coreLoadExecutor-11312-thread-1-processing-n:127.0.0.1:55228_) [n:127.0.0.1:55228_ c:control_collection s:shard1 r:core_node1 x:collection1] o.a.s.c.SolrDeletionPolicy SolrDeletionPolicy.onCommit: commits: num=1
   [junit4]   2> 	commit{dir=MockDirectoryWrapper(RAMDirectory@43299e44 lockFactory=org.apache.lucene.store.SingleInstanceLockFactory@5df058a7),segFN=segments_1,generation=1}
   [junit4]   2> 3491470 INFO  (coreLoadExecutor-11312-thread-1-processing-n:127.0.0.1:55228_) [n:127.0.0.1:55228_ c:control_collection s:shard1 r:core_node1 x:collection1] o.a.s.c.SolrDeletionPolicy newest commit generation = 1
   [junit4]   2> 3491470 INFO  (OldIndexDirectoryCleanupThreadForCore-collection1) [n:127.0.0.1:55228_ c:control_collection s:shard1 r:core_node1 x:collection1] o.a.s.c.SolrCore Looking for old index directories to cleanup for core collection1 in /Users/jenkins/workspace/Lucene-Solr-master-MacOSX/solr/build/solr-core/test/J0/../../../../../../../../../Users/jenkins/workspace/Lucene-Solr-master-MacOSX/solr/build/solr-core/test/J0/temp/solr.handler.TestSolrConfigHandlerCloud_5035DE0607C64413-001/control-001/cores/collection1/data/
   [junit4]   2> 3491471 WARN  (OldIndexDirectoryCleanupThreadForCore-collection1) [n:127.0.0.1:55228_ c:control_collection s:shard1 r:core_node1 x:collection1] o.a.s.c.DirectoryFactory /Users/jenkins/workspace/Lucene-Solr-master-MacOSX/solr/build/solr-core/test/J0/../../../../../../../../../Users/jenkins/workspace/Lucene-Solr-master-MacOSX/solr/build/solr-core/test/J0/temp/solr.handler.TestSolrConfigHandlerCloud_5035DE0607C64413-001/control-001/cores/collection1/data/ does not point to a valid data directory; skipping clean-up of old index directories.
   [junit4]   2> 3491472 INFO  (coreLoadExecutor-11312-thread-1-processing-n:127.0.0.1:55228_) [n:127.0.0.1:55228_ c:control_collection s:shard1 r:core_node1 x:collection1] o.a.s.u.p.UpdateRequestProcessorChain creating updateRequestProcessorChain "nodistrib"
   [junit4]   2> 3491473 INFO  (coreLoadExecutor-11312-thread-1-processing-n:127.0.0.1:55228_) [n:127.0.0.1:55228_ c:control_collection s:shard1 r:core_node1 x:collection1] o.a.s.u.p.UpdateRequestProcessorChain creating updateRequestProcessorChain "dedupe"
   [junit4]   2> 3491473 INFO  (coreLoadExecutor-11312-thread-1-processing-n:127.0.0.1:55228_) [n:127.0.0.1:55228_ c:control_collection s:shard1 r:core_node1 x:collection1] o.a.s.u.p.UpdateRequestProcessorChain inserting DistributedUpdateProcessorFactory into updateRequestProcessorChain "dedupe"
   [junit4]   2> 3491473 INFO  (coreLoadExecutor-11312-thread-1-processing-n:127.0.0.1:55228_) [n:127.0.0.1:55228_ c:control_collection s:shard1 r:core_node1 x:collection1] o.a.s.u.p.UpdateRequestProcessorChain creating updateRequestProcessorChain "stored_sig"
   [junit4]   2> 3491473 INFO  (coreLoadExecutor-11312-thread-1-processing-n:127.0.0.1:55228_) [n:127.0.0.1:55228_ c:control_collection s:shard1 r:core_node1 x:collection1] o.a.s.u.p.UpdateRequestProcessorChain inserting DistributedUpdateProcessorFactory into updateRequestProcessorChain "stored_sig"
   [junit4]   2> 3491473 INFO  (coreLoadExecutor-11312-thread-1-processing-n:127.0.0.1:55228_) [n:127.0.0.1:55228_ c:control_collection s:shard1 r:core_node1 x:collection1] o.a.s.u.p.UpdateRequestProcessorChain creating updateRequestProcessorChain "distrib-dup-test-chain-explicit"
   [junit4]   2> 3491473 INFO  (coreLoadExecutor-11312-thread-1-processing-n:127.0.0.1:55228_) [n:127.0.0.1:55228_ c:control_collection s:shard1 r:core_node1 x:collection1] o.a.s.u.p.UpdateRequestProcessorChain creating updateRequestProcessorChain "distrib-dup-test-chain-implicit"
   [junit4]   2> 3491473 INFO  (coreLoadExecutor-11312-thread-1-processing-n:127.0.0.1:55228_) [n:127.0.0.1:55228_ c:control_collection s:shard1 r:core_node1 x:collection1] o.a.s.u.p.UpdateRequestProcessorChain inserting DistributedUpdateProcessorFactory into updateRequestProcessorChain "distrib-dup-test-chain-implicit"
   [junit4]   2> 3491473 INFO  (coreLoadExecutor-11312-thread-1-processing-n:127.0.0.1:55228_) [n:127.0.0.1:55228_ c:control_collection s:shard1 r:core_node1 x:collection1] o.a.s.c.SolrCore no updateRequestProcessorChain defined as default, creating implicit default
   [junit4]   2> 3491473 WARN  (coreLoadExecutor-11312-thread-1-processing-n:127.0.0.1:55228_) [n:127.0.0.1:55228_ c:control_collection s:shard1 r:core_node1 x:collection1] o.a.s.c.RequestHandlers INVALID paramSet a in requestHandler {type = requestHandler,name = /dump,class = DumpRequestHandler,args = {defaults={a=A,b=B}}}
   [junit4]   2> 3491477 INFO  (coreLoadExecutor-11312-thread-1-processing-n:127.0.0.1:55228_) [n:127.0.0.1:55228_ c:control_collection s:shard1 r:core_node1 x:collection1] o.a.s.h.l.XMLLoader xsltCacheLifetimeSeconds=60
   [junit4]   2> 3491478 INFO  (coreLoadExecutor-11312-thread-1-processing-n:127.0.0.1:55228_) [n:127.0.0.1:55228_ c:control_collection s:shard1 r:core_node1 x:collection1] o.a.s.h.l.XMLLoader xsltCacheLifetimeSeconds=60
   [junit4]   2> 3491479 INFO  (coreLoadExecutor-11312-thread-1-processing-n:127.0.0.1:55228_) [n:127.0.0.1:55228_ c:control_collection s:shard1 r:core_node1 x:collection1] o.a.s.h.l.XMLLoader xsltCacheLifetimeSeconds=60
   [junit4]   2> 3491479 INFO  (coreLoadExecutor-11312-thread-1-processing-n:127.0.0.1:55228_) [n:127.0.0.1:55228_ c:control_collection s:shard1 r:core_node1 x:collection1] o.a.s.h.l.XMLLoader xsltCacheLifetimeSeconds=60
   [junit4]   2> 3491484 INFO  (coreLoadExecutor-11312-thread-1-processing-n:127.0.0.1:55228_) [n:127.0.0.1:55228_ c:control_collection s:shard1 r:core_node1 x:collection1] o.a.s.c.RequestHandlers Registered paths: /admin/mbeans,standard,/update/json/docs,/admin/luke,/export,/get,/admin/properties,/update/json,/admin/threads,/dump,/update/csv,/sql,/graph,/admin/segments,/admin/system,/replication,/config,/stream,/schema,/admin/plugins,/admin/logging,/admin/ping,/update,/admin/file,/terms
   [junit4]   2> 3491484 INFO  (coreLoadExecutor-11312-thread-1-processing-n:127.0.0.1:55228_) [n:127.0.0.1:55228_ c:control_collection s:shard1 r:core_node1 x:collection1] o.a.s.c.SolrCore Using default statsCache cache: org.apache.solr.search.stats.LocalStatsCache
   [junit4]   2> 3491485 INFO  (coreLoadExecutor-11312-thread-1-processing-n:127.0.0.1:55228_) [n:127.0.0.1:55228_ c:control_collection s:shard1 r:core_node1 x:collection1] o.a.s.u.UpdateHandler Using UpdateLog implementation: org.apache.solr.update.UpdateLog
   [junit4]   2> 3491485 INFO  (coreLoadExecutor-11312-thread-1-processing-n:127.0.0.1:55228_) [n:127.0.0.1:55228_ c:control_collection s:shard1 r:core_node1 x:collection1] o.a.s.u.UpdateLog Initializing UpdateLog: dataDir= defaultSyncLevel=FLUSH numRecordsToKeep=100 maxNumLogsToKeep=10 numVersionBuckets=65536
   [junit4]   2> 3491486 INFO  (coreLoadExecutor-11312-thread-1-processing-n:127.0.0.1:55228_) [n:127.0.0.1:55228_ c:control_collection s:shard1 r:core_node1 x:collection1] o.a.s.u.CommitTracker Hard AutoCommit: disabled
   [junit4]   2> 3491486 INFO  (coreLoadExecutor-11312-thread-1-processing-n:127.0.0.1:55228_) [n:127.0.0.1:55228_ c:control_collection s:shard1 r:core_node1 x:collection1] o.a.s.u.CommitTracker Soft AutoCommit: disabled
   [junit4]   2> 3491487 INFO  (coreLoadExecutor-11312-thread-1-processing-n:127.0.0.1:55228_) [n:127.0.0.1:55228_ c:control_collection s:shard1 r:core_node1 x:collection1] o.a.s.u.RandomMergePolicy RandomMergePolicy wrapping class org.apache.lucene.index.TieredMergePolicy: [TieredMergePolicy: maxMergeAtOnce=18, maxMergeAtOnceExplicit=19, maxMergedSegmentMB=70.1591796875, floorSegmentMB=0.30078125, forceMergeDeletesPctAllowed=28.496553192052595, segmentsPerTier=14.0, maxCFSSegmentSizeMB=8.796093022207999E12, noCFSRatio=1.0
   [junit4]   2> 3491487 INFO  (coreLoadExecutor-11312-thread-1-processing-n:127.0.0.1:55228_) [n:127.0.0.1:55228_ c:control_collection s:shard1 r:core_node1 x:collection1] o.a.s.c.SolrDeletionPolicy SolrDeletionPolicy.onInit: commits: num=1
   [junit4]   2> 	commit{dir=MockDirectoryWrapper(RAMDirectory@43299e44 lockFactory=org.apache.lucene.store.SingleInstanceLockFactory@5df058a7),segFN=segments_1,generation=1}
   [junit4]   2> 3491487 INFO  (coreLoadExecutor-11312-thread-1-processing-n:127.0.0.1:55228_) [n:127.0.0.1:55228_ c:control_collection s:shard1 r:core_node1 x:collection1] o.a.s.c.SolrDeletionPolicy newest commit generation = 1
   [junit4]   2> 3491487 INFO  (coreLoadExecutor-11312-thread-1-processing-n:127.0.0.1:55228_) [n:127.0.0.1:55228_ c:control_collection s:shard1 r:core_node1 x:collection1] o.a.s.s.SolrIndexSearcher Opening [Searcher@64423434[collection1] main]
   [junit4]   2> 3491487 INFO  (coreLoadExecutor-11312-thread-1-processing-n:127.0.0.1:55228_) [n:127.0.0.1:55228_ c:control_collection s:shard1 r:core_node1 x:collection1] o.a.s.c.c.ZkStateReader Load collection config from: [/collections/control_collection]
   [junit4]   2> 3491488 INFO  (coreLoadExecutor-11312-thread-1-processing-n:127.0.0.1:55228_) [n:127.0.0.1:55228_ c:control_collection s:shard1 r:core_node1 x:collection1] o.a.s.c.c.ZkStateReader path=[/collections/control_collection] [configName]=[conf1] specified config exists in ZooKeeper
   [junit4]   2> 3491488 INFO  (coreLoadExecutor-11312-thread-1-processing-n:127.0.0.1:55228_) [n:127.0.0.1:55228_ c:control_collection s:shard1 r:core_node1 x:collection1] o.a.s.r.ManagedResourceStorage Setting up ZooKeeper-based storage for the RestManager with znodeBase: /configs/conf1
   [junit4]   2> 3491489 INFO  (coreLoadExecutor-11312-thread-1-processing-n:127.0.0.1:55228_) [n:127.0.0.1:55228_ c:control_collection s:shard1 r:core_node1 x:collection1] o.a.s.r.ManagedResourceStorage Configured ZooKeeperStorageIO with znodeBase: /configs/conf1
   [junit4]   2> 3491489 INFO  (coreLoadExecutor-11312-thread-1-processing-n:127.0.0.1:55228_) [n:127.0.0.1:55228_ c:control_collection s:shard1 r:core_node1 x:collection1] o.a.s.r.RestManager Initializing RestManager with initArgs: {}
   [junit4]   2> 3491489 INFO  (coreLoadExecutor-11312-thread-1-processing-n:127.0.0.1:55228_) [n:127.0.0.1:55228_ c:control_collection s:shard1 r:core_node1 x:collection1] o.a.s.r.ManagedResourceStorage Reading _rest_managed.json using ZooKeeperStorageIO:path=/configs/conf1
   [junit4]   2> 3491490 INFO  (coreLoadExecutor-11312-thread-1-processing-n:127.0.0.1:55228_) [n:127.0.0.1:55228_ c:control_collection s:shard1 r:core_node1 x:collection1] o.a.s.r.ManagedResourceStorage No data found for znode /configs/conf1/_rest_managed.json
   [junit4]   2> 3491490 INFO  (coreLoadExecutor-11312-thread-1-processing-n:127.0.0.1:55228_) [n:127.0.0.1:55228_ c:control_collection s:shard1 r:core_node1 x:collection1] o.a.s.r.ManagedResourceStorage Loaded null at path _rest_managed.json using ZooKeeperStorageIO:path=/configs/conf1
   [junit4]   2> 3491490 INFO  (coreLoadExecutor-11312-thread-1-processing-n:127.0.0.1:55228_) [n:127.0.0.1:55228_ c:control_collection s:shard1 r:core_node1 x:collection1] o.a.s.r.RestManager Initializing 0 registered ManagedResources
   [junit4]   2> 3491490 INFO  (coreLoadExecutor-11312-thread-1-processing-n:127.0.0.1:55228_) [n:127.0.0.1:55228_ c:control_collection s:shard1 r:core_node1 x:collection1] o.a.s.h.ReplicationHandler Commits will be reserved for  10000
   [junit4]   2> 3491491 INFO  (searcherExecutor-11313-thread-1-processing-n:127.0.0.1:55228_ x:collection1 s:shard1 c:control_collection r:core_node1) [n:127.0.0.1:55228_ c:control_collection s:shard1 r:core_node1 x:collection1] o.a.s.c.SolrCore [collection1] Registered new searcher Searcher@64423434[collection1] main{ExitableDirectoryReader(UninvertingDirectoryReader())}
   [junit4]   2> 3491491 INFO  (coreLoadExecutor-11312-thread-1-processing-n:127.0.0.1:55228_) [n:127.0.0.1:55228_ c:control_collection s:shard1 r:core_node1 x:collection1] o.a.s.u.UpdateLog Looking up max value of version field to seed version buckets
   [junit4]   2> 3491491 INFO  (coreLoadExecutor-11312-thread-1-processing-n:127.0.0.1:55228_) [n:127.0.0.1:55228_ c:control_collection s:shard1 r:core_node1 x:collection1] o.a.s.u.VersionInfo Refreshing highest value of _version_ for 65536 version buckets from index
   [junit4]   2> 3491491 INFO  (coreLoadExecutor-11312-thread-1-processing-n:127.0.0.1:55228_) [n:127.0.0.1:55228_ c:control_collection s:shard1 r:core_node1 x:collection1] o.a.s.u.VersionInfo No terms found for _version_, cannot seed version bucket highest value from index
   [junit4]   2> 3491491 INFO  (coreLoadExecutor-11312-thread-1-processing-n:127.0.0.1:55228_) [n:127.0.0.1:55228_ c:control_collection s:shard1 r:core_node1 x:collection1] o.a.s.u.UpdateLog Could not find max version in index or recent updates, using new clock 1544661727436603392
   [junit4]   2> 3491493 INFO  (coreLoadExecutor-11312-thread-1-processing-n:127.0.0.1:55228_) [n:127.0.0.1:55228_ c:control_collection s:shard1 r:core_node1 x:collection1] o.a.s.u.UpdateLog Took 1.0ms to seed version buckets with highest version 1544661727436603392
   [junit4]   2> 3491493 INFO  (coreLoadExecutor-11312-thread-1-processing-n:127.0.0.1:55228_) [n:127.0.0.1:55228_ c:control_collection s:shard1 r:core_node1 x:collection1] o.a.s.c.ZkController watch zkdir /configs/conf1
   [junit4]   2> 3491493 INFO  (coreLoadExecutor-11312-thread-1-processing-n:127.0.0.1:55228_) [n:127.0.0.1:55228_ c:control_collection s:shard1 r:core_node1 x:collection1] o.a.s.c.CoreContainer registering core: collection1
   [junit4]   2> 3491494 INFO  (coreZkRegister-11305-thread-1-processing-n:127.0.0.1:55228_ x:collection1 s:shard1 c:control_collection r:core_node1) [n:127.0.0.1:55228_ c:control_collection s:shard1 r:core_node1 x:collection1] o.a.s.c.ZkController Register replica - core:collection1 address:http://127.0.0.1:55228 collection:control_collection shard:shard1
   [junit4]   2> 3491495 INFO  (coreZkRegister-11305-thread-1-processing-n:127.0.0.1:55228_ x:collection1 s:shard1 c:control_collection r:core_node1) [n:127.0.0.1:55228_ c:control_collection s:shard1 r:core_node1 x:collection1] o.a.s.c.c.SolrZkClient makePath: /collections/control_collection/leader_elect/shard1/election
   [junit4]   2> 3491501 INFO  (coreZkRegister-11305-thread-1-processing-n:127.0.0.1:55228_ x:collection1 s:shard1 c:control_collection r:core_node1) [n:127.0.0.1:55228_ c:control_collection s:shard1 r:core_node1 x:collection1] o.a.s.c.LeaderElector Joined leadership election with path: /collections/control_collection/leader_elect/shard1/election/96541357836075012-core_node1-n_0000000000
   [junit4]   2> 3491502 INFO  (coreZkRegister-11305-thread-1-processing-n:127.0.0.1:55228_ x:collection1 s:shard1 c:control_collection r:core_node1) [n:127.0.0.1:55228_ c:control_collection s:shard1 r:core_node1 x:collection1] o.a.s.c.ShardLeaderElectionContext Running the leader process for shard=shard1 and weAreReplacement=false and leaderVoteWait=10000
   [junit4]   2> 3491504 INFO  (coreZkRegister-11305-thread-1-processing-n:127.0.0.1:55228_ x:collection1 s:shard1 c:control_collection r:core_node1) [n:127.0.0.1:55228_ c:control_collection s:shard1 r:core_node1 x:collection1] o.a.s.c.ShardLeaderElectionContext Enough replicas found to continue.
   [junit4]   2> 3491504 INFO  (coreZkRegister-11305-thread-1-processing-n:127.0.0.1:55228_ x:collection1 s:shard1 c:control_collection r:core_node1) [n:127.0.0.1:55228_ c:control_collection s:shard1 r:core_node1 x:collection1] o.a.s.c.ShardLeaderElectionContext I may be the new leader - try and sync
   [junit4]   2> 3491504 INFO  (coreZkRegister-11305-thread-1-processing-n:127.0.0.1:55228_ x:collection1 s:shard1 c:control_collection r:core_node1) [n:127.0.0.1:55228_ c:control_collection s:shard1 r:core_node1 x:collection1] o.a.s.c.SyncStrategy Sync replicas to http://127.0.0.1:55228/collection1/
   [junit4]   2> 3491504 INFO  (coreZkRegister-11305-thread-1-processing-n:127.0.0.1:55228_ x:collection1 s:shard1 c:control_collection r:core_node1) [n:127.0.0.1:55228_ c:control_collection s:shard1 r:core_node1 x:collection1] o.a.s.c.SyncStrategy Sync Success - now sync replicas to me
   [junit4]   2> 3491504 INFO  (coreZkRegister-11305-thread-1-processing-n:127.0.0.1:55228_ x:collection1 s:shard1 c:control_collection r:core_node1) [n:127.0.0.1:55228_ c:control_collection s:shard1 r:core_node1 x:collection1] o.a.s.c.SyncStrategy http://127.0.0.1:55228/collection1/ has no replicas
   [junit4]   2> 3491505 INFO  (OverseerStateUpdate-96541357836075012-127.0.0.1:55228_-n_0000000000) [n:127.0.0.1:55228_    ] o.a.s.c.Overseer processMessage: queueSize: 1, message = {
   [junit4]   2>   "operation":"leader",
   [junit4]   2>   "shard":"shard1",
   [junit4]   2>   "collection":"control_collection"} current state version: 1
   [junit4]   2> 3491506 INFO  (coreZkRegister-11305-thread-1-processing-n:127.0.0.1:55228_ x:collection1 s:shard1 c:control_collection r:core_node1) [n:127.0.0.1:55228_ c:control_collection s:shard1 r:core_node1 x:collection1] o.a.s.c.c.SolrZkClient makePath: /collections/control_collection/leaders/shard1
   [junit4]   2> 3491510 INFO  (coreZkRegister-11305-thread-1-processing-n:127.0.0.1:55228_ x:collection1 s:shard1 c:control_collection r:core_node1) [n:127.0.0.1:55228_ c:control_collection s:shard1 r:core_node1 x:collection1] o.a.s.c.ShardLeaderElectionContextBase Creating leader registration node /collections/control_collection/leaders/shard1/leader after winning as /collections/control_collection/leader_elect/shard1/election/96541357836075012-core_node1-n_0000000000
   [junit4]   2> 3491512 INFO  (coreZkRegister-11305-thread-1-processing-n:127.0.0.1:55228_ x:collection1 s:shard1 c:control_collection r:core_node1) [n:127.0.0.1:55228_ c:control_collection s:shard1 r:core_node1 x:collection1] o.a.s.c.ShardLeaderElectionContext I am the new leader: http://127.0.0.1:55228/collection1/ shard1
   [junit4]   2> 3491514 INFO  (OverseerStateUpdate-96541357836075012-127.0.0.1:55228_-n_0000000000) [n:127.0.0.1:55228_    ] o.a.s.c.Overseer processMessage: queueSize: 1, message = {
   [junit4]   2>   "operation":"leader",
   [junit4]   2>   "shard":"shard1",
   [junit4]   2>   "collection":"control_collection",
   [junit4]   2>   "base_url":"http://127.0.0.1:55228",
   [junit4]   2>   "core":"collection1",
   [junit4]   2>   "state":"active"} current state version: 1
   [junit4]   2> 3491621 INFO  (zkCallback-11036-thread-2-processing-n:127.0.0.1:55228_) [n:127.0.0.1:55228_    ] o.a.s.c.c.ZkStateReader A cluster state change: [WatchedEvent state:SyncConnected type:NodeDataChanged path:/clusterstate.json], has occurred - updating... (live nodes size: [1])
   [junit4]   2> 3491669 INFO  (coreZkRegister-11305-thread-1-processing-n:127.0.0.1:55228_ x:collection1 s:shard1 c:control_collection r:core_node1) [n:127.0.0.1:55228_ c:control_collection s:shard1 r:core_node1 x:collection1] o.a.s.c.ZkController We are http://127.0.0.1:55228/collection1/ and leader is http://127.0.0.1:55228/collection1/
   [junit4]   2> 3491669 INFO  (coreZkRegister-11305-thread-1-processing-n:127.0.0.1:55228_ x:collection1 s:shard1 c:control_collection r:core_node1) [n:127.0.0.1:55228_ c:control_collection s:shard1 r:core_node1 x:collection1] o.a.s.c.ZkController No LogReplay needed for core=collection1 baseURL=http://127.0.0.1:55228
   [junit4]   2> 3491670 INFO  (coreZkRegister-11305-thread-1-processing-n:127.0.0.1:55228_ x:collection1 s:shard1 c:control_collection r:core_node1) [n:127.0.0.1:55228_ c:control_collection s:shard1 r:core_node1 x:collection1] o.a.s.c.ZkController I am the leader, no recovery necessary
   [junit4]   2> 3491670 INFO  (coreZkRegister-11305-thread-1-processing-n:127.0.0.1:55228_ x:collection1 s:shard1 c:control_collection r:core_node1) [n:127.0.0.1:55228_ c:control_collection s:shard1 r:core_node1 x:collection1] o.a.s.c.ZkController publishing state=active
   [junit4]   2> 3491670 INFO  (coreZkRegister-11305-thread-1-processing-n:127.0.0.1:55228_ x:collection1 s:shard1 c:control_collection r:core_node1) [n:127.0.0.1:55228_ c:control_collection s:shard1 r:core_node1 x:collection1] o.a.s.c.ZkController numShards not found on descriptor - reading it from system property
   [junit4]   2> 3491672 INFO  (coreZkRegister-11305-thread-1-processing-n:127.0.0.1:55228_ x:collection1 s:shard1 c:control_collection r:core_node1) [n:127.0.0.1:55228_ c:control_collection s:shard1 r:core_node1 x:collection1] o.a.s.c.c.ZkStateReader Checking legacy cluster state for collection control_collection
   [junit4]   2> 3491673 INFO  (OverseerStateUpdate-96541357836075012-127.0.0.1:55228_-n_0000000000) [n:127.0.0.1:55228_    ] o.a.s.c.Overseer processMessage: queueSize: 1, message = {
   [junit4]   2>   "core":"collection1",
   [junit4]   2>   "core_node_name":"core_node1",
   [junit4]   2>   "roles":null,
   [junit4]   2>   "base_url":"http://127.0.0.1:55228",
   [junit4]   2>   "node_name":"127.0.0.1:55228_",
   [junit4]   2>   "numShards":"1",
   [junit4]   2>   "state":"active",
   [junit4]   2>   "shard":"shard1",
   [junit4]   2>   "collection":"control_collection",
   [junit4]   2>   "operation":"state"} current state version: 2
   [junit4]   2> 3491673 INFO  (OverseerStateUpdate-96541357836075012-127.0.0.1:55228_-n_0000000000) [n:127.0.0.1:55228_    ] o.a.s.c.o.ReplicaMutator Update state numShards=1 message={
   [junit4]   2>   "core":"collection1",
   [junit4]   2>   "core_node_name":"core_node1",
   [junit4]   2>   "roles":null,
   [junit4]   2>   "base_url":"http://127.0.0.1:55228",
   [junit4]   2>   "node_name":"127.0.0.1:55228_",
   [junit4]   2>   "numShards":"1",
   [junit4]   2>   "state":"active",
   [junit4]   2>   "shard":"shard1",
   [junit4]   2>   "collection":"control_collection",
   [junit4]   2>   "operation":"state"}
   [junit4]   2> 3491787 INFO  (zkCallback-11036-thread-3-processing-n:127.0.0.1:55228_) [n:127.0.0.1:55228_    ] o.a.s.c.c.ZkStateReader A cluster state change: [WatchedEvent state:SyncConnected type:NodeDataChanged path:/clusterstate.json], has occurred - updating... (live nodes size: [1])
   [junit4]   2> 3491842 INFO  (TEST-TestSolrConfigHandlerCloud.test-seed#[5035DE0607C64413]) [    ] o.a.s.c.c.SolrZkClient Using default ZkCredentialsProvider
   [junit4]   2> 3491842 INFO  (TEST-TestSolrConfigHandlerCloud.test-seed#[5035DE0607C64413]) [    ] o.a.s.c.c.ConnectionManager Waiting for client to connect to ZooKeeper
   [junit4]   2> 3491844 INFO  (zkCallback-11040-thread-1) [    ] o.a.s.c.c.ConnectionManager Watcher org.apache.solr.common.cloud.ConnectionManager@f0732d1 name:ZooKeeperConnection Watcher:127.0.0.1:55225/solr got event WatchedEvent state:SyncConnected type:None path:null path:null type:None
   [junit4]   2> 3491844 INFO  (TEST-TestSolrConfigHandlerCloud.test-seed#[5035DE0607C64413]) [    ] o.a.s.c.c.ConnectionManager Client is connected to ZooKeeper
   [junit4]   2> 3491844 INFO  (TEST-TestSolrConfigHandlerCloud.test-seed#[5035DE0607C64413]) [    ] o.a.s.c.c.SolrZkClient Using default ZkACLProvider
   [junit4]   2> 3491844 INFO  (TEST-TestSolrConfigHandlerCloud.test-seed#[5035DE0607C64413]) [    ] o.a.s.c.c.ZkStateReader Updating cluster state from ZooKeeper... 
   [junit4]   2> 3491845 INFO  (TEST-TestSolrConfigHandlerCloud.test-seed#[5035DE0607C64413]) [    ] o.a.s.c.c.ZkStateReader Loaded empty cluster properties
   [junit4]   2> 3491848 INFO  (TEST-TestSolrConfigHandlerCloud.test-seed#[5035DE0607C64413]) [    ] o.a.s.c.c.ZkStateReader Updated live nodes from ZooKeeper... (0) -> (1)
   [junit4]   2> 3491851 INFO  (TEST-TestSolrConfigHandlerCloud.test-seed#[5035DE0607C64413]) [    ] o.a.s.c.ChaosMonkey monkey: init - expire sessions:false cause connection loss:false
   [junit4]   2> 3492127 INFO  (TEST-TestSolrConfigHandlerCloud.test-seed#[5035DE0607C64413]) [    ] o.a.s.SolrTestCaseJ4 Writing core.properties file to /Users/jenkins/workspace/Lucene-Solr-master-MacOSX/solr/build/solr-core/test/J0/temp/solr.handler.TestSolrConfigHandlerCloud_5035DE0607C64413-001/shard-1-001/cores/collection1
   [junit4]   2> 3492129 INFO  (TEST-TestSolrConfigHandlerCloud.test-seed#[5035DE0607C64413]) [    ] o.a.s.c.AbstractFullDistribZkTestBase create jetty 1 in directory /Users/jenkins/workspace/Lucene-Solr-master-MacOSX/solr/build/solr-core/test/J0/temp/solr.handler.TestSolrConfigHandlerCloud_5035DE0607C64413-001/shard-1-001
   [junit4]   2> 3492129 INFO  (TEST-TestSolrConfigHandlerCloud.test-seed#[5035DE0607C64413]) [    ] o.e.j.s.Server jetty-9.3.8.v20160314
   [junit4]   2> 3492131 INFO  (TEST-TestSolrConfigHandlerCloud.test-seed#[5035DE0607C64413]) [    ] o.e.j.s.h.ContextHandler Started o.e.j.s.ServletContextHandler@12c57a07{/,null,AVAILABLE}
   [junit4]   2> 3492131 INFO  (TEST-TestSolrConfigHandlerCloud.test-seed#[5035DE0607C64413]) [    ] o.e.j.s.ServerConnector Started ServerConnector@2e22e1f7{HTTP/1.1,[http/1.1]}{127.0.0.1:55234}
   [junit4]   2> 3492131 INFO  (TEST-TestSolrConfigHandlerCloud.test-seed#[5035DE0607C64413]) [    ] o.e.j.s.Server Started @3497372ms
   [junit4]   2> 3492131 INFO  (TEST-TestSolrConfigHandlerCloud.test-seed#[5035DE0607C64413]) [    ] o.a.s.c.s.e.JettySolrRunner Jetty properties: {solr.data.dir=/Users/jenkins/workspace/Lucene-Solr-master-MacOSX/solr/build/solr-core/test/J0/temp/solr.handler.TestSolrConfigHandlerCloud_5035DE0607C64413-001/tempDir-001/jetty1, solrconfig=solrconfig.xml, hostContext=/, hostPort=55234, coreRootDirectory=/Users/jenkins/workspace/Lucene-Solr-master-MacOSX/solr/build/solr-core/test/J0/../../../../../../../../../Users/jenkins/workspace/Lucene-Solr-master-MacOSX/solr/build/solr-core/test/J0/temp/solr.handler.TestSolrConfigHandlerCloud_5035DE0607C64413-001/shard-1-001/cores}
   [junit4]   2> 3492132 INFO  (TEST-TestSolrConfigHandlerCloud.test-seed#[5035DE0607C64413]) [    ] o.a.s.s.SolrDispatchFilter SolrDispatchFilter.init(): sun.misc.Launcher$AppClassLoader@4554617c
   [junit4]   2> 3492132 INFO  (TEST-TestSolrConfigHandlerCloud.test-seed#[5035DE0607C64413]) [    ] o.a.s.c.SolrResourceLoader new SolrResourceLoader for directory: '/Users/jenkins/workspace/Lucene-Solr-master-MacOSX/solr/build/solr-core/test/J0/temp/solr.handler.TestSolrConfigHandlerCloud_5035DE0607C64413-001/shard-1-001'
   [junit4]   2> 3492133 INFO  (TEST-TestSolrConfigHandlerCloud.test-seed#[5035DE0607C64413]) [    ] o.a.s.c.SolrResourceLoader JNDI not configured for solr (NoInitialContextEx)
   [junit4]   2> 3492133 INFO  (TEST-TestSolrConfigHandlerCloud.test-seed#[5035DE0607C64413]) [    ] o.a.s.c.SolrResourceLoader solr home defaulted to 'solr/' (could not find system property or JNDI)
   [junit4]   2> 3492133 INFO  (TEST-TestSolrConfigHandlerCloud.test-seed#[5035DE0607C64413]) [    ] o.a.s.c.c.SolrZkClient Using default ZkCredentialsProvider
   [junit4]   2> 3492133 INFO  (TEST-TestSolrConfigHandlerCloud.test-seed#[5035DE0607C64413]) [    ] o.a.s.c.c.ConnectionManager Waiting for client to connect to ZooKeeper
   [junit4]   2> 3492135 INFO  (zkCallback-11041-thread-1) [    ] o.a.s.c.c.ConnectionManager Watcher org.apache.solr.common.cloud.ConnectionManager@29ef13b8 name:ZooKeeperConnection Watcher:127.0.0.1:55225/solr got event WatchedEvent state:SyncConnected type:None path:null path:null type:None
   [junit4]   2> 3492135 INFO  (TEST-TestSolrConfigHandlerCloud.test-seed#[5035DE0607C64413]) [    ] o.a.s.c.c.ConnectionManager Client is connected to ZooKeeper
   [junit4]   2> 3492136 INFO  (TEST-TestSolrConfigHandlerCloud.test-seed#[5035DE0607C64413]) [    ] o.a.s.c.c.SolrZkClient Using default ZkACLProvider
   [junit4]   2> 3492137 INFO  (TEST-TestSolrConfigHandlerCloud.test-seed#[5035DE0607C64413]) [    ] o.a.s.s.SolrDispatchFilter Loading solr.xml from SolrHome (not found in ZooKeeper)
   [junit4]   2> 3492137 INFO  (TEST-TestSolrConfigHandlerCloud.test-seed#[5035DE0607C64413]) [    ] o.a.s.c.SolrXmlConfig Loading container configuration from /Users/jenkins/workspace/Lucene-Solr-master-MacOSX/solr/build/solr-core/test/J0/temp/solr.handler.TestSolrConfigHandlerCloud_5035DE0607C64413-001/shard-1-001/solr.xml
   [junit4]   2> 3492147 INFO  (TEST-TestSolrConfigHandlerCloud.test-seed#[5035DE0607C64413]) [    ] o.a.s.c.CorePropertiesLocator Config-defined core root directory: /Users/jenkins/workspace/Lucene-Solr-master-MacOSX/solr/build/solr-core/test/J0/../../../../../../../../../Users/jenkins/workspace/Lucene-Solr-master-MacOSX/solr/build/solr-core/test/J0/temp/solr.handler.TestSolrConfigHandlerCloud_5035DE0607C64413-001/shard-1-001/cores
   [junit4]   2> 3492147 INFO  (TEST-TestSolrConfigHandlerCloud.test-seed#[5035DE0607C64413]) [    ] o.a.s.c.CoreContainer New CoreContainer 251235882
   [junit4]   2> 3492147 INFO  (TEST-TestSolrConfigHandlerCloud.test-seed#[5035DE0607C64413]) [    ] o.a.s.c.CoreContainer Loading cores into CoreContainer [instanceDir=/Users/jenkins/workspace/Lucene-Solr-master-MacOSX/solr/build/solr-core/test/J0/temp/solr.handler.TestSolrConfigHandlerCloud_5035DE0607C64413-001/shard-1-001]
   [junit4]   2> 3492148 WARN  (TEST-TestSolrConfigHandlerCloud.test-seed#[5035DE0607C64413]) [    ] o.a.s.c.CoreContainer Couldn't add files from /Users/jenkins/workspace/Lucene-Solr-master-MacOSX/solr/build/solr-core/test/J0/temp/solr.handler.TestSolrConfigHandlerCloud_5035DE0607C64413-001/shard-1-001/lib to classpath: /Users/jenkins/workspace/Lucene-Solr-master-MacOSX/solr/build/solr-core/test/J0/temp/solr.handler.TestSolrConfigHandlerCloud_5035DE0607C64413-001/shard-1-001/lib
   [junit4]   2> 3492148 INFO  (TEST-TestSolrConfigHandlerCloud.test-seed#[5035DE0607C64413]) [    ] o.a.s.h.c.HttpShardHandlerFactory created with socketTimeout : 90000,urlScheme : ,connTimeout : 15000,maxConnectionsPerHost : 20,maxConnections : 10000,corePoolSize : 0,maximumPoolSize : 2147483647,maxThreadIdleTime : 5,sizeOfQueue : -1,fairnessPolicy : false,
   [junit4]   2> 3492152 INFO  (TEST-TestSolrConfigHandlerCloud.test-seed#[5035DE0607C64413]) [    ] o.a.s.u.UpdateShardHandler Created UpdateShardHandler HTTP client with params: socketTimeout=340000&connTimeout=45000&maxConnections=100000&maxConnectionsPerHost=100000
   [junit4]   2> 3492152 INFO  (TEST-TestSolrConfigHandlerCloud.test-seed#[5035DE0607C64413]) [    ] o.a.s.l.LogWatcher SLF4J impl is org.slf4j.impl.Log4jLoggerFactory
   [junit4]   2> 3492152 INFO  (TEST-TestSolrConfigHandlerCloud.test-seed#[5035DE0607C64413]) [    ] o.a.s.l.LogWatcher Registering Log Listener [Log4j (org.slf4j.impl.Log4jLoggerFactory)]
   [junit4]   2> 3492152 INFO  (TEST-TestSolrConfigHandlerCloud.test-seed#[5035DE0607C64413]) [    ] o.a.s.c.ZkContainer Zookeeper client=127.0.0.1:55225/solr
   [junit4]   2> 3492152 INFO  (TEST-TestSolrConfigHandlerCloud.test-seed#[5035DE0607C64413]) [    ] o.a.s.c.ZkController zkHost includes chroot
   [junit4]   2> 3492152 INFO  (TEST-TestSolrConfigHandlerCloud.test-seed#[5035DE0607C64413]) [    ] o.a.s.c.c.SolrZkClient Using default ZkCredentialsProvider
   [junit4]   2> 3492153 INFO  (TEST-TestSolrConfigHandlerCloud.test-seed#[5035DE0607C64413]) [    ] o.a.s.c.c.ConnectionManager Waiting for client to connect to ZooKeeper
   [junit4]   2> 3492154 INFO  (zkCallback-11044-thread-1) [    ] o.a.s.c.c.ConnectionManager Watcher org.apache.solr.common.cloud.ConnectionManager@6228a3f4 name:ZooKeeperConnection Watcher:127.0.0.1:55225 got event WatchedEvent state:SyncConnected type:None path:null path:null type:None
   [junit4]   2> 3492154 INFO  (TEST-TestSolrConfigHandlerCloud.test-seed#[5035DE0607C64413]) [    ] o.a.s.c.c.ConnectionManager Client is connected to ZooKeeper
   [junit4]   2> 3492154 INFO  (TEST-TestSolrConfigHandlerCloud.test-seed#[5035DE0607C64413]) [    ] o.a.s.c.c.SolrZkClient Using default ZkACLProvider
   [junit4]   2> 3492156 INFO  (TEST-TestSolrConfigHandlerCloud.test-seed#[5035DE0607C64413]) [n:127.0.0.1:55234_    ] o.a.s.c.ZkController Added new OnReconnect listener org.apache.solr.cloud.ZkController$$Lambda$69/1764319329@521537c2
   [junit4]   2> 3492156 INFO  (TEST-TestSolrConfigHandlerCloud.test-seed#[5035DE0607C64413]) [n:127.0.0.1:55234_    ] o.a.s.c.c.ConnectionManager Waiting for client to connect to ZooKeeper
   [junit4]   2> 3492157 INFO  (zkCallback-11045-thread-1-processing-n:127.0.0.1:55234_) [n:127.0.0.1:55234_    ] o.a.s.c.c.ConnectionManager Watcher org.apache.solr.common.cloud.ConnectionManager@69b5576e name:ZooKeeperConnection Watcher:127.0.0.1:55225/solr got event WatchedEvent state:SyncConnected type:None path:null path:null type:None
   [junit4]   2> 3492157 INFO  (TEST-TestSolrConfigHandlerCloud.test-seed#[5035DE0607C64413]) [n:127.0.0.1:55234_    ] o.a.s.c.c.ConnectionManager Client is connected to ZooKeeper
   [junit4]   2> 3492172 INFO  (TEST-TestSolrConfigHandlerCloud.test-seed#[5035DE0607C64413]) [n:127.0.0.1:55234_    ] o.a.s.c.c.ZkStateReader Updating cluster state from ZooKeeper... 
   [junit4]   2> 3492174 INFO  (TEST-TestSolrConfigHandlerCloud.test-seed#[5035DE0607C64413]) [n:127.0.0.1:55234_    ] o.a.s.c.c.ZkStateReader Loaded empty cluster properties
   [junit4]   2> 3492175 INFO  (TEST-TestSolrConfigHandlerCloud.test-seed#[5035DE0607C64413]) [n:127.0.0.1:55234_    ] o.a.s.c.c.ZkStateReader Updated live nodes from ZooKeeper... (0) -> (1)
   [junit4]   2> 3492180 INFO  (TEST-TestSolrConfigHandlerCloud.test-seed#[5035DE0607C64413]) [n:127.0.0.1:55234_    ] o.a.s.c.Overseer Overseer (id=null) closing
   [junit4]   2> 3492180 INFO  (TEST-TestSolrConfigHandlerCloud.test-seed#[5035DE0607C64413]) [n:127.0.0.1:55234_    ] o.a.s.c.LeaderElector Joined leadership election with path: /overseer_elect/election/96541357836075016-127.0.0.1:55234_-n_0000000001
   [junit4]   2> 3492182 INFO  (TEST-TestSolrConfigHandlerCloud.test-seed#[5035DE0607C64413]) [n:127.0.0.1:55234_    ] o.a.s.c.LeaderElector Watching path /overseer_elect/election/96541357836075012-127.0.0.1:55228_-n_0000000000 to know if I could be the leader
   [junit4]   2> 3492183 INFO  (TEST-TestSolrConfigHandlerCloud.test-seed#[5035DE0607C64413]) [n:127.0.0.1:55234_    ] o.a.s.c.ZkController Publish node=127.0.0.1:55234_ as DOWN
   [junit4]   2> 3492185 INFO  (TEST-TestSolrConfigHandlerCloud.test-seed#[5035DE0607C64413]) [n:127.0.0.1:55234_    ] o.a.s.c.ZkController Register node as live in ZooKeeper:/live_nodes/127.0.0.1:55234_
   [junit4]   2> 3492185 INFO  (TEST-TestSolrConfigHandlerCloud.test-seed#[5035DE0607C64413]) [n:127.0.0.1:55234_    ] o.a.s.c.c.SolrZkClient makePath: /live_nodes/127.0.0.1:55234_
   [junit4]   2> 3492186 INFO  (OverseerStateUpdate-96541357836075012-127.0.0.1:55228_-n_0000000000) [n:127.0.0.1:55228_    ] o.a.s.c.Overseer processMessage: queueSize: 1, message = {
   [junit4]   2>   "operation":"downnode",
   [junit4]   2>   "node_name":"127.0.0.1:55234_"} current state version: 3
   [junit4]   2> 3492186 INFO  (OverseerStateUpdate-96541357836075012-127.0.0.1:55228_-n_0000000000) [n:127.0.0.1:55228_    ] o.a.s.c.o.NodeMutator DownNode state invoked for node: 127.0.0.1:55234_
   [junit4]   2> 3492186 INFO  (zkCallback-11040-thread-1) [    ] o.a.s.c.c.ZkStateReader A live node change: [WatchedEvent state:SyncConnected type:NodeChildrenChanged path:/live_nodes], has occurred - updating... (live nodes size: [1])
   [junit4]   2> 3492186 INFO  (zkCallback-11045-thread-1-processing-n:127.0.0.1:55234_) [n:127.0.0.1:55234_    ] o.a.s.c.c.ZkStateReader A live node change: [WatchedEvent state:SyncConnected type:NodeChildrenChanged path:/live_nodes], has occurred - updating... (live nodes size: [1])
   [junit4]   2> 3492186 INFO  (zkCallback-11036-thread-2-processing-n:127.0.0.1:55228_) [n:127.0.0.1:55228_    ] o.a.s.c.c.ZkStateReader A live node change: [WatchedEvent state:SyncConnected type:NodeChildrenChanged path:/live_nodes], has occurred - updating... (live nodes size: [1])
   [junit4]   2> 3492187 INFO  (zkCallback-11036-thread-2-processing-n:127.0.0.1:55228_) [n:127.0.0.1:55228_    ] o.a.s.c.c.ZkStateReader Updated live nodes from ZooKeeper... (1) -> (2)
   [junit4]   2> 3492188 INFO  (zkCallback-11040-thread-1) [    ] o.a.s.c.c.ZkStateReader Updated live nodes from ZooKeeper... (1) -> (2)
   [junit4]   2> 3492189 INFO  (zkCallback-11045-thread-1-processing-n:127.0.0.1:55234_) [n:127.0.0.1:55234_    ] o.a.s.c.c.ZkStateReader Updated live nodes from ZooKeeper... (1) -> (2)
   [junit4]   2> 3492212 INFO  (TEST-TestSolrConfigHandlerCloud.test-seed#[5035DE0607C64413]) [n:127.0.0.1:55234_    ] o.a.s.c.CoreContainer Security conf doesn't exist. Skipping setup for authorization module.
   [junit4]   2> 3492212 INFO  (TEST-TestSolrConfigHandlerCloud.test-seed#[5035DE0607C64413]) [n:127.0.0.1:55234_    ] o.a.s.c.CoreContainer No authentication plugin used.
   [junit4]   2> 3492213 INFO  (TEST-TestSolrConfigHandlerCloud.test-seed#[5035DE0607C64413]) [n:127.0.0.1:55234_    ] o.a.s.c.CorePropertiesLocator Looking for core definitions underneath /Users/jenkins/workspace/Lucene-Solr-master-MacOSX/solr/build/solr-core/test/J0/../../../../../../../../../Users/jenkins/workspace/Lucene-Solr-master-MacOSX/solr/build/solr-core/test/J0/temp/solr.handler.TestSolrConfigHandlerCloud_5035DE0607C64413-001/shard-1-001/cores
   [junit4]   2> 3492214 INFO  (TEST-TestSolrConfigHandlerCloud.test-seed#[5035DE0607C64413]) [n:127.0.0.1:55234_    ] o.a.s.c.CoreDescriptor Created CoreDescriptor: {name=collection1, config=solrconfig.xml, transient=false, schema=schema.xml, loadOnStartup=true, configSetProperties=configsetprops.json, collection=collection1, coreNodeName=, dataDir=data/, shard=}
   [junit4]   2> 3492215 INFO  (TEST-TestSolrConfigHandlerCloud.test-seed#[5035DE0607C64413]) [n:127.0.0.1:55234_    ] o.a.s.c.CorePropertiesLocator Found core collection1 in /Users/jenkins/workspace/Lucene-Solr-master-MacOSX/solr/build/solr-core/test/J0/../../../../../../../../../Users/jenkins/workspace/Lucene-Solr-master-MacOSX/solr/build/solr-core/test/J0/temp/solr.handler.TestSolrConfigHandlerCloud_5035DE0607C64413-001/shard-1-001/cores/collection1
   [junit4]   2> 3492215 INFO  (TEST-TestSolrConfigHandlerCloud.test-seed#[5035DE0607C64413]) [n:127.0.0.1:55234_    ] o.a.s.c.CorePropertiesLocator Found 1 core definitions
   [junit4]   2> 3492216 INFO  (coreLoadExecutor-11323-thread-1-processing-n:127.0.0.1:55234_) [n:127.0.0.1:55234_ c:collection1   x:collection1] o.a.s.c.ZkController publishing state=down
   [junit4]   2> 3492216 INFO  (TEST-TestSolrConfigHandlerCloud.test-seed#[5035DE0607C64413]) [n:127.0.0.1:55234_    ] o.a.s.s.SolrDispatchFilter user.dir=/Users/jenkins/workspace/Lucene-Solr-master-MacOSX/solr/build/solr-core/test/J0
   [junit4]   2> 3492216 INFO  (coreLoadExecutor-11323-thread-1-processing-n:127.0.0.1:55234_) [n:127.0.0.1:55234_ c:collection1   x:collection1] o.a.s.c.ZkController numShards not found on descriptor - reading it from system property
   [junit4]   2> 3492216 INFO  (TEST-TestSolrConfigHandlerCloud.test-seed#[5035DE0607C64413]) [n:127.0.0.1:55234_    ] o.a.s.s.SolrDispatchFilter SolrDispatchFilter.init() done
   [junit4]   2> 3492217 INFO  (coreLoadExecutor-11323-thread-1-processing-n:127.0.0.1:55234_) [n:127.0.0.1:55234_ c:collection1   x:collection1] o.a.s.c.ZkController Collection collection1 not visible yet, but flagging it so a watch is registered when it becomes visible
   [junit4]   2> 3492218 INFO  (OverseerStateUpdate-96541357836075012-127.0.0.1:55228_-n_0000000000) [n:127.0.0.1:55228_    ] o.a.s.c.Overseer processMessage: queueSize: 1, message = {
   [junit4]   2>   "core":"collection1",
   [junit4]   2>   "roles":null,
   [junit4]   2>   "base_url":"http://127.0.0.1:55234",
   [junit4]   2>   "node_name":"127.0.0.1:55234_",
   [junit4]   2>   "numShards":"2",
   [junit4]   2>   "state":"down",
   [junit4]   2>   "shard":null,
   [junit4]   2>   "collection":"collection1",
   [junit4]   2>   "operation":"state"} current state version: 3
   [junit4]   2> 3492219 INFO  (OverseerStateUpdate-96541357836075012-127.0.0.1:55228_-n_0000000000) [n:127.0.0.1:55228_    ] o.a.s.c.o.ReplicaMutator Update state numShards=2 message={
   [junit4]   2>   "core":"collection1",
   [junit4]   2>   "roles":null,
   [junit4]   2>   "base_url":"http://127.0.0.1:55234",
   [junit4]   2>   "node_name":"127.0.0.1:55234_",
   [junit4]   2>   "numShards":"2",
   [junit4]   2>   "state":"down",
   [junit4]   2>   "shard":null,
   [junit4]   2>   "collection":"collection1",
   [junit4]   2>   "operation":"state"}
   [junit4]   2> 3492219 INFO  (OverseerStateUpdate-96541357836075012-127.0.0.1:55228_-n_0000000000) [n:127.0.0.1:55228_    ] o.a.s.c.o.ClusterStateMutator building a new cName: collection1
   [junit4]   2> 3492219 INFO  (OverseerStateUpdate-96541357836075012-127.0.0.1:55228_-n_0000000000) [n:127.0.0.1:55228_    ] o.a.s.c.o.ReplicaMutator Assigning new node to shard shard=shard2
   [junit4]   2> 3492219 INFO  (coreLoadExecutor-11323-thread-1-processing-n:127.0.0.1:55234_) [n:127.0.0.1:55234_ c:collection1   x:collection1] o.a.s.c.c.ZkStateReader Deleting data for [collection1]
   [junit4]   2> 3492220 INFO  (coreLoadExecutor-11323-thread-1-processing-n:127.0.0.1:55234_) [n:127.0.0.1:55234_ c:collection1   x:collection1] o.a.s.c.ZkController look for our core node name
   [junit4]   2> 3492333 INFO  (zkCallback-11040-thread-1) [    ] o.a.s.c.c.ZkStateReader A cluster state change: [WatchedEvent state:SyncConnected type:NodeDataChanged path:/clusterstate.json], has occurred - updating... (live nodes size: [2])
   [junit4]   2> 3492333 INFO  (zkCallback-11036-thread-1-processing-n:127.0.0.1:55228_) [n:127.0.0.1:55228_    ] o.a.s.c.c.ZkStateReader A cluster state change: [WatchedEvent state:SyncConnected type:NodeDataChanged path:/clusterstate.json], has occurred - updating... (live nodes size: [2])
   [junit4]   2> 3492333 INFO  (zkCallback-11045-thread-1-processing-n:127.0.0.1:55234_) [n:127.0.0.1:55234_    ] o.a.s.c.c.ZkStateReader A cluster state change: [WatchedEvent state:SyncConnected type:NodeDataChanged path:/clusterstate.json], has occurred - updating... (live nodes size: [2])
   [junit4]   2> 3493231 INFO  (coreLoadExecutor-11323-thread-1-processing-n:127.0.0.1:55234_) [n:127.0.0.1:55234_ c:collection1   x:collection1] o.a.s.c.ZkController waiting to find shard id in clusterstate for collection1
   [junit4]   2> 3493231 INFO  (coreLoadExecutor-11323-thread-1-processing-n:127.0.0.1:55234_) [n:127.0.0.1:55234_ c:collection1   x:collection1] o.a.s.c.ZkController Check for collection zkNode:collection1
   [junit4]   2> 3493232 INFO  (coreLoadExecutor-11323-thread-1-processing-n:127.0.0.1:55234_) [n:127.0.0.1:55234_ c:collection1   x:collection1] o.a.s.c.ZkController Collection zkNode exists
   [junit4]   2> 3493232 INFO  (coreLoadExecutor-11323-thread-1-processing-n:127.0.0.1:55234_) [n:127.0.0.1:55234_ c:collection1   x:collection1] o.a.s.c.c.ZkStateReader Load collection config from: [/collections/collection1]
   [junit4]   2> 3493233 INFO  (coreLoadExecutor-11323-thread-1-processing-n:127.0.0.1:55234_) [n:127.0.0.1:55234_ c:collection1   x:collection1] o.a.s.c.c.ZkStateReader path=[/collections/collection1] [configName]=[conf1] specified config exists in ZooKeeper
   [junit4]   2> 3493233 INFO  (coreLoadExecutor-11323-thread-1-processing-n:127.0.0.1:55234_) [n:127.0.0.1:55234_ c:collection1   x:collection1] o.a.s.c.SolrResourceLoader new SolrResourceLoader for directory: '/Users/jenkins/workspace/Lucene-Solr-master-MacOSX/solr/build/solr-core/test/J0/temp/solr.handler.TestSolrConfigHandlerCloud_5035DE0607C64413-001/shard-1-001/cores/collection1'
   [junit4]   2> 3493233 INFO  (coreLoadExecutor-11323-thread-1-processing-n:127.0.0.1:55234_) [n:127.0.0.1:55234_ c:collection1   x:collection1] o.a.s.c.SolrResourceLoader JNDI not configured for solr (NoInitialContextEx)
   [junit4]   2> 3493233 INFO  (coreLoadExecutor-11323-thread-1-processing-n:127.0.0.1:55234_) [n:127.0.0.1:55234_ c:collection1   x:collection1] o.a.s.c.SolrResourceLoader solr home defaulted to 'solr/' (could not find system property or JNDI)
   [junit4]   2> 3493235 INFO  (coreLoadExecutor-11323-thread-1-processing-n:127.0.0.1:55234_) [n:127.0.0.1:55234_ c:collection1   x:collection1] o.a.s.c.Config loaded config solrconfig.xml with version 0 
   [junit4]   2> 3493242 INFO  (coreLoadExecutor-11323-thread-1-processing-n:127.0.0.1:55234_) [n:127.0.0.1:55234_ c:collection1   x:collection1] o.a.s.c.SolrConfig current version of requestparams : -1
   [junit4]   2> 3493244 WARN  (coreLoadExecutor-11323-thread-1-processing-n:127.0.0.1:55234_) [n:127.0.0.1:55234_ c:collection1   x:collection1] o.a.s.c.Config Beginning with Solr 5.5, <mergePolicy> is deprecated, use <mergePolicyFactory> instead.
   [junit4]   2> 3493245 INFO  (coreLoadExecutor-11323-thread-1-processing-n:127.0.0.1:55234_) [n:127.0.0.1:55234_ c:collection1   x:collection1] o.a.s

[...truncated too long message...]

ckingQueue.java:442)
   [junit4]   2>         at java.util.concurrent.ThreadPoolExecutor.getTask(ThreadPoolExecutor.java:1067)
   [junit4]   2>         at java.util.concurrent.ThreadPoolExecutor.runWorker(ThreadPoolExecutor.java:1127)
   [junit4]   2>         at java.util.concurrent.ThreadPoolExecutor$Worker.run(ThreadPoolExecutor.java:617)
   [junit4]   2>         at java.lang.Thread.run(Thread.java:745)
   [junit4]   2> NOTE: test params are: codec=Asserting(Lucene62): {}, docValues:{}, maxPointsInLeafNode=596, maxMBSortInHeap=5.645001541765163, sim=ClassicSimilarity, locale=en-MT, timezone=Europe/Warsaw
   [junit4]   2> NOTE: Mac OS X 10.11.6 x86_64/Oracle Corporation 1.8.0_102 (64-bit)/cpus=3,threads=2,free=161091616,total=533200896
   [junit4]   2> NOTE: All tests run in this JVM: [XmlUpdateRequestHandlerTest, ChaosMonkeyNothingIsSafeTest, TestSearchPerf, TestDistribIDF, SliceStateTest, TestDownShardTolerantSearch, HdfsSyncSliceTest, TestSolrFieldCacheMBean, TestXIncludeConfig, DocValuesMissingTest, TestDocumentBuilder, DistributedFacetPivotLongTailTest, CoreAdminCreateDiscoverTest, TestHashPartitioner, CoreMergeIndexesAdminHandlerTest, TestCollectionAPI, TestConfig, TestCoreContainer, SolrIndexConfigTest, SolrRequestParserTest, HdfsBasicDistributedZkTest, TestAuthorizationFramework, TestDocSet, TestObjectReleaseTracker, HdfsDirectoryFactoryTest, SpatialHeatmapFacetsTest, HdfsDirectoryTest, TestFieldCacheReopen, TestSchemaSimilarityResource, URLClassifyProcessorTest, UUIDFieldTest, TestStressLucene, DOMUtilTest, TestSubQueryTransformer, CleanupOldIndexTest, TestArbitraryIndexDir, TestSSLRandomization, TestSolrXml, TestSolrConfigHandler, CdcrUpdateLogTest, TestLuceneMatchVersion, TestDocBasedVersionConstraints, CursorPagingTest, TestSurroundQueryParser, DistributedDebugComponentTest, CreateCollectionCleanupTest, ExternalFileFieldSortTest, DistributedFacetExistsSmallTest, SolrCLIZkUtilsTest, HLLUtilTest, CloudMLTQParserTest, TestLeaderInitiatedRecoveryThread, StatelessScriptUpdateProcessorFactoryTest, TestRecoveryHdfs, RecoveryZkTest, ClassificationUpdateProcessorFactoryTest, SecurityConfHandlerTest, TestHighlightDedupGrouping, HdfsWriteToMultipleCollectionsTest, DistributedVersionInfoTest, TestBulkSchemaAPI, TestMiniSolrCloudClusterSSL, TestSweetSpotSimilarityFactory, TestAnalyzedSuggestions, TestPhraseSuggestions, BigEndianAscendingWordDeserializerTest, SoftAutoCommitTest, TestDistributedSearch, SSLMigrationTest, RegexBoostProcessorTest, CircularListTest, TestGraphTermsQParserPlugin, SuggesterFSTTest, CachingDirectoryFactoryTest, TestExactStatsCache, TestExpandComponent, OverseerCollectionConfigSetProcessorTest, SampleTest, TestFileDictionaryLookup, JsonLoaderTest, AssignTest, TestGroupingSearch, TestOrdValues, TestFaceting, TestScoreJoinQPScore, HardAutoCommitTest, TestTolerantSearch, HdfsNNFailoverTest, SolrXmlInZkTest, FastVectorHighlighterTest, TestSolrCloudWithKerberosAlt, HdfsRecoveryZkTest, TestReloadAndDeleteDocs, TestMergePolicyConfig, TestCloudSchemaless, ChangedSchemaMergeTest, TestUpdate, TestManagedStopFilterFactory, TestTrackingShardHandlerFactory, TestSearcherReuse, TestFieldCollectionResource, TestSolrQueryParserResource, TestHdfsUpdateLog, RecoveryAfterSoftCommitTest, BadComponentTest, TestTolerantUpdateProcessorCloud, IndexSchemaTest, DocumentAnalysisRequestHandlerTest, AnalysisAfterCoreReloadTest, TestLegacyFieldCache, TestRuleBasedAuthorizationPlugin, ZkControllerTest, SortSpecParsingTest, ParsingFieldUpdateProcessorsTest, AddSchemaFieldsUpdateProcessorFactoryTest, TestBackupRepositoryFactory, VMParamsZkACLAndCredentialsProvidersTest, TestWordDelimiterFilterFactory, TestConfigSetsAPIExclusivity, ReturnFieldsTest, PreAnalyzedFieldTest, BitVectorTest, TestCloudDeleteByQuery, TestStressReorder, SolrCoreTest, TestCursorMarkWithoutUniqueKey, DistributedFacetPivotSmallTest, AsyncMigrateRouteKeyTest, ShardRoutingTest, DistributedQueryComponentCustomSortTest, SchemaVersionSpecificBehaviorTest, HighlighterTest, TestJmxMonitoredMap, DeleteShardTest, TestManagedResourceStorage, RestartWhileUpdatingTest, TestNonDefinedSimilarityFactory, CdcrBootstrapTest, TestSizeLimitedDistributedMap, TestReplicationHandlerBackup, CurrencyFieldXmlFileTest, UnloadDistributedZkTest, AlternateDirectoryTest, TestFieldCacheVsDocValues, OverseerTaskQueueTest, TestJsonFacets, OutOfBoxZkACLAndCredentialsProvidersTest, SOLR749Test, TestSchemaManager, TestUseDocValuesAsStored2, TestHighFrequencyDictionaryFactory, MigrateRouteKeyTest, BasicDistributedZkTest, ChaosMonkeySafeLeaderTest, CollectionsAPIDistributedZkTest, SyncSliceTest, FullSolrCloudDistribCmdsTest, TestReplicationHandler, TestRandomDVFaceting, ZkCLITest, SimpleFacetsTest, SolrCmdDistributorTest, QueryElevationComponentTest, PeerSyncTest, TestSort, TestLazyCores, TestIndexSearcher, SimplePostToolTest, SignatureUpdateProcessorFactoryTest, TestExtendedDismaxParser, SpellCheckCollatorTest, TestFoldingMultitermQuery, DocValuesTest, SolrInfoMBeanTest, IndexBasedSpellCheckerTest, StandardRequestHandlerTest, DirectSolrSpellCheckerTest, TestQueryTypes, TestOmitPositions, RequestHandlersTest, PathHierarchyTokenizerFactoryTest, MoreLikeThisHandlerTest, SolrPluginUtilsTest, TestCollationField, JSONWriterTest, BinaryUpdateRequestHandlerTest, TestPartialUpdateDeduplication, PingRequestHandlerTest, ResponseLogComponentTest, TestElisionMultitermQuery, TestPostingsSolrHighlighter, TestCodecSupport, TestIBSimilarityFactory, TestFastOutputStream, TestFastLRUCache, RAMDirectoryFactoryTest, TestUtils, SystemInfoHandlerTest, FileUtilsTest, TestRTGBase, SolrTestCaseJ4Test, TestDistributedMissingSort, TestEmbeddedSolrServerConstructors, ActionThrottleTest, AsyncCallRequestStatusResponseTest, CollectionReloadTest, CollectionsAPIAsyncDistributedZkTest, CollectionsAPISolrJTest, DeleteNodeTest, DistribJoinFromCollectionTest, HttpPartitionTest, OverseerModifyCollectionTest, OverseerStatusTest, PeerSyncReplicationTest, RollingRestartTest, SharedFSAutoReplicaFailoverUtilsTest, TestAuthenticationFramework, TestCloudInspectUtil, TestCloudPivotFacet, TestCloudPseudoReturnFields, TestConfigSetsAPI, TestCryptoKeys, TestDistribDocBasedVersion, TestExclusionRuleCollectionAccess, TestHdfsCloudBackupRestore, TestLockTree, TestMiniSolrCloudClusterBase, TestRandomFlRTGCloud, TestRebalanceLeaders, TestShortCircuitedRequests, TestStressLiveNodes, HdfsBasicDistributedZk2Test, HdfsChaosMonkeySafeLeaderTest, HdfsCollectionsAPIDistributedZkTest, HdfsTlogReplayBufferedWhileIndexingTest, StressHdfsTest, TestClusterStateMutator, ZkStateReaderTest, RuleEngineTest, BlobRepositoryCloudTest, DirectoryFactoryTest, QueryResultKeyTest, TestConfigOverlay, TestConfigSetImmutable, TestImplicitCoreProperties, TestInitParams, TestShardHandlerFactory, TestSolrDynamicMBean, TestConfigReload, TestSolrConfigHandlerCloud]
   [junit4]   2> NOTE: reproduce with: ant test  -Dtestcase=TestSolrConfigHandlerCloud -Dtests.seed=5035DE0607C64413 -Dtests.slow=true -Dtests.locale=en-MT -Dtests.timezone=Europe/Warsaw -Dtests.asserts=true -Dtests.file.encoding=UTF-8
   [junit4] ERROR   0.00s J0 | TestSolrConfigHandlerCloud (suite) <<<
   [junit4]    > Throwable #1: java.lang.AssertionError: ObjectTracker found 5 object(s) that were not released!!! [MockDirectoryWrapper, MockDirectoryWrapper, MockDirectoryWrapper, SolrCore, MDCAwareThreadPoolExecutor]
   [junit4]    > 	at __randomizedtesting.SeedInfo.seed([5035DE0607C64413]:0)
   [junit4]    > 	at org.apache.solr.SolrTestCaseJ4.teardownTestCases(SolrTestCaseJ4.java:257)
   [junit4]    > 	at java.lang.Thread.run(Thread.java:745)Throwable #2: com.carrotsearch.randomizedtesting.ThreadLeakError: 1 thread leaked from SUITE scope at org.apache.solr.handler.TestSolrConfigHandlerCloud: 
   [junit4]    >    1) Thread[id=50734, name=searcherExecutor-12010-thread-1, state=WAITING, group=TGRP-TestSolrConfigHandlerCloud]
   [junit4]    >         at sun.misc.Unsafe.park(Native Method)
   [junit4]    >         at java.util.concurrent.locks.LockSupport.park(LockSupport.java:175)
   [junit4]    >         at java.util.concurrent.locks.AbstractQueuedSynchronizer$ConditionObject.await(AbstractQueuedSynchronizer.java:2039)
   [junit4]    >         at java.util.concurrent.LinkedBlockingQueue.take(LinkedBlockingQueue.java:442)
   [junit4]    >         at java.util.concurrent.ThreadPoolExecutor.getTask(ThreadPoolExecutor.java:1067)
   [junit4]    >         at java.util.concurrent.ThreadPoolExecutor.runWorker(ThreadPoolExecutor.java:1127)
   [junit4]    >         at java.util.concurrent.ThreadPoolExecutor$Worker.run(ThreadPoolExecutor.java:617)
   [junit4]    >         at java.lang.Thread.run(Thread.java:745)
   [junit4]    > 	at __randomizedtesting.SeedInfo.seed([5035DE0607C64413]:0)Throwable #3: com.carrotsearch.randomizedtesting.ThreadLeakError: There are still zombie threads that couldn't be terminated:
   [junit4]    >    1) Thread[id=50734, name=searcherExecutor-12010-thread-1, state=WAITING, group=TGRP-TestSolrConfigHandlerCloud]
   [junit4]    >         at sun.misc.Unsafe.park(Native Method)
   [junit4]    >         at java.util.concurrent.locks.LockSupport.park(LockSupport.java:175)
   [junit4]    >         at java.util.concurrent.locks.AbstractQueuedSynchronizer$ConditionObject.await(AbstractQueuedSynchronizer.java:2039)
   [junit4]    >         at java.util.concurrent.LinkedBlockingQueue.take(LinkedBlockingQueue.java:442)
   [junit4]    >         at java.util.concurrent.ThreadPoolExecutor.getTask(ThreadPoolExecutor.java:1067)
   [junit4]    >         at java.util.concurrent.ThreadPoolExecutor.runWorker(ThreadPoolExecutor.java:1127)
   [junit4]    >         at java.util.concurrent.ThreadPoolExecutor$Worker.run(ThreadPoolExecutor.java:617)
   [junit4]    >         at java.lang.Thread.run(Thread.java:745)
   [junit4]    > 	at __randomizedtesting.SeedInfo.seed([5035DE0607C64413]:0)
   [junit4] Completed [570/633 (1!)] on J0 in 195.22s, 1 test, 1 failure, 2 errors <<< FAILURES!

[...truncated 60333 lines...]