You are viewing a plain text version of this content. The canonical link for it is here.
Posted to dev@lucene.apache.org by Policeman Jenkins Server <je...@thetaphi.de> on 2016/08/31 11:46:43 UTC

[JENKINS-EA] Lucene-Solr-6.x-Linux (32bit/jdk-9-ea+132) - Build # 1636 - Unstable!

Build: http://jenkins.thetaphi.de/job/Lucene-Solr-6.x-Linux/1636/
Java: 32bit/jdk-9-ea+132 -server -XX:+UseParallelGC

2 tests failed.
FAILED:  org.apache.solr.update.AutoCommitTest.testCommitWithin

Error Message:
Exception during query

Stack Trace:
java.lang.RuntimeException: Exception during query
	at __randomizedtesting.SeedInfo.seed([FE526F9BCE2766B7:448000E34D0988A2]:0)
	at org.apache.solr.SolrTestCaseJ4.assertQ(SolrTestCaseJ4.java:783)
	at org.apache.solr.update.AutoCommitTest.testCommitWithin(AutoCommitTest.java:344)
	at jdk.internal.reflect.NativeMethodAccessorImpl.invoke0(java.base@9-ea/Native Method)
	at jdk.internal.reflect.NativeMethodAccessorImpl.invoke(java.base@9-ea/NativeMethodAccessorImpl.java:62)
	at jdk.internal.reflect.DelegatingMethodAccessorImpl.invoke(java.base@9-ea/DelegatingMethodAccessorImpl.java:43)
	at java.lang.reflect.Method.invoke(java.base@9-ea/Method.java:535)
	at com.carrotsearch.randomizedtesting.RandomizedRunner.invoke(RandomizedRunner.java:1764)
	at com.carrotsearch.randomizedtesting.RandomizedRunner$8.evaluate(RandomizedRunner.java:871)
	at com.carrotsearch.randomizedtesting.RandomizedRunner$9.evaluate(RandomizedRunner.java:907)
	at com.carrotsearch.randomizedtesting.RandomizedRunner$10.evaluate(RandomizedRunner.java:921)
	at com.carrotsearch.randomizedtesting.rules.SystemPropertiesRestoreRule$1.evaluate(SystemPropertiesRestoreRule.java:57)
	at org.apache.lucene.util.TestRuleSetupTeardownChained$1.evaluate(TestRuleSetupTeardownChained.java:49)
	at org.apache.lucene.util.AbstractBeforeAfterRule$1.evaluate(AbstractBeforeAfterRule.java:45)
	at org.apache.lucene.util.TestRuleThreadAndTestName$1.evaluate(TestRuleThreadAndTestName.java:48)
	at org.apache.lucene.util.TestRuleIgnoreAfterMaxFailures$1.evaluate(TestRuleIgnoreAfterMaxFailures.java:64)
	at org.apache.lucene.util.TestRuleMarkFailure$1.evaluate(TestRuleMarkFailure.java:47)
	at com.carrotsearch.randomizedtesting.rules.StatementAdapter.evaluate(StatementAdapter.java:36)
	at com.carrotsearch.randomizedtesting.ThreadLeakControl$StatementRunner.run(ThreadLeakControl.java:367)
	at com.carrotsearch.randomizedtesting.ThreadLeakControl.forkTimeoutingTask(ThreadLeakControl.java:809)
	at com.carrotsearch.randomizedtesting.ThreadLeakControl$3.evaluate(ThreadLeakControl.java:460)
	at com.carrotsearch.randomizedtesting.RandomizedRunner.runSingleTest(RandomizedRunner.java:880)
	at com.carrotsearch.randomizedtesting.RandomizedRunner$5.evaluate(RandomizedRunner.java:781)
	at com.carrotsearch.randomizedtesting.RandomizedRunner$6.evaluate(RandomizedRunner.java:816)
	at com.carrotsearch.randomizedtesting.RandomizedRunner$7.evaluate(RandomizedRunner.java:827)
	at com.carrotsearch.randomizedtesting.rules.StatementAdapter.evaluate(StatementAdapter.java:36)
	at com.carrotsearch.randomizedtesting.rules.SystemPropertiesRestoreRule$1.evaluate(SystemPropertiesRestoreRule.java:57)
	at org.apache.lucene.util.AbstractBeforeAfterRule$1.evaluate(AbstractBeforeAfterRule.java:45)
	at com.carrotsearch.randomizedtesting.rules.StatementAdapter.evaluate(StatementAdapter.java:36)
	at org.apache.lucene.util.TestRuleStoreClassName$1.evaluate(TestRuleStoreClassName.java:41)
	at com.carrotsearch.randomizedtesting.rules.NoShadowingOrOverridesOnMethodsRule$1.evaluate(NoShadowingOrOverridesOnMethodsRule.java:40)
	at com.carrotsearch.randomizedtesting.rules.NoShadowingOrOverridesOnMethodsRule$1.evaluate(NoShadowingOrOverridesOnMethodsRule.java:40)
	at com.carrotsearch.randomizedtesting.rules.StatementAdapter.evaluate(StatementAdapter.java:36)
	at com.carrotsearch.randomizedtesting.rules.StatementAdapter.evaluate(StatementAdapter.java:36)
	at com.carrotsearch.randomizedtesting.rules.StatementAdapter.evaluate(StatementAdapter.java:36)
	at org.apache.lucene.util.TestRuleAssertionsRequired$1.evaluate(TestRuleAssertionsRequired.java:53)
	at org.apache.lucene.util.TestRuleMarkFailure$1.evaluate(TestRuleMarkFailure.java:47)
	at org.apache.lucene.util.TestRuleIgnoreAfterMaxFailures$1.evaluate(TestRuleIgnoreAfterMaxFailures.java:64)
	at org.apache.lucene.util.TestRuleIgnoreTestSuites$1.evaluate(TestRuleIgnoreTestSuites.java:54)
	at com.carrotsearch.randomizedtesting.rules.StatementAdapter.evaluate(StatementAdapter.java:36)
	at com.carrotsearch.randomizedtesting.ThreadLeakControl$StatementRunner.run(ThreadLeakControl.java:367)
	at java.lang.Thread.run(java.base@9-ea/Thread.java:843)
Caused by: java.lang.RuntimeException: REQUEST FAILED: xpath=//result[@numFound=0]
	xml response was: <?xml version="1.0" encoding="UTF-8"?>
<response>
<lst name="responseHeader"><int name="status">0</int><int name="QTime">0</int></lst><result name="response" numFound="1" start="0"><doc><int name="id">500</int><arr name="range_facet_l"><long>500</long></arr><arr name="range_facet_l_dv"><long>500</long></arr><arr name="range_facet_i_dv"><int>500</int></arr><long name="_version_">1544177819416788992</long><arr name="multiDefault"><str>muLti-Default</str></arr><int name="intDefault">42</int><date name="timestamp">2016-08-31T11:25:26.342Z</date></doc></result>
</response>

	request was:q=id:500&qt=standard&start=0&rows=20&version=2.2
	at org.apache.solr.SolrTestCaseJ4.assertQ(SolrTestCaseJ4.java:776)
	... 40 more


FAILED:  org.apache.solr.update.AutoCommitTest.testMaxTime

Error Message:
expected:<2> but was:<3>

Stack Trace:
java.lang.AssertionError: expected:<2> but was:<3>
	at __randomizedtesting.SeedInfo.seed([FE526F9BCE2766B7:64A6127950BDFA8B]:0)
	at org.junit.Assert.fail(Assert.java:93)
	at org.junit.Assert.failNotEquals(Assert.java:647)
	at org.junit.Assert.assertEquals(Assert.java:128)
	at org.junit.Assert.assertEquals(Assert.java:472)
	at org.junit.Assert.assertEquals(Assert.java:456)
	at org.apache.solr.update.AutoCommitTest.testMaxTime(AutoCommitTest.java:256)
	at jdk.internal.reflect.NativeMethodAccessorImpl.invoke0(java.base@9-ea/Native Method)
	at jdk.internal.reflect.NativeMethodAccessorImpl.invoke(java.base@9-ea/NativeMethodAccessorImpl.java:62)
	at jdk.internal.reflect.DelegatingMethodAccessorImpl.invoke(java.base@9-ea/DelegatingMethodAccessorImpl.java:43)
	at java.lang.reflect.Method.invoke(java.base@9-ea/Method.java:535)
	at com.carrotsearch.randomizedtesting.RandomizedRunner.invoke(RandomizedRunner.java:1764)
	at com.carrotsearch.randomizedtesting.RandomizedRunner$8.evaluate(RandomizedRunner.java:871)
	at com.carrotsearch.randomizedtesting.RandomizedRunner$9.evaluate(RandomizedRunner.java:907)
	at com.carrotsearch.randomizedtesting.RandomizedRunner$10.evaluate(RandomizedRunner.java:921)
	at com.carrotsearch.randomizedtesting.rules.SystemPropertiesRestoreRule$1.evaluate(SystemPropertiesRestoreRule.java:57)
	at org.apache.lucene.util.TestRuleSetupTeardownChained$1.evaluate(TestRuleSetupTeardownChained.java:49)
	at org.apache.lucene.util.AbstractBeforeAfterRule$1.evaluate(AbstractBeforeAfterRule.java:45)
	at org.apache.lucene.util.TestRuleThreadAndTestName$1.evaluate(TestRuleThreadAndTestName.java:48)
	at org.apache.lucene.util.TestRuleIgnoreAfterMaxFailures$1.evaluate(TestRuleIgnoreAfterMaxFailures.java:64)
	at org.apache.lucene.util.TestRuleMarkFailure$1.evaluate(TestRuleMarkFailure.java:47)
	at com.carrotsearch.randomizedtesting.rules.StatementAdapter.evaluate(StatementAdapter.java:36)
	at com.carrotsearch.randomizedtesting.ThreadLeakControl$StatementRunner.run(ThreadLeakControl.java:367)
	at com.carrotsearch.randomizedtesting.ThreadLeakControl.forkTimeoutingTask(ThreadLeakControl.java:809)
	at com.carrotsearch.randomizedtesting.ThreadLeakControl$3.evaluate(ThreadLeakControl.java:460)
	at com.carrotsearch.randomizedtesting.RandomizedRunner.runSingleTest(RandomizedRunner.java:880)
	at com.carrotsearch.randomizedtesting.RandomizedRunner$5.evaluate(RandomizedRunner.java:781)
	at com.carrotsearch.randomizedtesting.RandomizedRunner$6.evaluate(RandomizedRunner.java:816)
	at com.carrotsearch.randomizedtesting.RandomizedRunner$7.evaluate(RandomizedRunner.java:827)
	at com.carrotsearch.randomizedtesting.rules.StatementAdapter.evaluate(StatementAdapter.java:36)
	at com.carrotsearch.randomizedtesting.rules.SystemPropertiesRestoreRule$1.evaluate(SystemPropertiesRestoreRule.java:57)
	at org.apache.lucene.util.AbstractBeforeAfterRule$1.evaluate(AbstractBeforeAfterRule.java:45)
	at com.carrotsearch.randomizedtesting.rules.StatementAdapter.evaluate(StatementAdapter.java:36)
	at org.apache.lucene.util.TestRuleStoreClassName$1.evaluate(TestRuleStoreClassName.java:41)
	at com.carrotsearch.randomizedtesting.rules.NoShadowingOrOverridesOnMethodsRule$1.evaluate(NoShadowingOrOverridesOnMethodsRule.java:40)
	at com.carrotsearch.randomizedtesting.rules.NoShadowingOrOverridesOnMethodsRule$1.evaluate(NoShadowingOrOverridesOnMethodsRule.java:40)
	at com.carrotsearch.randomizedtesting.rules.StatementAdapter.evaluate(StatementAdapter.java:36)
	at com.carrotsearch.randomizedtesting.rules.StatementAdapter.evaluate(StatementAdapter.java:36)
	at com.carrotsearch.randomizedtesting.rules.StatementAdapter.evaluate(StatementAdapter.java:36)
	at org.apache.lucene.util.TestRuleAssertionsRequired$1.evaluate(TestRuleAssertionsRequired.java:53)
	at org.apache.lucene.util.TestRuleMarkFailure$1.evaluate(TestRuleMarkFailure.java:47)
	at org.apache.lucene.util.TestRuleIgnoreAfterMaxFailures$1.evaluate(TestRuleIgnoreAfterMaxFailures.java:64)
	at org.apache.lucene.util.TestRuleIgnoreTestSuites$1.evaluate(TestRuleIgnoreTestSuites.java:54)
	at com.carrotsearch.randomizedtesting.rules.StatementAdapter.evaluate(StatementAdapter.java:36)
	at com.carrotsearch.randomizedtesting.ThreadLeakControl$StatementRunner.run(ThreadLeakControl.java:367)
	at java.lang.Thread.run(java.base@9-ea/Thread.java:843)




Build Log:
[...truncated 11629 lines...]
   [junit4] Suite: org.apache.solr.update.AutoCommitTest
   [junit4]   2> Creating dataDir: /home/jenkins/workspace/Lucene-Solr-6.x-Linux/solr/build/solr-core/test/J0/temp/solr.update.AutoCommitTest_FE526F9BCE2766B7-001/init-core-data-001
   [junit4]   2> 1207853 INFO  (SUITE-AutoCommitTest-seed#[FE526F9BCE2766B7]-worker) [    ] o.a.s.SolrTestCaseJ4 Randomized ssl (true) and clientAuth (false) via: @org.apache.solr.util.RandomizeSSL(reason="", ssl=0.0/0.0, value=0.0/0.0, clientAuth=0.0/0.0)
   [junit4]   2> 1207854 INFO  (SUITE-AutoCommitTest-seed#[FE526F9BCE2766B7]-worker) [    ] o.a.s.SolrTestCaseJ4 ####initCore
   [junit4]   2> 1207854 INFO  (SUITE-AutoCommitTest-seed#[FE526F9BCE2766B7]-worker) [    ] o.a.s.c.SolrResourceLoader new SolrResourceLoader for directory: '/home/jenkins/workspace/Lucene-Solr-6.x-Linux/solr/core/src/test-files/solr/collection1'
   [junit4]   2> 1207854 INFO  (SUITE-AutoCommitTest-seed#[FE526F9BCE2766B7]-worker) [    ] o.a.s.c.SolrResourceLoader JNDI not configured for solr (NoInitialContextEx)
   [junit4]   2> 1207854 INFO  (SUITE-AutoCommitTest-seed#[FE526F9BCE2766B7]-worker) [    ] o.a.s.c.SolrResourceLoader using system property solr.solr.home: /home/jenkins/workspace/Lucene-Solr-6.x-Linux/solr/core/src/test-files/solr
   [junit4]   2> 1207854 INFO  (SUITE-AutoCommitTest-seed#[FE526F9BCE2766B7]-worker) [    ] o.a.s.c.SolrResourceLoader Adding 'file:/home/jenkins/workspace/Lucene-Solr-6.x-Linux/solr/core/src/test-files/solr/collection1/lib/classes/' to classloader
   [junit4]   2> 1207854 INFO  (SUITE-AutoCommitTest-seed#[FE526F9BCE2766B7]-worker) [    ] o.a.s.c.SolrResourceLoader Adding 'file:/home/jenkins/workspace/Lucene-Solr-6.x-Linux/solr/core/src/test-files/solr/collection1/lib/README' to classloader
   [junit4]   2> 1207869 INFO  (SUITE-AutoCommitTest-seed#[FE526F9BCE2766B7]-worker) [    ] o.a.s.c.SolrConfig current version of requestparams : -1
   [junit4]   2> 1207875 WARN  (SUITE-AutoCommitTest-seed#[FE526F9BCE2766B7]-worker) [    ] o.a.s.c.Config Beginning with Solr 5.5, <mergePolicy> is deprecated, use <mergePolicyFactory> instead.
   [junit4]   2> 1207876 INFO  (SUITE-AutoCommitTest-seed#[FE526F9BCE2766B7]-worker) [    ] o.a.s.c.SolrConfig Using Lucene MatchVersion: 6.3.0
   [junit4]   2> 1207890 INFO  (SUITE-AutoCommitTest-seed#[FE526F9BCE2766B7]-worker) [    ] o.a.s.c.SolrConfig Loaded SolrConfig: solrconfig.xml
   [junit4]   2> 1207893 INFO  (SUITE-AutoCommitTest-seed#[FE526F9BCE2766B7]-worker) [    ] o.a.s.s.IndexSchema [null] Schema name=test
   [junit4]   2> 1207953 INFO  (SUITE-AutoCommitTest-seed#[FE526F9BCE2766B7]-worker) [    ] o.a.s.s.OpenExchangeRatesOrgProvider Initialized with rates=open-exchange-rates.json, refreshInterval=1440.
   [junit4]   2> 1207957 INFO  (SUITE-AutoCommitTest-seed#[FE526F9BCE2766B7]-worker) [    ] o.a.s.s.IndexSchema default search field in schema is text
   [junit4]   2> 1207958 INFO  (SUITE-AutoCommitTest-seed#[FE526F9BCE2766B7]-worker) [    ] o.a.s.s.IndexSchema unique key field: id
   [junit4]   2> 1207961 INFO  (SUITE-AutoCommitTest-seed#[FE526F9BCE2766B7]-worker) [    ] o.a.s.s.FileExchangeRateProvider Reloading exchange rates from file currency.xml
   [junit4]   2> 1207962 INFO  (SUITE-AutoCommitTest-seed#[FE526F9BCE2766B7]-worker) [    ] o.a.s.s.FileExchangeRateProvider Reloading exchange rates from file currency.xml
   [junit4]   2> 1207963 INFO  (SUITE-AutoCommitTest-seed#[FE526F9BCE2766B7]-worker) [    ] o.a.s.s.OpenExchangeRatesOrgProvider Reloading exchange rates from open-exchange-rates.json
   [junit4]   2> 1207963 INFO  (SUITE-AutoCommitTest-seed#[FE526F9BCE2766B7]-worker) [    ] o.a.s.s.OpenExchangeRatesOrgProvider Reloading exchange rates from open-exchange-rates.json
   [junit4]   2> 1207963 INFO  (SUITE-AutoCommitTest-seed#[FE526F9BCE2766B7]-worker) [    ] o.a.s.c.SolrResourceLoader JNDI not configured for solr (NoInitialContextEx)
   [junit4]   2> 1207963 INFO  (SUITE-AutoCommitTest-seed#[FE526F9BCE2766B7]-worker) [    ] o.a.s.c.SolrResourceLoader using system property solr.solr.home: /home/jenkins/workspace/Lucene-Solr-6.x-Linux/solr/core/src/test-files/solr
   [junit4]   2> 1207963 INFO  (SUITE-AutoCommitTest-seed#[FE526F9BCE2766B7]-worker) [    ] o.a.s.c.SolrResourceLoader new SolrResourceLoader for directory: '/home/jenkins/workspace/Lucene-Solr-6.x-Linux/solr/core/src/test-files/solr'
   [junit4]   2> 1207963 INFO  (SUITE-AutoCommitTest-seed#[FE526F9BCE2766B7]-worker) [    ] o.a.s.c.SolrResourceLoader JNDI not configured for solr (NoInitialContextEx)
   [junit4]   2> 1207963 INFO  (SUITE-AutoCommitTest-seed#[FE526F9BCE2766B7]-worker) [    ] o.a.s.c.SolrResourceLoader using system property solr.solr.home: /home/jenkins/workspace/Lucene-Solr-6.x-Linux/solr/core/src/test-files/solr
   [junit4]   2> 1207963 INFO  (SUITE-AutoCommitTest-seed#[FE526F9BCE2766B7]-worker) [    ] o.a.s.c.CoreContainer New CoreContainer 15610052
   [junit4]   2> 1207963 INFO  (SUITE-AutoCommitTest-seed#[FE526F9BCE2766B7]-worker) [    ] o.a.s.c.CoreContainer Loading cores into CoreContainer [instanceDir=/home/jenkins/workspace/Lucene-Solr-6.x-Linux/solr/core/src/test-files/solr]
   [junit4]   2> 1207963 WARN  (SUITE-AutoCommitTest-seed#[FE526F9BCE2766B7]-worker) [    ] o.a.s.c.CoreContainer Couldn't add files from /home/jenkins/workspace/Lucene-Solr-6.x-Linux/solr/core/src/test-files/solr/lib to classpath: /home/jenkins/workspace/Lucene-Solr-6.x-Linux/solr/core/src/test-files/solr/lib
   [junit4]   2> 1207964 INFO  (SUITE-AutoCommitTest-seed#[FE526F9BCE2766B7]-worker) [    ] o.a.s.h.c.HttpShardHandlerFactory created with socketTimeout : 600000,connTimeout : 60000,maxConnectionsPerHost : 20,maxConnections : 10000,corePoolSize : 0,maximumPoolSize : 2147483647,maxThreadIdleTime : 5,sizeOfQueue : -1,fairnessPolicy : false,useRetries : false,connectionsEvictorSleepDelay : 5000,maxConnectionIdleTime : 40000,
   [junit4]   2> 1207966 INFO  (SUITE-AutoCommitTest-seed#[FE526F9BCE2766B7]-worker) [    ] o.a.s.u.UpdateShardHandler Creating UpdateShardHandler HTTP client with params: socketTimeout=30000&connTimeout=30000&retry=true
   [junit4]   2> 1207967 INFO  (SUITE-AutoCommitTest-seed#[FE526F9BCE2766B7]-worker) [    ] o.a.s.l.LogWatcher SLF4J impl is org.slf4j.impl.Log4jLoggerFactory
   [junit4]   2> 1207967 INFO  (SUITE-AutoCommitTest-seed#[FE526F9BCE2766B7]-worker) [    ] o.a.s.l.LogWatcher Registering Log Listener [Log4j (org.slf4j.impl.Log4jLoggerFactory)]
   [junit4]   2> 1207967 INFO  (SUITE-AutoCommitTest-seed#[FE526F9BCE2766B7]-worker) [    ] o.a.s.c.CoreContainer Security conf doesn't exist. Skipping setup for authorization module.
   [junit4]   2> 1207967 INFO  (SUITE-AutoCommitTest-seed#[FE526F9BCE2766B7]-worker) [    ] o.a.s.c.CoreContainer No authentication plugin used.
   [junit4]   2> 1207968 INFO  (SUITE-AutoCommitTest-seed#[FE526F9BCE2766B7]-worker) [    ] o.a.s.c.CoreDescriptor Created CoreDescriptor: {schema=schema.xml, dataDir=/home/jenkins/workspace/Lucene-Solr-6.x-Linux/solr/build/solr-core/test/J0/temp/solr.update.AutoCommitTest_FE526F9BCE2766B7-001/init-core-data-001, collection=collection1, loadOnStartup=true, transient=false, name=collection1, shard=shard1, config=solrconfig.xml, configSetProperties=configsetprops.json}
   [junit4]   2> 1207968 INFO  (coreLoadExecutor-5313-thread-1) [    ] o.a.s.c.SolrResourceLoader new SolrResourceLoader for directory: '/home/jenkins/workspace/Lucene-Solr-6.x-Linux/solr/core/src/test-files/solr/collection1'
   [junit4]   2> 1207968 INFO  (coreLoadExecutor-5313-thread-1) [    ] o.a.s.c.SolrResourceLoader JNDI not configured for solr (NoInitialContextEx)
   [junit4]   2> 1207968 INFO  (coreLoadExecutor-5313-thread-1) [    ] o.a.s.c.SolrResourceLoader using system property solr.solr.home: /home/jenkins/workspace/Lucene-Solr-6.x-Linux/solr/core/src/test-files/solr
   [junit4]   2> 1207969 INFO  (coreLoadExecutor-5313-thread-1) [    ] o.a.s.c.SolrResourceLoader Adding 'file:/home/jenkins/workspace/Lucene-Solr-6.x-Linux/solr/core/src/test-files/solr/collection1/lib/classes/' to classloader
   [junit4]   2> 1207969 INFO  (coreLoadExecutor-5313-thread-1) [    ] o.a.s.c.SolrResourceLoader Adding 'file:/home/jenkins/workspace/Lucene-Solr-6.x-Linux/solr/core/src/test-files/solr/collection1/lib/README' to classloader
   [junit4]   2> 1207981 INFO  (coreLoadExecutor-5313-thread-1) [    ] o.a.s.c.SolrConfig current version of requestparams : -1
   [junit4]   2> 1207986 WARN  (coreLoadExecutor-5313-thread-1) [    ] o.a.s.c.Config Beginning with Solr 5.5, <mergePolicy> is deprecated, use <mergePolicyFactory> instead.
   [junit4]   2> 1207987 INFO  (coreLoadExecutor-5313-thread-1) [    ] o.a.s.c.SolrConfig Using Lucene MatchVersion: 6.3.0
   [junit4]   2> 1208003 INFO  (coreLoadExecutor-5313-thread-1) [    ] o.a.s.c.SolrConfig Loaded SolrConfig: solrconfig.xml
   [junit4]   2> 1208006 INFO  (coreLoadExecutor-5313-thread-1) [    ] o.a.s.s.IndexSchema [collection1] Schema name=test
   [junit4]   2> 1208062 INFO  (coreLoadExecutor-5313-thread-1) [    ] o.a.s.s.OpenExchangeRatesOrgProvider Initialized with rates=open-exchange-rates.json, refreshInterval=1440.
   [junit4]   2> 1208065 INFO  (coreLoadExecutor-5313-thread-1) [    ] o.a.s.s.IndexSchema default search field in schema is text
   [junit4]   2> 1208067 INFO  (coreLoadExecutor-5313-thread-1) [    ] o.a.s.s.IndexSchema unique key field: id
   [junit4]   2> 1208069 INFO  (coreLoadExecutor-5313-thread-1) [    ] o.a.s.s.FileExchangeRateProvider Reloading exchange rates from file currency.xml
   [junit4]   2> 1208070 INFO  (coreLoadExecutor-5313-thread-1) [    ] o.a.s.s.FileExchangeRateProvider Reloading exchange rates from file currency.xml
   [junit4]   2> 1208071 INFO  (coreLoadExecutor-5313-thread-1) [    ] o.a.s.s.OpenExchangeRatesOrgProvider Reloading exchange rates from open-exchange-rates.json
   [junit4]   2> 1208071 INFO  (coreLoadExecutor-5313-thread-1) [    ] o.a.s.s.OpenExchangeRatesOrgProvider Reloading exchange rates from open-exchange-rates.json
   [junit4]   2> 1208072 INFO  (coreLoadExecutor-5313-thread-1) [    ] o.a.s.c.ConfigSetProperties Did not find ConfigSet properties, assuming default properties: Can't find resource 'configsetprops.json' in classpath or '/home/jenkins/workspace/Lucene-Solr-6.x-Linux/solr/core/src/test-files/solr/collection1'
   [junit4]   2> 1208072 INFO  (coreLoadExecutor-5313-thread-1) [    ] o.a.s.c.CoreContainer Creating SolrCore 'collection1' using configuration from instancedir /home/jenkins/workspace/Lucene-Solr-6.x-Linux/solr/core/src/test-files/solr/collection1
   [junit4]   2> 1208072 INFO  (coreLoadExecutor-5313-thread-1) [    ] o.a.s.c.SolrCore org.apache.solr.core.MockDirectoryFactory
   [junit4]   2> 1208072 INFO  (coreLoadExecutor-5313-thread-1) [    ] o.a.s.c.SolrCore [[collection1] ] Opening new SolrCore at [/home/jenkins/workspace/Lucene-Solr-6.x-Linux/solr/core/src/test-files/solr/collection1], dataDir=[/home/jenkins/workspace/Lucene-Solr-6.x-Linux/solr/build/solr-core/test/J0/temp/solr.update.AutoCommitTest_FE526F9BCE2766B7-001/init-core-data-001/]
   [junit4]   2> 1208072 INFO  (coreLoadExecutor-5313-thread-1) [    ] o.a.s.c.JmxMonitoredMap JMX monitoring is enabled. Adding Solr mbeans to JMX Server: com.sun.jmx.mbeanserver.JmxMBeanServer@ad0f0b
   [junit4]   2> 1208073 INFO  (coreLoadExecutor-5313-thread-1) [    ] o.a.s.c.CachingDirectoryFactory return new directory for /home/jenkins/workspace/Lucene-Solr-6.x-Linux/solr/build/solr-core/test/J0/temp/solr.update.AutoCommitTest_FE526F9BCE2766B7-001/init-core-data-001/snapshot_metadata
   [junit4]   2> 1208073 INFO  (coreLoadExecutor-5313-thread-1) [    ] o.a.s.c.s.SolrSnapshotMetaDataManager Loading from snapshot metadata file...
   [junit4]   2> 1208073 INFO  (coreLoadExecutor-5313-thread-1) [    ] o.a.s.c.CachingDirectoryFactory return new directory for /home/jenkins/workspace/Lucene-Solr-6.x-Linux/solr/build/solr-core/test/J0/temp/solr.update.AutoCommitTest_FE526F9BCE2766B7-001/init-core-data-001
   [junit4]   2> 1208073 INFO  (coreLoadExecutor-5313-thread-1) [    ] o.a.s.c.SolrCore New index directory detected: old=null new=/home/jenkins/workspace/Lucene-Solr-6.x-Linux/solr/build/solr-core/test/J0/temp/solr.update.AutoCommitTest_FE526F9BCE2766B7-001/init-core-data-001/index/
   [junit4]   2> 1208073 WARN  (coreLoadExecutor-5313-thread-1) [    ] o.a.s.c.SolrCore [collection1] Solr index directory '/home/jenkins/workspace/Lucene-Solr-6.x-Linux/solr/build/solr-core/test/J0/temp/solr.update.AutoCommitTest_FE526F9BCE2766B7-001/init-core-data-001/index' doesn't exist. Creating new index...
   [junit4]   2> 1208073 INFO  (coreLoadExecutor-5313-thread-1) [    ] o.a.s.c.CachingDirectoryFactory return new directory for /home/jenkins/workspace/Lucene-Solr-6.x-Linux/solr/build/solr-core/test/J0/temp/solr.update.AutoCommitTest_FE526F9BCE2766B7-001/init-core-data-001/index
   [junit4]   2> 1208073 INFO  (coreLoadExecutor-5313-thread-1) [    ] o.a.s.u.RandomMergePolicy RandomMergePolicy wrapping class org.apache.lucene.index.TieredMergePolicy: [TieredMergePolicy: maxMergeAtOnce=24, maxMergeAtOnceExplicit=49, maxMergedSegmentMB=13.564453125, floorSegmentMB=1.001953125, forceMergeDeletesPctAllowed=16.415457892544882, segmentsPerTier=48.0, maxCFSSegmentSizeMB=8.796093022207999E12, noCFSRatio=0.6399643032435262
   [junit4]   2> 1208073 INFO  (coreLoadExecutor-5313-thread-1) [    ] o.a.s.c.SolrDeletionPolicy SolrDeletionPolicy.onCommit: commits: num=1
   [junit4]   2> 	commit{dir=MockDirectoryWrapper(RAMDirectory@ba4e61 lockFactory=org.apache.lucene.store.SingleInstanceLockFactory@1fa2305),segFN=segments_1,generation=1}
   [junit4]   2> 1208073 INFO  (coreLoadExecutor-5313-thread-1) [    ] o.a.s.c.SolrDeletionPolicy newest commit generation = 1
   [junit4]   2> 1208075 INFO  (OldIndexDirectoryCleanupThreadForCore-collection1) [    ] o.a.s.c.SolrCore Looking for old index directories to cleanup for core collection1 in /home/jenkins/workspace/Lucene-Solr-6.x-Linux/solr/build/solr-core/test/J0/temp/solr.update.AutoCommitTest_FE526F9BCE2766B7-001/init-core-data-001/
   [junit4]   2> 1208077 INFO  (coreLoadExecutor-5313-thread-1) [    ] o.a.s.u.p.UpdateRequestProcessorChain creating updateRequestProcessorChain "dedupe"
   [junit4]   2> 1208077 INFO  (coreLoadExecutor-5313-thread-1) [    ] o.a.s.u.p.UpdateRequestProcessorChain inserting DistributedUpdateProcessorFactory into updateRequestProcessorChain "dedupe"
   [junit4]   2> 1208077 INFO  (coreLoadExecutor-5313-thread-1) [    ] o.a.s.u.p.UpdateRequestProcessorChain creating updateRequestProcessorChain "dedupe-allfields"
   [junit4]   2> 1208077 INFO  (coreLoadExecutor-5313-thread-1) [    ] o.a.s.u.p.UpdateRequestProcessorChain inserting DistributedUpdateProcessorFactory into updateRequestProcessorChain "dedupe-allfields"
   [junit4]   2> 1208077 INFO  (coreLoadExecutor-5313-thread-1) [    ] o.a.s.u.p.UpdateRequestProcessorChain creating updateRequestProcessorChain "stored_sig"
   [junit4]   2> 1208077 INFO  (coreLoadExecutor-5313-thread-1) [    ] o.a.s.u.p.UpdateRequestProcessorChain inserting DistributedUpdateProcessorFactory into updateRequestProcessorChain "stored_sig"
   [junit4]   2> 1208077 INFO  (coreLoadExecutor-5313-thread-1) [    ] o.a.s.u.p.UpdateRequestProcessorChain creating updateRequestProcessorChain "uniq-fields"
   [junit4]   2> 1208077 INFO  (coreLoadExecutor-5313-thread-1) [    ] o.a.s.u.p.UpdateRequestProcessorChain inserting DistributedUpdateProcessorFactory into updateRequestProcessorChain "uniq-fields"
   [junit4]   2> 1208077 INFO  (coreLoadExecutor-5313-thread-1) [    ] o.a.s.u.p.UpdateRequestProcessorChain creating updateRequestProcessorChain "distrib-dup-test-chain-explicit"
   [junit4]   2> 1208077 INFO  (coreLoadExecutor-5313-thread-1) [    ] o.a.s.u.p.UpdateRequestProcessorChain creating updateRequestProcessorChain "distrib-dup-test-chain-implicit"
   [junit4]   2> 1208077 INFO  (coreLoadExecutor-5313-thread-1) [    ] o.a.s.u.p.UpdateRequestProcessorChain inserting DistributedUpdateProcessorFactory into updateRequestProcessorChain "distrib-dup-test-chain-implicit"
   [junit4]   2> 1208077 INFO  (coreLoadExecutor-5313-thread-1) [    ] o.a.s.c.SolrCore no updateRequestProcessorChain defined as default, creating implicit default
   [junit4]   2> 1208078 INFO  (coreLoadExecutor-5313-thread-1) [    ] o.a.s.h.l.XMLLoader xsltCacheLifetimeSeconds=60
   [junit4]   2> 1208079 INFO  (coreLoadExecutor-5313-thread-1) [    ] o.a.s.h.l.XMLLoader xsltCacheLifetimeSeconds=60
   [junit4]   2> 1208079 INFO  (coreLoadExecutor-5313-thread-1) [    ] o.a.s.h.l.XMLLoader xsltCacheLifetimeSeconds=60
   [junit4]   2> 1208080 INFO  (coreLoadExecutor-5313-thread-1) [    ] o.a.s.h.l.XMLLoader xsltCacheLifetimeSeconds=60
   [junit4]   2> 1208082 INFO  (coreLoadExecutor-5313-thread-1) [    ] o.a.s.c.PluginBag requestHandler : 'lazy' created with startup=lazy 
   [junit4]   2> 1208082 INFO  (coreLoadExecutor-5313-thread-1) [    ] o.a.s.c.RequestHandlers Registered paths: /admin/mbeans,standard,spellCheckCompRH,lazy,/update/json/docs,/admin/luke,/export,spellCheckWithWordbreak_Direct,tvrh,/get,/admin/properties,/update/json,mltrh,/admin/threads,/search-facet-def,/update/csv,/sql,/graph,/search-facet-invariants,/admin/segments,spellCheckCompRH1,/mlt,/admin/system,/replication,dismax,defaults,/config,/stream,/schema,/admin/plugins,/admin/logging,spellCheckWithWordbreak,mock,/admin/ping,/update,/admin/file,/terms,spellCheckCompRH_Direct,/debug/dump
   [junit4]   2> 1208082 INFO  (coreLoadExecutor-5313-thread-1) [    ] o.a.s.c.SolrCore Using default statsCache cache: org.apache.solr.search.stats.LocalStatsCache
   [junit4]   2> 1208083 INFO  (coreLoadExecutor-5313-thread-1) [    ] o.a.s.u.UpdateHandler Using UpdateLog implementation: org.apache.solr.update.UpdateLog
   [junit4]   2> 1208083 INFO  (coreLoadExecutor-5313-thread-1) [    ] o.a.s.u.UpdateLog Initializing UpdateLog: dataDir= defaultSyncLevel=FLUSH numRecordsToKeep=100 maxNumLogsToKeep=10 numVersionBuckets=65536
   [junit4]   2> 1208083 INFO  (coreLoadExecutor-5313-thread-1) [    ] o.a.s.u.CommitTracker Hard AutoCommit: disabled
   [junit4]   2> 1208083 INFO  (coreLoadExecutor-5313-thread-1) [    ] o.a.s.u.CommitTracker Soft AutoCommit: disabled
   [junit4]   2> 1208083 INFO  (coreLoadExecutor-5313-thread-1) [    ] o.a.s.u.RandomMergePolicy RandomMergePolicy wrapping class org.apache.lucene.index.LogDocMergePolicy: [LogDocMergePolicy: minMergeSize=1000, mergeFactor=5, maxMergeSize=9223372036854775807, maxMergeSizeForForcedMerge=9223372036854775807, calibrateSizeByDeletes=false, maxMergeDocs=2147483647, maxCFSSegmentSizeMB=8.796093022207999E12, noCFSRatio=1.0]
   [junit4]   2> 1208084 INFO  (coreLoadExecutor-5313-thread-1) [    ] o.a.s.c.SolrDeletionPolicy SolrDeletionPolicy.onInit: commits: num=1
   [junit4]   2> 	commit{dir=MockDirectoryWrapper(RAMDirectory@ba4e61 lockFactory=org.apache.lucene.store.SingleInstanceLockFactory@1fa2305),segFN=segments_1,generation=1}
   [junit4]   2> 1208084 INFO  (coreLoadExecutor-5313-thread-1) [    ] o.a.s.c.SolrDeletionPolicy newest commit generation = 1
   [junit4]   2> 1208084 INFO  (coreLoadExecutor-5313-thread-1) [    ] o.a.s.s.SolrIndexSearcher Opening [Searcher@95c3ff[collection1] main]
   [junit4]   2> 1208084 INFO  (coreLoadExecutor-5313-thread-1) [    ] o.a.s.r.RestManager Initializing RestManager with initArgs: {storageIO=org.apache.solr.rest.ManagedResourceStorage$InMemoryStorageIO}
   [junit4]   2> 1208084 INFO  (coreLoadExecutor-5313-thread-1) [    ] o.a.s.r.ManagedResourceStorage Reading _rest_managed.json using InMemoryStorage
   [junit4]   2> 1208084 INFO  (coreLoadExecutor-5313-thread-1) [    ] o.a.s.r.RestManager Initializing 0 registered ManagedResources
   [junit4]   2> 1208084 INFO  (coreLoadExecutor-5313-thread-1) [    ] o.a.s.h.c.SpellCheckComponent Initializing spell checkers
   [junit4]   2> 1208135 INFO  (coreLoadExecutor-5313-thread-1) [    ] o.a.s.s.DirectSolrSpellChecker init: {name=direct,classname=DirectSolrSpellChecker,field=lowerfilt,minQueryLength=3}
   [junit4]   2> 1208258 INFO  (coreLoadExecutor-5313-thread-1) [    ] o.a.s.h.ReplicationHandler Commits will be reserved for  10000
   [junit4]   2> 1208259 INFO  (searcherExecutor-5314-thread-1) [    ] o.a.s.h.c.SpellCheckComponent Loading spell index for spellchecker: default
   [junit4]   2> 1208259 INFO  (searcherExecutor-5314-thread-1) [    ] o.a.s.h.c.SpellCheckComponent Loading spell index for spellchecker: direct
   [junit4]   2> 1208259 INFO  (searcherExecutor-5314-thread-1) [    ] o.a.s.h.c.SpellCheckComponent Loading spell index for spellchecker: wordbreak
   [junit4]   2> 1208259 INFO  (searcherExecutor-5314-thread-1) [    ] o.a.s.h.c.SpellCheckComponent Loading spell index for spellchecker: multipleFields
   [junit4]   2> 1208259 INFO  (searcherExecutor-5314-thread-1) [    ] o.a.s.h.c.SpellCheckComponent Loading spell index for spellchecker: jarowinkler
   [junit4]   2> 1208259 INFO  (coreLoadExecutor-5313-thread-1) [    ] o.a.s.u.UpdateLog Looking up max value of version field to seed version buckets
   [junit4]   2> 1208259 INFO  (coreLoadExecutor-5313-thread-1) [    ] o.a.s.u.VersionInfo Refreshing highest value of _version_ for 65536 version buckets from index
   [junit4]   2> 1208259 INFO  (searcherExecutor-5314-thread-1) [    ] o.a.s.h.c.SpellCheckComponent Loading spell index for spellchecker: external
   [junit4]   2> 1208259 INFO  (coreLoadExecutor-5313-thread-1) [    ] o.a.s.u.VersionInfo No terms found for _version_, cannot seed version bucket highest value from index
   [junit4]   2> 1208259 INFO  (coreLoadExecutor-5313-thread-1) [    ] o.a.s.u.UpdateLog Could not find max version in index or recent updates, using new clock 1544177813740847104
   [junit4]   2> 1208259 INFO  (searcherExecutor-5314-thread-1) [    ] o.a.s.h.c.SpellCheckComponent Loading spell index for spellchecker: freq
   [junit4]   2> 1208260 INFO  (searcherExecutor-5314-thread-1) [    ] o.a.s.h.c.SpellCheckComponent Loading spell index for spellchecker: fqcn
   [junit4]   2> 1208260 INFO  (searcherExecutor-5314-thread-1) [    ] o.a.s.h.c.SpellCheckComponent Loading spell index for spellchecker: perDict
   [junit4]   2> 1208260 INFO  (searcherExecutor-5314-thread-1) [    ] o.a.s.c.SolrCore [collection1] Registered new searcher Searcher@95c3ff[collection1] main{ExitableDirectoryReader(UninvertingDirectoryReader())}
   [junit4]   2> 1208261 INFO  (coreLoadExecutor-5313-thread-1) [    ] o.a.s.u.UpdateLog Took 1.0ms to seed version buckets with highest version 1544177813740847104
   [junit4]   2> 1208261 INFO  (coreLoadExecutor-5313-thread-1) [    ] o.a.s.c.CoreContainer registering core: collection1
   [junit4]   2> 1208262 INFO  (SUITE-AutoCommitTest-seed#[FE526F9BCE2766B7]-worker) [    ] o.a.s.SolrTestCaseJ4 ####initCore end
   [junit4]   2> 1208264 INFO  (TEST-AutoCommitTest.testCommitWithin-seed#[FE526F9BCE2766B7]) [    ] o.a.s.SolrTestCaseJ4 ###Starting testCommitWithin
   [junit4]   2> 1208265 INFO  (TEST-AutoCommitTest.testCommitWithin-seed#[FE526F9BCE2766B7]) [    ] o.a.s.u.p.LogUpdateProcessorFactory [collection1]  webapp=null path=null params={}{deleteByQuery=*:* (-1544177813746089984)} 0 1
   [junit4]   2> 1208267 INFO  (TEST-AutoCommitTest.testCommitWithin-seed#[FE526F9BCE2766B7]) [    ] o.a.s.c.SolrResourceLoader new SolrResourceLoader for directory: '/home/jenkins/workspace/Lucene-Solr-6.x-Linux/solr/core/src/test-files/solr/collection1'
   [junit4]   2> 1208268 INFO  (TEST-AutoCommitTest.testCommitWithin-seed#[FE526F9BCE2766B7]) [    ] o.a.s.c.SolrResourceLoader JNDI not configured for solr (NoInitialContextEx)
   [junit4]   2> 1208268 INFO  (TEST-AutoCommitTest.testCommitWithin-seed#[FE526F9BCE2766B7]) [    ] o.a.s.c.SolrResourceLoader using system property solr.solr.home: /home/jenkins/workspace/Lucene-Solr-6.x-Linux/solr/core/src/test-files/solr
   [junit4]   2> 1208268 INFO  (TEST-AutoCommitTest.testCommitWithin-seed#[FE526F9BCE2766B7]) [    ] o.a.s.c.SolrResourceLoader Adding 'file:/home/jenkins/workspace/Lucene-Solr-6.x-Linux/solr/core/src/test-files/solr/collection1/lib/classes/' to classloader
   [junit4]   2> 1208268 INFO  (TEST-AutoCommitTest.testCommitWithin-seed#[FE526F9BCE2766B7]) [    ] o.a.s.c.SolrResourceLoader Adding 'file:/home/jenkins/workspace/Lucene-Solr-6.x-Linux/solr/core/src/test-files/solr/collection1/lib/README' to classloader
   [junit4]   2> 1208287 INFO  (TEST-AutoCommitTest.testCommitWithin-seed#[FE526F9BCE2766B7]) [    ] o.a.s.c.SolrConfig current version of requestparams : -1
   [junit4]   2> 1208295 WARN  (TEST-AutoCommitTest.testCommitWithin-seed#[FE526F9BCE2766B7]) [    ] o.a.s.c.Config Beginning with Solr 5.5, <mergePolicy> is deprecated, use <mergePolicyFactory> instead.
   [junit4]   2> 1208297 INFO  (TEST-AutoCommitTest.testCommitWithin-seed#[FE526F9BCE2766B7]) [    ] o.a.s.c.SolrConfig Using Lucene MatchVersion: 6.3.0
   [junit4]   2> 1208312 INFO  (TEST-AutoCommitTest.testCommitWithin-seed#[FE526F9BCE2766B7]) [    ] o.a.s.c.SolrConfig Loaded SolrConfig: solrconfig.xml
   [junit4]   2> 1208316 INFO  (TEST-AutoCommitTest.testCommitWithin-seed#[FE526F9BCE2766B7]) [    ] o.a.s.s.IndexSchema [collection1] Schema name=test
   [junit4]   2> 1208373 INFO  (TEST-AutoCommitTest.testCommitWithin-seed#[FE526F9BCE2766B7]) [    ] o.a.s.s.OpenExchangeRatesOrgProvider Initialized with rates=open-exchange-rates.json, refreshInterval=1440.
   [junit4]   2> 1208377 INFO  (TEST-AutoCommitTest.testCommitWithin-seed#[FE526F9BCE2766B7]) [    ] o.a.s.s.IndexSchema default search field in schema is text
   [junit4]   2> 1208378 INFO  (TEST-AutoCommitTest.testCommitWithin-seed#[FE526F9BCE2766B7]) [    ] o.a.s.s.IndexSchema unique key field: id
   [junit4]   2> 1208381 INFO  (TEST-AutoCommitTest.testCommitWithin-seed#[FE526F9BCE2766B7]) [    ] o.a.s.s.FileExchangeRateProvider Reloading exchange rates from file currency.xml
   [junit4]   2> 1208382 INFO  (TEST-AutoCommitTest.testCommitWithin-seed#[FE526F9BCE2766B7]) [    ] o.a.s.s.FileExchangeRateProvider Reloading exchange rates from file currency.xml
   [junit4]   2> 1208382 INFO  (TEST-AutoCommitTest.testCommitWithin-seed#[FE526F9BCE2766B7]) [    ] o.a.s.s.OpenExchangeRatesOrgProvider Reloading exchange rates from open-exchange-rates.json
   [junit4]   2> 1208383 INFO  (TEST-AutoCommitTest.testCommitWithin-seed#[FE526F9BCE2766B7]) [    ] o.a.s.s.OpenExchangeRatesOrgProvider Reloading exchange rates from open-exchange-rates.json
   [junit4]   2> 1208384 INFO  (TEST-AutoCommitTest.testCommitWithin-seed#[FE526F9BCE2766B7]) [    ] o.a.s.c.ConfigSetProperties Did not find ConfigSet properties, assuming default properties: Can't find resource 'configsetprops.json' in classpath or '/home/jenkins/workspace/Lucene-Solr-6.x-Linux/solr/core/src/test-files/solr/collection1'
   [junit4]   2> 1208384 INFO  (TEST-AutoCommitTest.testCommitWithin-seed#[FE526F9BCE2766B7]) [    ] o.a.s.c.CoreContainer Reloading SolrCore 'collection1' using configuration from instancedir /home/jenkins/workspace/Lucene-Solr-6.x-Linux/solr/core/src/test-files/solr/collection1
   [junit4]   2> 1208384 INFO  (TEST-AutoCommitTest.testCommitWithin-seed#[FE526F9BCE2766B7]) [    ] o.a.s.c.SolrCore [[collection1] ] Opening new SolrCore at [/home/jenkins/workspace/Lucene-Solr-6.x-Linux/solr/core/src/test-files/solr/collection1], dataDir=[/home/jenkins/workspace/Lucene-Solr-6.x-Linux/solr/build/solr-core/test/J0/temp/solr.update.AutoCommitTest_FE526F9BCE2766B7-001/init-core-data-001/]
   [junit4]   2> 1208384 INFO  (TEST-AutoCommitTest.testCommitWithin-seed#[FE526F9BCE2766B7]) [    ] o.a.s.c.JmxMonitoredMap JMX monitoring is enabled. Adding Solr mbeans to JMX Server: com.sun.jmx.mbeanserver.JmxMBeanServer@ad0f0b
   [junit4]   2> 1208384 INFO  (TEST-AutoCommitTest.testCommitWithin-seed#[FE526F9BCE2766B7]) [    ] o.a.s.c.s.SolrSnapshotMetaDataManager Loading from snapshot metadata file...
   [junit4]   2> 1208384 INFO  (TEST-AutoCommitTest.testCommitWithin-seed#[FE526F9BCE2766B7]) [    ] o.a.s.c.SolrCore New index directory detected: old=null new=/home/jenkins/workspace/Lucene-Solr-6.x-Linux/solr/build/solr-core/test/J0/temp/solr.update.AutoCommitTest_FE526F9BCE2766B7-001/init-core-data-001/index/
   [junit4]   2> 1208385 INFO  (OldIndexDirectoryCleanupThreadForCore-collection1) [    ] o.a.s.c.SolrCore Looking for old index directories to cleanup for core collection1 in /home/jenkins/workspace/Lucene-Solr-6.x-Linux/solr/build/solr-core/test/J0/temp/solr.update.AutoCommitTest_FE526F9BCE2766B7-001/init-core-data-001/
   [junit4]   2> 1208388 INFO  (TEST-AutoCommitTest.testCommitWithin-seed#[FE526F9BCE2766B7]) [    ] o.a.s.u.p.UpdateRequestProcessorChain creating updateRequestProcessorChain "dedupe"
   [junit4]   2> 1208388 INFO  (TEST-AutoCommitTest.testCommitWithin-seed#[FE526F9BCE2766B7]) [    ] o.a.s.u.p.UpdateRequestProcessorChain inserting DistributedUpdateProcessorFactory into updateRequestProcessorChain "dedupe"
   [junit4]   2> 1208388 INFO  (TEST-AutoCommitTest.testCommitWithin-seed#[FE526F9BCE2766B7]) [    ] o.a.s.u.p.UpdateRequestProcessorChain creating updateRequestProcessorChain "dedupe-allfields"
   [junit4]   2> 1208388 INFO  (TEST-AutoCommitTest.testCommitWithin-seed#[FE526F9BCE2766B7]) [    ] o.a.s.u.p.UpdateRequestProcessorChain inserting DistributedUpdateProcessorFactory into updateRequestProcessorChain "dedupe-allfields"
   [junit4]   2> 1208388 INFO  (TEST-AutoCommitTest.testCommitWithin-seed#[FE526F9BCE2766B7]) [    ] o.a.s.u.p.UpdateRequestProcessorChain creating updateRequestProcessorChain "stored_sig"
   [junit4]   2> 1208388 INFO  (TEST-AutoCommitTest.testCommitWithin-seed#[FE526F9BCE2766B7]) [    ] o.a.s.u.p.UpdateRequestProcessorChain inserting DistributedUpdateProcessorFactory into updateRequestProcessorChain "stored_sig"
   [junit4]   2> 1208388 INFO  (TEST-AutoCommitTest.testCommitWithin-seed#[FE526F9BCE2766B7]) [    ] o.a.s.u.p.UpdateRequestProcessorChain creating updateRequestProcessorChain "uniq-fields"
   [junit4]   2> 1208388 INFO  (TEST-AutoCommitTest.testCommitWithin-seed#[FE526F9BCE2766B7]) [    ] o.a.s.u.p.UpdateRequestProcessorChain inserting DistributedUpdateProcessorFactory into updateRequestProcessorChain "uniq-fields"
   [junit4]   2> 1208388 INFO  (TEST-AutoCommitTest.testCommitWithin-seed#[FE526F9BCE2766B7]) [    ] o.a.s.u.p.UpdateRequestProcessorChain creating updateRequestProcessorChain "distrib-dup-test-chain-explicit"
   [junit4]   2> 1208389 INFO  (TEST-AutoCommitTest.testCommitWithin-seed#[FE526F9BCE2766B7]) [    ] o.a.s.u.p.UpdateRequestProcessorChain creating updateRequestProcessorChain "distrib-dup-test-chain-implicit"
   [junit4]   2> 1208389 INFO  (TEST-AutoCommitTest.testCommitWithin-seed#[FE526F9BCE2766B7]) [    ] o.a.s.u.p.UpdateRequestProcessorChain inserting DistributedUpdateProcessorFactory into updateRequestProcessorChain "distrib-dup-test-chain-implicit"
   [junit4]   2> 1208389 INFO  (TEST-AutoCommitTest.testCommitWithin-seed#[FE526F9BCE2766B7]) [    ] o.a.s.c.SolrCore no updateRequestProcessorChain defined as default, creating implicit default
   [junit4]   2> 1208390 INFO  (TEST-AutoCommitTest.testCommitWithin-seed#[FE526F9BCE2766B7]) [    ] o.a.s.h.l.XMLLoader xsltCacheLifetimeSeconds=60
   [junit4]   2> 1208391 INFO  (TEST-AutoCommitTest.testCommitWithin-seed#[FE526F9BCE2766B7]) [    ] o.a.s.h.l.XMLLoader xsltCacheLifetimeSeconds=60
   [junit4]   2> 1208391 INFO  (TEST-AutoCommitTest.testCommitWithin-seed#[FE526F9BCE2766B7]) [    ] o.a.s.h.l.XMLLoader xsltCacheLifetimeSeconds=60
   [junit4]   2> 1208392 INFO  (TEST-AutoCommitTest.testCommitWithin-seed#[FE526F9BCE2766B7]) [    ] o.a.s.h.l.XMLLoader xsltCacheLifetimeSeconds=60
   [junit4]   2> 1208395 INFO  (TEST-AutoCommitTest.testCommitWithin-seed#[FE526F9BCE2766B7]) [    ] o.a.s.c.PluginBag requestHandler : 'lazy' created with startup=lazy 
   [junit4]   2> 1208396 INFO  (TEST-AutoCommitTest.testCommitWithin-seed#[FE526F9BCE2766B7]) [    ] o.a.s.c.RequestHandlers Registered paths: /admin/mbeans,standard,spellCheckCompRH,lazy,/update/json/docs,/admin/luke,/export,spellCheckWithWordbreak_Direct,tvrh,/get,/admin/properties,/update/json,mltrh,/admin/threads,/search-facet-def,/update/csv,/sql,/graph,/search-facet-invariants,/admin/segments,spellCheckCompRH1,/mlt,/admin/system,/replication,dismax,defaults,/config,/stream,/schema,/admin/plugins,/admin/logging,spellCheckWithWordbreak,mock,/admin/ping,/update,/admin/file,/terms,spellCheckCompRH_Direct,/debug/dump
   [junit4]   2> 1208396 INFO  (TEST-AutoCommitTest.testCommitWithin-seed#[FE526F9BCE2766B7]) [    ] o.a.s.c.SolrCore Using default statsCache cache: org.apache.solr.search.stats.LocalStatsCache
   [junit4]   2> 1208397 INFO  (TEST-AutoCommitTest.testCommitWithin-seed#[FE526F9BCE2766B7]) [    ] o.a.s.u.CommitTracker Hard AutoCommit: disabled
   [junit4]   2> 1208397 INFO  (TEST-AutoCommitTest.testCommitWithin-seed#[FE526F9BCE2766B7]) [    ] o.a.s.u.CommitTracker Soft AutoCommit: disabled
   [junit4]   2> 1208397 INFO  (TEST-AutoCommitTest.testCommitWithin-seed#[FE526F9BCE2766B7]) [    ] o.a.s.s.SolrIndexSearcher Opening [Searcher@186a026[collection1] main]
   [junit4]   2> 1208397 INFO  (TEST-AutoCommitTest.testCommitWithin-seed#[FE526F9BCE2766B7]) [    ] o.a.s.r.RestManager Initializing RestManager with initArgs: {storageIO=org.apache.solr.rest.ManagedResourceStorage$InMemoryStorageIO}
   [junit4]   2> 1208397 INFO  (TEST-AutoCommitTest.testCommitWithin-seed#[FE526F9BCE2766B7]) [    ] o.a.s.r.ManagedResourceStorage Reading _rest_managed.json using InMemoryStorage
   [junit4]   2> 1208397 INFO  (TEST-AutoCommitTest.testCommitWithin-seed#[FE526F9BCE2766B7]) [    ] o.a.s.r.RestManager Initializing 0 registered ManagedResources
   [junit4]   2> 1208397 INFO  (TEST-AutoCommitTest.testCommitWithin-seed#[FE526F9BCE2766B7]) [    ] o.a.s.h.c.SpellCheckComponent Initializing spell checkers
   [junit4]   2> 1208399 INFO  (TEST-AutoCommitTest.testCommitWithin-seed#[FE526F9BCE2766B7]) [    ] o.a.s.s.DirectSolrSpellChecker init: {name=direct,classname=DirectSolrSpellChecker,field=lowerfilt,minQueryLength=3}
   [junit4]   2> 1208400 INFO  (TEST-AutoCommitTest.testCommitWithin-seed#[FE526F9BCE2766B7]) [    ] o.a.s.h.ReplicationHandler Commits will be reserved for  10000
   [junit4]   2> 1208400 INFO  (searcherExecutor-5319-thread-1) [    ] o.a.s.h.c.SpellCheckComponent Loading spell index for spellchecker: default
   [junit4]   2> 1208401 INFO  (searcherExecutor-5319-thread-1) [    ] o.a.s.h.c.SpellCheckComponent Loading spell index for spellchecker: direct
   [junit4]   2> 1208401 INFO  (searcherExecutor-5319-thread-1) [    ] o.a.s.h.c.SpellCheckComponent Loading spell index for spellchecker: wordbreak
   [junit4]   2> 1208401 INFO  (searcherExecutor-5319-thread-1) [    ] o.a.s.h.c.SpellCheckComponent Loading spell index for spellchecker: multipleFields
   [junit4]   2> 1208401 INFO  (searcherExecutor-5319-thread-1) [    ] o.a.s.h.c.SpellCheckComponent Loading spell index for spellchecker: jarowinkler
   [junit4]   2> 1208401 INFO  (searcherExecutor-5319-thread-1) [    ] o.a.s.h.c.SpellCheckComponent Loading spell index for spellchecker: external
   [junit4]   2> 1208401 INFO  (TEST-AutoCommitTest.testCommitWithin-seed#[FE526F9BCE2766B7]) [    ] o.a.s.u.UpdateLog Looking up max value of version field to seed version buckets
   [junit4]   2> 1208401 INFO  (TEST-AutoCommitTest.testCommitWithin-seed#[FE526F9BCE2766B7]) [    ] o.a.s.u.VersionInfo Refreshing highest value of _version_ for 65536 version buckets from index
   [junit4]   2> 1208401 INFO  (searcherExecutor-5319-thread-1) [    ] o.a.s.h.c.SpellCheckComponent Loading spell index for spellchecker: freq
   [junit4]   2> 1208401 INFO  (TEST-AutoCommitTest.testCommitWithin-seed#[FE526F9BCE2766B7]) [    ] o.a.s.u.VersionInfo No terms found for _version_, cannot seed version bucket highest value from index
   [junit4]   2> 1208401 INFO  (searcherExecutor-5319-thread-1) [    ] o.a.s.h.c.SpellCheckComponent Loading spell index for spellchecker: fqcn
   [junit4]   2> 1208401 INFO  (searcherExecutor-5319-thread-1) [    ] o.a.s.h.c.SpellCheckComponent Loading spell index for spellchecker: perDict
   [junit4]   2> 1208402 INFO  (searcherExecutor-5319-thread-1) [    ] o.a.s.c.SolrCore [collection1] Registered new searcher Searcher@186a026[collection1] main{ExitableDirectoryReader(UninvertingDirectoryReader())}
   [junit4]   2> 1208403 INFO  (TEST-AutoCommitTest.testCommitWithin-seed#[FE526F9BCE2766B7]) [    ] o.a.s.u.UpdateLog Took 1.0ms to seed version buckets with highest version 1544177813746089984
   [junit4]   2> 1208403 INFO  (TEST-AutoCommitTest.testCommitWithin-seed#[FE526F9BCE2766B7]) [    ] o.a.s.u.DefaultSolrCoreState Closing old IndexWriter... core=collection1
   [junit4]   2> 1208403 INFO  (TEST-AutoCommitTest.testCommitWithin-seed#[FE526F9BCE2766B7]) [    ] o.a.s.u.RandomMergePolicy RandomMergePolicy wrapping class org.apache.lucene.index.LogByteSizeMergePolicy: [LogByteSizeMergePolicy: minMergeSize=1677721, mergeFactor=27, maxMergeSize=2147483648, maxMergeSizeForForcedMerge=9223372036854775807, calibrateSizeByDeletes=false, maxMergeDocs=2147483647, maxCFSSegmentSizeMB=8.796093022207999E12, noCFSRatio=0.0]
   [junit4]   2> 1208404 INFO  (TEST-AutoCommitTest.testCommitWithin-seed#[FE526F9BCE2766B7]) [    ] o.a.s.c.SolrDeletionPolicy SolrDeletionPolicy.onInit: commits: num=1
   [junit4]   2> 	commit{dir=MockDirectoryWrapper(RAMDirectory@ba4e61 lockFactory=org.apache.lucene.store.SingleInstanceLockFactory@1fa2305),segFN=segments_1,generation=1}
   [junit4]   2> 1208404 INFO  (TEST-AutoCommitTest.testCommitWithin-seed#[FE526F9BCE2766B7]) [    ] o.a.s.c.SolrDeletionPolicy newest commit generation = 1
   [junit4]   2> 1208404 INFO  (TEST-AutoCommitTest.testCommitWithin-seed#[FE526F9BCE2766B7]) [    ] o.a.s.u.DefaultSolrCoreState New IndexWriter is ready to be used.
   [junit4]   2> 1208404 INFO  (TEST-AutoCommitTest.testCommitWithin-seed#[FE526F9BCE2766B7]) [    ] o.a.s.s.SolrIndexSearcher Opening [Searcher@e122a6[collection1] main]
   [junit4]   2> 1208404 INFO  (TEST-AutoCommitTest.testCommitWithin-seed#[FE526F9BCE2766B7]) [    ] o.a.s.c.CoreContainer replacing core: collection1
   [junit4]   2> 1208404 INFO  (TEST-AutoCommitTest.testCommitWithin-seed#[FE526F9BCE2766B7]) [    ] o.a.s.c.SolrCore [collection1]  CLOSING SolrCore org.apache.solr.core.SolrCore@1e16011
   [junit4]   2> 1208404 INFO  (TEST-AutoCommitTest.testCommitWithin-seed#[FE526F9BCE2766B7]) [    ] o.a.s.u.DirectUpdateHandler2 closing DirectUpdateHandler2{commits=0,autocommits=0,soft autocommits=0,optimizes=0,rollbacks=0,expungeDeletes=0,docsPending=0,adds=0,deletesById=0,deletesByQuery=1,errors=0,cumulative_adds=0,cumulative_deletesById=0,cumulative_deletesByQuery=1,cumulative_errors=0,transaction_logs_total_size=0,transaction_logs_total_number=0}
   [junit4]   2> 1208404 INFO  (TEST-AutoCommitTest.testCommitWithin-seed#[FE526F9BCE2766B7]) [    ] o.a.s.c.SolrCore [collection1] Closing main searcher on request.
   [junit4]   2> 1208404 INFO  (searcherExecutor-5319-thread-1) [    ] o.a.s.c.SolrCore [collection1] Registered new searcher Searcher@e122a6[collection1] main{ExitableDirectoryReader(UninvertingDirectoryReader())}
   [junit4]   2> 1208414 INFO  (TEST-AutoCommitTest.testCommitWithin-seed#[FE526F9BCE2766B7]) [    ] o.a.s.u.p.LogUpdateProcessorFactory [collection1] {add=[529 (1544177813901279232)]} 0 2
   [junit4]   2> 1208414 INFO  (TEST-AutoCommitTest.testCommitWithin-seed#[FE526F9BCE2766B7]) [    ] o.a.s.c.S.Request [collection1]  webapp=null path=null params={q=id:529&qt=standard&start=0&rows=20&version=2.2} hits=0 status=0 QTime=0
   [junit4]   2> 1212413 INFO  (commitScheduler-5322-thread-1) [    ] o.a.s.u.DirectUpdateHandler2 start commit{,optimize=false,openSearcher=true,waitSearcher=true,expungeDeletes=false,softCommit=true,prepareCommit=false}
   [junit4]   2> 1212416 INFO  (commitScheduler-5322-thread-1) [    ] o.a.s.s.SolrIndexSearcher Opening [Searcher@732948[collection1] main]
   [junit4]   2> 1212416 INFO  (commitScheduler-5322-thread-1) [    ] o.a.s.u.DirectUpdateHandler2 end_commit_flush
   [junit4]   2> 1212417 INFO  (searcherExecutor-5319-thread-1) [    ] o.a.s.c.SolrCore [collection1] Registered new searcher Searcher@732948[collection1] main{ExitableDirectoryReader(UninvertingDirectoryReader(Uninverting(_0(6.3.0):C1)))}
   [junit4]   2> 1212419 INFO  (TEST-AutoCommitTest.testCommitWithin-seed#[FE526F9BCE2766B7]) [    ] o.a.s.u.p.LogUpdateProcessorFactory [collection1] {add=[530 (1544177818101874688)]} 0 4007
   [junit4]   2> 1212419 INFO  (TEST-AutoCommitTest.testCommitWithin-seed#[FE526F9BCE2766B7]) [    ] o.a.s.c.S.Request [collection1]  webapp=null path=null params={q=id:530&qt=standard&start=0&rows=20&version=2.2} hits=0 status=0 QTime=0
   [junit4]   2> 1212420 INFO  (TEST-AutoCommitTest.testCommitWithin-seed#[FE526F9BCE2766B7]) [    ] o.a.s.u.p.LogUpdateProcessorFactory [collection1] {delete=[529 (-1544177818103971840)]} 0 4008
   [junit4]   2> 1212420 INFO  (TEST-AutoCommitTest.testCommitWithin-seed#[FE526F9BCE2766B7]) [    ] o.a.s.c.S.Request [collection1]  webapp=null path=null params={q=id:529&qt=standard&start=0&rows=20&version=2.2} hits=1 status=0 QTime=0
   [junit4]   2> 1213420 INFO  (commitScheduler-5322-thread-1) [    ] o.a.s.u.DirectUpdateHandler2 start commit{,optimize=false,openSearcher=true,waitSearcher=true,expungeDeletes=false,softCommit=true,prepareCommit=false}
   [junit4]   2> 1213421 INFO  (commitScheduler-5322-thread-1) [    ] o.a.s.s.SolrIndexSearcher Opening [Searcher@88d6ee[collection1] main]
   [junit4]   2> 1213421 INFO  (commitScheduler-5322-thread-1) [    ] o.a.s.u.DirectUpdateHandler2 end_commit_flush
   [junit4]   2> 1213422 INFO  (searcherExecutor-5319-thread-1) [    ] o.a.s.c.SolrCore [collection1] Registered new searcher Searcher@88d6ee[collection1] main{ExitableDirectoryReader(UninvertingDirectoryReader(Uninverting(_1(6.3.0):C1)))}
   [junit4]   2> 1213671 INFO  (TEST-AutoCommitTest.testCommitWithin-seed#[FE526F9BCE2766B7]) [    ] o.a.s.c.S.Request [collection1]  webapp=null path=null params={q=id:529&qt=standard&start=0&rows=20&version=2.2} hits=0 status=0 QTime=0
   [junit4]   2> 1213671 INFO  (TEST-AutoCommitTest.testCommitWithin-seed#[FE526F9BCE2766B7]) [    ] o.a.s.c.S.Request [collection1]  webapp=null path=null params={q=id:530&qt=standard&start=0&rows=20&version=2.2} hits=1 status=0 QTime=0
   [junit4]   2> 1215672 INFO  (commitScheduler-5322-thread-1) [    ] o.a.s.u.DirectUpdateHandler2 start commit{,optimize=false,openSearcher=true,waitSearcher=true,expungeDeletes=false,softCommit=true,prepareCommit=false}
   [junit4]   2> 1215673 INFO  (commitScheduler-5322-thread-1) [    ] o.a.s.s.SolrIndexSearcher Opening [Searcher@153fcd2[collection1] main]
   [junit4]   2> 1215673 INFO  (commitScheduler-5322-thread-1) [    ] o.a.s.u.DirectUpdateHandler2 end_commit_flush
   [junit4]   2> 1215674 INFO  (searcherExecutor-5319-thread-1) [    ] o.a.s.c.SolrCore [collection1] Registered new searcher Searcher@153fcd2[collection1] main{ExitableDirectoryReader(UninvertingDirectoryReader(Uninverting(_1(6.3.0):C1) Uninverting(_2(6.3.0):C1)))}
   [junit4]   2> 1216212 INFO  (TEST-AutoCommitTest.testCommitWithin-seed#[FE526F9BCE2766B7]) [    ] o.a.s.u.p.LogUpdateProcessorFactory [collection1] {add=[500 (1544177819416788992)]} 0 7800
   [junit4]   2> 1216213 INFO  (TEST-AutoCommitTest.testCommitWithin-seed#[FE526F9BCE2766B7]) [    ] o.a.s.u.p.LogUpdateProcessorFactory [collection1] {add=[500 (1544177822080172032)]} 0 7801
   [junit4]   2> 1216213 INFO  (TEST-AutoCommitTest.testCommitWithin-seed#[FE526F9BCE2766B7]) [    ] o.a.s.u.p.LogUpdateProcessorFactory [collection1] {add=[500 (1544177822081220608)]} 0 7801
   [junit4]   2> 1216213 INFO  (TEST-AutoCommitTest.testCommitWithin-seed#[FE526F9BCE2766B7]) [    ] o.a.s.u.p.LogUpdateProcessorFactory [collection1] {add=[500 (1544177822081220609)]} 0 7801
   [junit4]   2> 1216213 INFO  (TEST-AutoCommitTest.testCommitWithin-seed#[FE526F9BCE2766B7]) [    ] o.a.s.u.p.LogUpdateProcessorFactory [collection1] {add=[500 (1544177822081220610)]} 0 7802
   [junit4]   2> 1216214 INFO  (TEST-AutoCommitTest.testCommitWithin-seed#[FE526F9BCE2766B7]) [    ] o.a.s.u.p.LogUpdateProcessorFactory [collection1] {add=[500 (1544177822082269184)]} 0 7802
   [junit4]   2> 1216214 INFO  (TEST-AutoCommitTest.testCommitWithin-seed#[FE526F9BCE2766B7]) [    ] o.a.s.u.p.LogUpdateProcessorFactory [collection1] {add=[500 (1544177822082269185)]} 0 7802
   [junit4]   2> 1216214 INFO  (TEST-AutoCommitTest.testCommitWithin-seed#[FE526F9BCE2766B7]) [    ] o.a.s.u.p.LogUpdateProcessorFactory [collection1] {add=[500 (1544177822082269186)]} 0 7802
   [junit4]   2> 1216214 INFO  (TEST-AutoCommitTest.testCommitWithin-seed#[FE526F9BCE2766B7]) [    ] o.a.s.u.p.LogUpdateProcessorFactory [collection1] {add=[500 (1544177822082269187)]} 0 7803
   [junit4]   2> 1216215 INFO  (TEST-AutoCommitTest.testCommitWithin-seed#[FE526F9BCE2766B7]) [    ] o.a.s.u.p.LogUpdateProcessorFactory [collection1] {add=[500 (1544177822083317760)]} 0 7803
   [junit4]   2> 1216215 INFO  (TEST-AutoCommitTest.testCommitWithin-seed#[FE526F9BCE2766B7]) [    ] o.a.s.c.S.Request [collection1]  webapp=null path=null params={q=id:500&qt=standard&start=0&rows=20&version=2.2} hits=1 status=0 QTime=0
   [junit4]   2> 1216215 ERROR (TEST-AutoCommitTest.testCommitWithin-seed#[FE526F9BCE2766B7]) [    ] o.a.s.SolrTestCaseJ4 REQUEST FAILED: xpath=//result[@numFound=0]
   [junit4]   2> 	xml response was: <?xml version="1.0" encoding="UTF-8"?>
   [junit4]   2> <response>
   [junit4]   2> <lst name="responseHeader"><int name="status">0</int><int name="QTime">0</int></lst><result name="response" numFound="1" start="0"><doc><int name="id">500</int><arr name="range_facet_l"><long>500</long></arr><arr name="range_facet_l_dv"><long>500</long></arr><arr name="range_facet_i_dv"><int>500</int></arr><long name="_version_">1544177819416788992</long><arr name="multiDefault"><str>muLti-Default</str></arr><int name="intDefault">42</int><date name="timestamp">2016-08-31T11:25:26.342Z</date></doc></result>
   [junit4]   2> </response>
   [junit4]   2> 
   [junit4]   2> 	request was:q=id:500&qt=standard&start=0&rows=20&version=2.2
   [junit4]   2> 1216216 ERROR (TEST-AutoCommitTest.testCommitWithin-seed#[FE526F9BCE2766B7]) [    ] o.a.s.SolrTestCaseJ4 REQUEST FAILED: q=id:500&qt=standard&start=0&rows=20&version=2.2:java.lang.RuntimeException: REQUEST FAILED: xpath=//result[@numFound=0]
   [junit4]   2> 	xml response was: <?xml version="1.0" encoding="UTF-8"?>
   [junit4]   2> <response>
   [junit4]   2> <lst name="responseHeader"><int name="status">0</int><int name="QTime">0</int></lst><result name="response" numFound="1" start="0"><doc><int name="id">500</int><arr name="range_facet_l"><long>500</long></arr><arr name="range_facet_l_dv"><long>500</long></arr><arr name="range_facet_i_dv"><int>500</int></arr><long name="_version_">1544177819416788992</long><arr name="multiDefault"><str>muLti-Default</str></arr><int name="intDefault">42</int><date name="timestamp">2016-08-31T11:25:26.342Z</date></doc></result>
   [junit4]   2> </response>
   [junit4]   2> 
   [junit4]   2> 	request was:q=id:500&qt=standard&start=0&rows=20&version=2.2
   [junit4]   2> 	at org.apache.solr.SolrTestCaseJ4.assertQ(SolrTestCaseJ4.java:776)
   [junit4]   2> 	at org.apache.solr.update.AutoCommitTest.testCommitWithin(AutoCommitTest.java:344)
   [junit4]   2> 	at jdk.internal.reflect.NativeMethodAccessorImpl.invoke0(java.base@9-ea/Native Method)
   [junit4]   2> 	at jdk.internal.reflect.NativeMethodAccessorImpl.invoke(java.base@9-ea/NativeMethodAccessorImpl.java:62)
   [junit4]   2> 	at jdk.internal.reflect.DelegatingMethodAccessorImpl.invoke(java.base@9-ea/DelegatingMethodAccessorImpl.java:43)
   [junit4]   2> 	at java.lang.reflect.Method.invoke(java.base@9-ea/Method.java:535)
   [junit4]   2> 	at com.carrotsearch.randomizedtesting.RandomizedRunner.invoke(RandomizedRunner.java:1764)
   [junit4]   2> 	at com.carrotsearch.randomizedtesting.RandomizedRunner$8.evaluate(RandomizedRunner.java:871)
   [junit4]   2> 	at com.carrotsearch.randomizedtesting.RandomizedRunner$9.evaluate(RandomizedRunner.java:907)
   [junit4]   2> 	at com.carrotsearch.randomizedtesting.RandomizedRunner$10.evaluate(RandomizedRunner.java:921)
   [junit4]   2> 	at com.carrotsearch.randomizedtesting.rules.SystemPropertiesRestoreRule$1.evaluate(SystemPropertiesRestoreRule.java:57)
   [junit4]   2> 	at org.apache.lucene.util.TestRuleSetupTeardownChained$1.evaluate(TestRuleSetupTeardownChained.java:49)
   [junit4]   2> 	at org.apache.lucene.util.AbstractBeforeAfterRule$1.evaluate(AbstractBeforeAfterRule.java:45)
   [junit4]   2> 	at org.apache.lucene.util.TestRuleThreadAndTestName$1.evaluate(TestRuleThreadAndTestName.java:48)
   [junit4]   2> 	at org.apache.lucene.util.TestRuleIgnoreAfterMaxFailures$1.evaluate(TestRuleIgnoreAfterMaxFailures.java:64)
   [junit4]   2> 	at org.apache.lucene.util.TestRuleMarkFailure$1.evaluate(TestRuleMarkFailure.java:47)
   [junit4]   2> 	at com.carrotsearch.randomizedtesting.rules.StatementAdapter.evaluate(StatementAdapter.java:36)
   [junit4]   2> 	at com.carrotsearch.randomizedtesting.ThreadLeakControl$StatementRunner.run(ThreadLeakControl.java:367)
   [junit4]   2> 	at com.carrotsearch.randomizedtesting.ThreadLeakControl.forkTimeoutingTask(ThreadLeakControl.java:809)
   [junit4]   2> 	at com.carrotsearch.randomizedtesting.ThreadLeakControl$3.evaluate(ThreadLeakControl.java:460)
   [junit4]   2> 	at com.carrotsearch.randomizedtesting.RandomizedRunner.runSingleTest(RandomizedRunner.java:880)
   [junit4]   2> 	at com.carrotsearch.randomizedtesting.RandomizedRunner$5.evaluate(RandomizedRunner.java:781)
   [junit4]   2> 	at com.carrotsearch.randomizedtesting.RandomizedRunner$6.evaluate(RandomizedRunner.java:816)
   [junit4]   2> 	at com.carrotsearch.randomizedtesting.RandomizedRunner$7.evaluate(RandomizedRunner.java:827)
   [junit4]   2> 	at com.carrotsearch.randomizedtesting.rules.StatementAdapter.evaluate(StatementAdapter.java:36)
   [junit4]   2> 	at com.carrotsearch.randomizedtesting.rules.SystemPropertiesRestoreRule$1.evaluate(SystemPropertiesRestoreRule.java:57)
   [junit4]   2> 	at org.apache.lucene.util.AbstractBeforeAfterRule$1.evaluate(AbstractBeforeAfterRule.java:45)
   [junit4]   2> 	at com.carrotsearch.randomizedtesting.rules.StatementAdapter.evaluate(StatementAdapter.java:36)
   [junit4]   2> 	at org.apache.lucene.util.TestRuleStoreClassName$1.evaluate(TestRuleStoreClassName.java:41)
   [junit4]   2> 	at com.carrotsearch.randomizedtesting.rules.NoShadowingOrOverridesOnMethodsRule$1.evaluate(NoShadowingOrOverridesOnMethodsRule.java:40)
   [junit4]   2> 	at com.carrotsearch.randomizedtesting.rules.NoShadowingOrOverridesOnMethodsRule$1.evaluate(NoShadowingOrOverridesOnMethodsRule.java:40)
   [junit4]   2> 	at com.carrotsearch.randomizedtesting.rules.StatementAdapter.evaluate(StatementAdapter.java:36)
   [junit4]   2> 	at com.carrotsearch.randomizedtesting.rules.StatementAdapter.evaluate(StatementAdapter.java:36)
   [junit4]   2> 	at com.carrotsearch.randomizedtesting.rules.StatementAdapter.evaluate(StatementAdapter.java:36)
   [junit4]   2> 	at org.apache.lucene.util.TestRuleAssertionsRequired$1.evaluate(TestRuleAssertionsRequired.java:53)
   [junit4]   2> 	at org.apache.lucene.util.TestRuleMarkFailure$1.evaluate(TestRuleMarkFailure.java:47)
   [junit4]   2> 	at org.apache.lucene.util.TestRuleIgnoreAfterMaxFailures$1.evaluate(TestRuleIgnoreAfterMaxFailures.java:64)
   [junit4]   2> 	at org.apache.lucene.util.TestRuleIgnoreTestSuites$1.evaluate(TestRuleIgnoreTestSuites.java:54)
   [junit4]   2> 	at com.carrotsearch.randomizedtesting.rules.StatementAdapter.evaluate(StatementAdapter.java:36)
   [junit4]   2> 	at com.carrotsearch.randomizedtesting.ThreadLeakControl$StatementRunner.run(ThreadLeakControl.java:367)
   [junit4]   2> 	at java.lang.Thread.run(java.base@9-ea/Thread.java:843)
   [junit4]   2> 
   [junit4]   2> 1216217 INFO  (TEST-AutoCommitTest.testCommitWithin-seed#[FE526F9BCE2766B7]) [    ] o.a.s.SolrTestCaseJ4 ###Ending testCommitWithin
   [junit4]   2> NOTE: reproduce with: ant test  -Dtestcase=AutoCommitTest -Dtests.method=testCommitWithin -Dtests.seed=FE526F9BCE2766B7 -Dtests.multiplier=3 -Dtests.slow=true -Dtests.locale=sbp-TZ -Dtests.timezone=Africa/Blantyre -Dtests.asserts=true -Dtests.file.encoding=UTF-8
   [junit4] ERROR   7.96s J0 | AutoCommitTest.testCommitWithin <<<
   [junit4]    > Throwable #1: java.lang.RuntimeException: Exception during query
   [junit4]    > 	at __randomizedtesting.SeedInfo.seed([FE526F9BCE2766B7:448000E34D0988A2]:0)
   [junit4]    > 	at org.apache.solr.SolrTestCaseJ4.assertQ(SolrTestCaseJ4.java:783)
   [junit4]    > 	at org.apache.solr.update.AutoCommitTest.testCommitWithin(AutoCommitTest.java:344)
   [junit4]    > 	at jdk.internal.reflect.NativeMethodAccessorImpl.invoke0(java.base@9-ea/Native Method)
   [junit4]    > 	at jdk.internal.reflect.NativeMethodAccessorImpl.invoke(java.base@9-ea/NativeMethodAccessorImpl.java:62)
   [junit4]    > 	at jdk.internal.reflect.DelegatingMethodAccessorImpl.invoke(java.base@9-ea/DelegatingMethodAccessorImpl.java:43)
   [junit4]    > 	at java.lang.Thread.run(java.base@9-ea/Thread.java:843)
   [junit4]    > Caused by: java.lang.RuntimeException: REQUEST FAILED: xpath=//result[@numFound=0]
   [junit4]    > 	xml response was: <?xml version="1.0" encoding="UTF-8"?>
   [junit4]    > <response>
   [junit4]    > <lst name="responseHeader"><int name="status">0</int><int name="QTime">0</int></lst><result name="response" numFound="1" start="0"><doc><int name="id">500</int><arr name="range_facet_l"><long>500</long></arr><arr name="range_facet_l_dv"><long>500</long></arr><arr name="range_facet_i_dv"><int>500</int></arr><long name="_version_">1544177819416788992</long><arr name="multiDefault"><str>muLti-Default</str></arr><int name="intDefault">42</int><date name="timestamp">2016-08-31T11:25:26.342Z</date></doc></result>
   [junit4]    > </response>
   [junit4]    > 	request was:q=id:500&qt=standard&start=0&rows=20&version=2.2
   [junit4]    > 	at org.apache.solr.SolrTestCaseJ4.assertQ(SolrTestCaseJ4.java:776)
   [junit4]    > 	... 40 more
   [junit4]   2> 1216221 INFO  (TEST-AutoCommitTest.testMaxTime-seed#[FE526F9BCE2766B7]) [    ] o.a.s.SolrTestCaseJ4 ###Starting testMaxTime
   [junit4]   2> 1216225 INFO  (TEST-AutoCommitTest.testMaxTime-seed#[FE526F9BCE2766B7]) [    ] o.a.s.s.SolrIndexSearcher Opening [Searcher@32bcf0[collection1] realtime]
   [junit4]   2> 1216225 INFO  (TEST-AutoCommitTest.testMaxTime-seed#[FE526F9BCE2766B7]) [    ] o.a.s.u.p.LogUpdateProcessorFactory [collection1]  webapp=null path=null params={}{deleteByQuery=*:* (-1544177822089609216)} 0 3
   [junit4]   2> 1216225 INFO  (TEST-AutoCommitTest.testMaxTime-seed#[FE526F9BCE2766B7]) [    ] o.a.s.c.SolrResourceLoader new SolrResourceLoader for directory: '/home/jenkins/workspace/Lucene-Solr-6.x-Linux/solr/core/src/test-files/solr/collection1'
   [junit4]   2> 1216225 INFO  (TEST-AutoCommitTest.testMaxTime-seed#[FE526F9BCE2766B7]) [    ] o.a.s.c.SolrResourceLoader JNDI not configured for solr (NoInitialContextEx)
   [junit4]   2> 1216225 INFO  (TEST-AutoCommitTest.testMaxTime-seed#[FE526F9BCE2766B7]) [    ] o.a.s.c.SolrResourceLoader using system property solr.solr.home: /home/jenkins/workspace/Lucene-Solr-6.x-Linux/solr/core/src/test-files/solr
   [junit4]   2> 1216226 INFO  (TEST-AutoCommitTest.testMaxTime-seed#[FE526F9BCE2766B7]) [    ] o.a.s.c.SolrResourceLoader Adding 'file:/home/jenkins/workspace/Lucene-Solr-6.x-Linux/solr/core/src/test-files/solr/collection1/lib/classes/' to classloader
   [junit4]   2> 1216226 INFO  (TEST-AutoCommitTest.testMaxTime-seed#[FE526F9BCE2766B7]) [    ] o.a.s.c.SolrResourceLoader Adding 'file:/home/jenkins/workspace/Lucene-Solr-6.x-Linux/solr/core/src/test-files/solr/collection1/lib/README' to classloader
   [junit4]   2> 1216252 INFO  (TEST-AutoCommitTest.testMaxTime-seed#[FE526F9BCE2766B7]) [    ] o.a.s.c.SolrConfig current version of requestparams : -1
   [junit4]   2> 1216262 WARN  (TEST-AutoCommitTest.testMaxTime-seed#[FE526F9BCE2766B7]) [    ] o.a.s.c.Config Beginning with Solr 5.5, <mergePolicy> is deprecated, use <mergePolicyFactory> instead.
   [junit4]   2> 1216271 INFO  (TEST-AutoCommitTest.testMaxTime-seed#[FE526F9BCE2766B7]) [    ] o.a.s.c.SolrConfig Using Lucene MatchVersion: 6.3.0
   [junit4]   2> 1216285 INFO  (TEST-AutoCommitTest.testMaxTime-seed#[FE526F9BCE2766B7]) [    ] o.a.s.c.SolrConfig Loaded SolrConfig: solrconfig.xml
   [junit4]   2> 1216289 INFO  (TEST-AutoCommitTest.testMaxTime-seed#[FE526F9BCE2766B7]) [    ] o.a.s.s.IndexSchema [collection1] Schema name=test
   [junit4]   2> 1216339 INFO  (TEST-AutoCommitTest.testMaxTime-seed#[FE526F9BCE2766B7]) [    ] o.a.s.s.OpenExchangeRatesOrgProvider Initialized with rates=open-exchange-rates.json, refreshInterval=1440.
   [junit4]   2> 1216343 INFO  (TEST-AutoCommitTest.testMaxTime-seed#[FE526F9BCE2766B7]) [    ] o.a.s.s.IndexSchema default search field in schema is text
   [junit4]   2> 1216344 INFO  (TEST-AutoCommitTest.testMaxTime-seed#[FE526F9BCE2766B7]) [    ] o.a.s.s.IndexSchema unique key field: id
   [junit4]   2> 1216347 INFO  (TEST-AutoCommitTest.testMaxTime-seed#[FE526F9BCE2766B7]) [    ] o.a.s.s.FileExchangeRateProvider Reloading exchange rates from file currency.xml
   [junit4]   2> 1216347 INFO  (TEST-AutoCommitTest.testMaxTime-seed#[FE526F9BCE2766B7]) [    ] o.a.s.s.FileExchangeRateProvider Reloading exchange rates from file currency.xml
   [junit4]   2> 1216348 INFO  (TEST-AutoCommitTest.testMaxTime-seed#[FE526F9BCE2766B7]) [    ] o.a.s.s.OpenExchangeRatesOrgProvider Reloading exchange rates from open-exchange-rates.json
   [junit4]   2> 1216348 INFO  (TEST-AutoCommitTest.testMaxTime-seed#[FE526F9BCE2766B7]) [    ] o.a.s.s.OpenExchangeRatesOrgProvider Reloading exchange rates from open-exchange-rates.json
   [junit4]   2> 1216349 INFO  (TEST-AutoCommitTest.testMaxTime-seed#[FE526F9BCE2766B7]) [    ] o.a.s.c.ConfigSetProperties Did not find ConfigSet properties, assuming default properties: Can't find resource 'configsetprops.json' in classpath or '/home/jenkins/workspace/Lucene-Solr-6.x-Linux/solr/core/src/test-files/solr/collection1'
   [junit4]   2> 1216349 INFO  (TEST-AutoCommitTest.testMaxTime-seed#[FE526F9BCE2766B7]) [    ] o.a.s.c.CoreContainer Reloading SolrCore 'collection1' using configuration from instancedir /home/jenkins/workspace/Lucene-Solr-6.x-Linux/solr/core/src/test-files/solr/collection1
   [junit4]   2> 1216350 INFO  (TEST-AutoCommitTest.testMaxTime-seed#[FE526F9BCE2766B7]) [    ] o.a.s.c.SolrCore [[collection1] ] Opening new SolrCore at [/home/jenkins/workspace/Lucene-Solr-6.x-Linux/solr/core/src/test-files/solr/collection1], dataDir=[/home/jenkins/workspace/Lucene-Solr-6.x-Linux/solr/build/solr-core/test/J0/temp/solr.update.AutoCommitTest_FE526F9BCE2766B7-001/init-core-data-001/]
   [junit4]   2> 1216350 INFO  (TEST-AutoCommitTest.testMaxTime-seed#[FE526F9BCE2766B7]) [    ] o.a.s.c.JmxMonitoredMap JMX monitoring is enabled. Adding Solr mbeans to JMX Server: com.sun.jmx.mbeanserver.JmxMBeanServer@ad0f0b
   [junit4]   2> 1216350 INFO  (TEST-AutoCommitTest.testMaxTime-seed#[FE526F9BCE2766B7]) [    ] o.a.s.c.s.SolrSnapshotMetaDataManager Loading from snapshot metadata file...
   [junit4]   2> 1216350 INFO  (TEST-AutoCommitTest.testMaxTime-seed#[FE526F9BCE2766B7]) [    ] o.a.s.c.SolrCore New index directory detected: old=null new=/home/jenkins/workspace/Lucene-Solr-6.x-Linux/solr/build/solr-core/test/J0/temp/solr.update.AutoCommitTest_FE526F9BCE2766B7-001/init-core-data-001/index/
   [junit4]   2> 1216350 INFO  (OldIndexDirectoryCleanupThreadForCore-collection1) [    ] o.a.s.c.SolrCore Looking for old index directories to cleanup for core collection1 in /home/jenkins/workspace/Lucene-Solr-6.x-Linux/solr/build/solr-core/test/J0/temp/solr.update.AutoCommitTest_FE526F9BCE2766B7-001/init-core-data-001/
   [junit4]   2> 1216353 INFO  (TEST-AutoCommitTest.testMaxTime-seed#[FE526F9BCE2766B7]) [    ] o.a.s.u.p.UpdateRequestProcessorChain creating updateRequestProcessorChain "dedupe"
   [junit4]   2> 1216353 INFO  (TEST-AutoCommitTest.testMaxTime-seed#[FE526F9BCE2766B7]) [    ] o.a.s.u.p.UpdateRequestProcessorChain inserting DistributedUpdateProcessorFactory into updateRequestProcessorChain "dedupe"
   [junit4]   2> 1216353 INFO  (TEST-AutoCommitTest.testMaxTime-seed#[FE526F9BCE2766B7]) [    ] o.a.s.u.p.UpdateRequestProcessorChain creating updateRequestProcessorChain "dedupe-allfields"
   [junit4]   2> 1216353 INFO  (TEST-AutoCommitTest.testMaxTime-seed#[FE526F9BCE2766B7]) [    ] o.a.s.u.p.UpdateRequestProcessorChain inserting DistributedUpdateProcessorFactory into updateRequestProcessorChain "dedupe-allfields"
   [junit4]   2> 1216353 INFO  (TEST-AutoCommitTest.testMaxTime-seed#[FE526F9BCE2766B7]) [    ] o.a.s.u.p.UpdateRequestProcessorChain creating updateRequestProcessorChain "stored_sig"
   [junit4]   2> 1216353 INFO  (TEST-AutoCommitTest.testMaxTime-seed#[FE526F9BCE2766B7]) [    ] o.a.s.u.p.UpdateRequestProcessorChain inserting DistributedUpdateProcessorFactory into updateRequestProcessorChain "stored_sig"
   [junit4]   2> 1216353 INFO  (TEST-AutoCommitTest.testMaxTime-seed#[FE526F9BCE2766B7]) [    ] o.a.s.u.p.UpdateRequestProcessorChain creating updateRequestProcessorChain "uniq-fields"
   [junit4]   2> 1216353 INFO  (TEST-AutoCommitTest.testMaxTime-seed#[FE526F9BCE2766B7]) [    ] o.a.s.u.p.UpdateRequestProcessorChain inserting DistributedUpdateProcessorFactory into updateRequestProcessorChain "uniq-fields"
   [junit4]   2> 1216354 INFO  (TEST-AutoCommitTest.testMaxTime-seed#[FE526F9BCE2766B7]) [    ] o.a.s.u.p.UpdateRequestProcessorChain creating updateRequestProcessorChain "distrib-dup-test-chain-explicit"
   [junit4]   2> 1216354 INFO  (TEST-AutoCommitTest.testMaxTime-seed#[FE526F9BCE2766B7]) [    ] o.a.s.u.p.UpdateRequestProcessorChain creating updateRequestProcessorChain "distrib-dup-test-chain-implicit"
   [junit4]   2> 1216354 INFO  (TEST-AutoCommitTest.testMaxTime-seed#[FE526F9BCE2766B7]) [    ] o.a.s.u.p.UpdateRequestProcessorChain inserting DistributedUpdateProcessorFactory into updateRequestProcessorChain "distrib-dup-test-chain-implicit"
   [junit4]   2> 1216354 INFO  (TEST-AutoCommitTest.testMaxTime-seed#[FE526F9BCE2766B7]) [    ] o.a.s.c.SolrCore no updateRequestProcessorChain defined as default, creating implicit default
   [junit4]   2> 1216355 INFO  (TEST-AutoCommitTest.testMaxTime-seed#[FE526F9BCE2766B7]) [    ] o.a.s.h.l.XMLLoader xsltCacheLifetimeSeconds=60
   [junit4]   2> 1216356 INFO  (TEST-AutoCommitTest.testMaxTime-seed#[FE526F9BCE2766B7]) [    ] o.a.s.h.l.XMLLoader xsltCacheLifetimeSeconds=60
   [junit4]   2> 1216357 INFO  (TEST-AutoCommitTest.testMaxTime-seed#[FE526F9BCE2766B7]) [    ] o.a.s.h.l.XMLLoader xsltCacheLifetimeSeconds=60
   [junit4]   2> 1216363 INFO  (TEST-AutoCommitTest.testMaxTime-seed#[FE526F9BCE2766B7]) [    ] o.a.s.h.l.XMLLoader xsltCacheLifetimeSeconds=60
   [junit4]   2> 1216367 INFO  (TEST-AutoCommitTest.testMaxTime-seed#[FE526F9BCE2766B7]) [    ] o.a.s.c.PluginBag requestHandler : 'lazy' created with startup=lazy 
   [junit4]   2> 1216368 INFO  (TEST-AutoCommitTest.testMaxTime-seed#[FE526F9BCE2766B7]) [    ] o.a.s.c.RequestHandlers Registered paths: /admin/mbeans,standard,spellCheckCompRH,lazy,/update/json/docs,/admin/luke,/export,spellCheckWithWordbreak_Direct,tvrh,/get,/admin/properties,/update/json,mltrh,/admin/threads,/search-facet-def,/update/csv,/sql,/graph,/search-facet-invariants,/admin/segments,spellCheckCompRH1,/mlt,/admin/system,/replication,dismax,defaults,/config,/stream,/schema,/admin/plugins,/admin/logging,spellCheckWithWordbreak,mock,/admin/ping,/update,/admin/file,/terms,spellCheckCompRH_Direct,/debug/dump
   [junit4]   2> 1216368 INFO  (TEST-AutoCommitTest.testMaxTime-seed#[FE526F9BCE2766B7]) [    ] o.a.s.c.SolrCore Using default statsCache cache: org.apache.solr.search.stats.LocalStatsCache
   [junit4]   2> 1216368 INFO  (TEST-AutoCommitTest.testMaxTime-seed#[FE526F9BCE2766B7]) [    ] o.a.s.u.CommitTracker Hard AutoCommit: disabled
   [junit4]   2> 1216368 INFO  (TEST-AutoCommitTest.testMaxTime-seed#[FE526F9BCE2766B7]) [    ] o.a.s.u.CommitTracker Soft AutoCommit: disabled
   [junit4]   2> 1216369 INFO  (TEST-AutoCommitTest.testMaxTime-seed#[FE526F9BCE2766B7]) [    ] o.a.s.s.SolrIndexSearcher Opening [Searcher@128db96[collection1] main]
   [junit4]   2> 1216369 INFO  (TEST-AutoCommitTest.testMaxTime-seed#[FE526F9BCE2766B7]) [    ] o.a.s.r.RestManager Initializing RestManager with initArgs: {storageIO=org.apache.solr.rest.ManagedResourceStorage$InMemoryStorageIO}
   [junit4]   2> 1216369 INFO  (TEST-AutoCommitTest.testMaxTime-seed#[FE526F9BCE2766B7]) [    ] o.a.s.r.ManagedResourceStorage Reading _rest_managed.json using InMemoryStorage
   [junit4]   2> 1216369 INFO  (TEST-AutoCommitTest.testMaxTime-seed#[FE526F9BCE2766B7]) [    ] o.a.s.r.RestManager Initializing 0 registered ManagedResources
   [junit4]   2> 1216369 INFO  (TEST-AutoCommitTest.testMaxTime-seed#[FE526F9BCE2766B7]) [    ] o.a.s.h.c.SpellCheckComponent Initializing spell checkers
   [junit4]   2> 1216369 INFO  (TEST-AutoCommitTest.testMaxTime-seed#[FE526F9BCE2766B7]) [    ] o.a.s.s.DirectSolrSpellChecker init: {name=direct,classname=DirectSolrSpellChecker,field=lowerfilt,minQueryLength=3}
   [junit4]   2> 1216371 INFO  (TEST-AutoCommitTest.testMaxTime-seed#[FE526F9BCE2766B7]) [    ] o.a.s.h.ReplicationHandler Commits will be reserved for  10000
   [junit4]   2> 1216371 INFO  (searcherExecutor-5323-thread-1) [    ] o.a.s.h.c.SpellCheckComponent Loading spell index for spellchecker: default
   [junit4]   2> 1216371 INFO  (searcherExecutor-5323-thread-1) [    ] o.a.s.h.c.SpellCheckComponent Loading spell index for spellchecker: direct
   [junit4]   2> 1216371 INFO  (searcherExecutor-5323-thread-1) [    ] o.a.s.h.c.SpellCheckComponent Loading spell index for spellchecker: wordbreak
   [junit4]   2> 1216371 INFO  (searcherExecutor-5323-thread-1) [    ] o.a.s.h.c.SpellCheckComponent Loading spell index for spellchecker: multipleFields
   [junit4]   2> 1216371 INFO  (searcherExecutor-5323-thread-1) [    ] o.a.s.h.c.SpellCheckComponent Loading spell index for spellchecker: jarowinkler
   [junit4]   2> 1216371 INFO  (searcherExecutor-5323-thread-1) [    ] o.a.s.h.c.SpellCheckComponent Loading spell index for spellchecker: external
   [junit4]   2> 1216371 INFO  (TEST-AutoCommitTest.testMaxTime-seed#[FE526F9BCE2766B7]) [    ] o.a.s.u.UpdateLog Looking up max value of version field to seed version buckets
   [junit4]   2> 1216371 INFO  (searcherExecutor-5323-thread-1) [    ] o.a.s.h.c.SpellCheckComponent Loading spell index for spellchecker: freq
   [junit4]   2> 1216372 INFO  (TEST-AutoCommitTest.testMaxTime-seed#[FE526F9BCE2766B7]) [    ] o.a.s.u.VersionInfo Refreshing highest value of _version_ for 65536 version buckets from index
   [junit4]   2> 1216372 INFO  (TEST-AutoCommitTest.testMaxTime-seed#[FE526F9BCE2766B7]) [    ] o.a.s.u.VersionInfo No terms found for _version_, cannot seed version bucket highest value from index
   [junit4]   2> 1216372 INFO  (searcherExecutor-5323-thread-1) [    ] o.a.s.h.c.SpellCheckComponent Loading spell index for spellchecker: fqcn
   [junit4]   2> 1216372 INFO  (searcherExecutor-5323-thread-1) [    ] o.a.s.h.c.SpellCheckComponent Loading spell index for spellchecker: perDict
   [junit4]   2> 1216372 INFO  (searcherExecutor-5323-thread-1) [    ] o.a.s.c.SolrCore [collection1] Registered new searcher Searcher@128db96[collection1] main{ExitableDirectoryReader(UninvertingDirectoryReader())}
   [junit4]   2> 1216373 INFO  (TEST-AutoCommitTest.testMaxTime-seed#[FE526F9BCE2766B7]) [    ] o.a.s.u.UpdateLog Took 1.0ms to seed version buckets with highest version 1544177822089609216
   [junit4]   2> 1216373 INFO  (TEST-AutoCommitTest.testMaxTime-seed#[FE526F9BCE2766B7]) [    ] o.a.s.u.DefaultSolrCoreState Closing old IndexWriter... core=collection1
   [junit4]   2> 1216374 INFO  (TEST-AutoCommitTest.testMaxTime-seed#[FE526F9BCE2766B7]) [    ] o.a.s.c.SolrDeletionPolicy SolrDeletionPolicy.onCommit: commits: num=2
   [junit4]   2> 	commit{dir=MockDirectoryWrapper(RAMDirectory@ba4e61 lockFactory=org.apache.lucene.store.SingleInstanceLockFactory@1fa2305),segFN=segments_1,generation=1}
   [junit4]   2> 	commit{dir=MockDirectoryWrapper(RAMDirectory@ba4e61 lockFactory=org.apache.lucene.store.SingleInstanceLockFactory@1fa2305),segFN=segments_2,generation=2}
   [junit4]   2> 1216374 INFO  (TEST-AutoCommitTest.testMaxTime-seed#[FE526F9BCE2766B7]) [    ] o.a.s.c.SolrDeletionPolicy newest commit generation = 2
   [junit4]   2> 1216374 INFO  (TEST-AutoCommitTest.testMaxTime-seed#[FE526F9BCE2766B7]) [    ] o.a.s.u.RandomMergePolicy RandomMergePolicy wrapping class org.apache.lucene.index.LogByteSizeMergePolicy: [LogByteSizeMergePolicy: minMergeSize=1677721, mergeFactor=36, maxMergeSize=2147483648, maxMergeSizeForForcedMerge=9223372036854775807, calibrateSizeByDeletes=true, maxMergeDocs=2147483647, maxCFSSegmentSizeMB=8.796093022207999E12, noCFSRatio=0.506871848722846]
   [junit4]   2> 1216374 INFO  (TEST-AutoCommitTest.testMaxTime-seed#[FE526F9BCE2766B7]) [    ] o.a.s.c.SolrDeletionPolicy SolrDeletionPolicy.onInit: commits: num=1
   [junit4]   2> 	commit{dir=MockDirectoryWrapper(RAMDirectory@ba4e61 lockFactory=org.apache.lucene.store.SingleInstanceLockFactory@1fa2305),segFN=segments_2,generation=2}
   [junit4]   2> 1216374 INFO  (TEST-AutoCommitTest.testMaxTime-seed#[FE526F9BCE2766B7]) [    ] o.a.s.c.SolrDeletionPolicy newest commit generation = 2
   [junit4]   2> 1216374 INFO  (TEST-AutoCommitTest.testMaxTime-seed#[FE526F9BCE2766B7]) [    ] o.a.s.u.DefaultSolrCoreState New IndexWriter is ready to be used.
   [junit4]   2> 1216374 INFO  (TEST-AutoCommitTest.testMaxTime-seed#[FE526F9BCE2766B7]) [    ] o.a.s.s.SolrIndexSearcher Opening [Searcher@1fcc4cd[collection1] main]
   [junit4]   2> 1216375 INFO  (TEST-AutoCommitTest.testMaxTime-seed#[FE526F9BCE2766B7]) [    ] o.a.s.c.CoreContainer replacing core: collection1
   [junit4]   2> 1216375 INFO  (TEST-AutoCommitTest.testMaxTime-seed#[FE526F9BCE2766B7]) [    ] o.a.s.c.SolrCore [collection1]  CLOSING SolrCore org.apache.solr.core.SolrCore@dbdb1b
   [junit4]   2> 1216375 INFO  (TEST-AutoCommitTest.testMaxTime-seed#[FE526F9BCE2766B7]) [    ] o.a.s.u.DirectUpdateHandler2 closing DirectUpdateHandler2{commits=3,autocommits=0,soft autocommits=3,optimizes=0,rollbacks=0,expungeDeletes=0,docsPending=12,adds=9,deletesById=0,deletesByQuery=1,errors=0,cumulative_adds=12,cumulative_deletesById=1,cumulative_deletesByQuery=1,cumulative_errors=0,transaction_logs_total_size=0,transaction_logs_total_number=0}
   [junit4]   2> 1216375 INFO  (TEST-AutoCommitTest.testMaxTime-seed#[FE526F9BCE2766B7]) [    ] o.a.s.c.SolrCore [collection1] Closing main searcher on request.
   [junit4]   2> 1216375 INFO  (searcherExecutor-5323-thread-1) [    ] o.a.s.c.SolrCore [collection1] Registered new searcher Searcher@1fcc4cd[collection1] main{ExitableDirectoryReader(UninvertingDirectoryReader())}
   [junit4]   2> 1216382 INFO  (TEST-AutoCommitTest.testMaxTime-seed#[FE526F9BCE2766B7]) [    ] o.a.s.u.p.LogUpdateProcessorFactory [collection1] {add=[529 (1544177822257381376)]} 0 0
   [junit4]   2> 1216382 INFO  (TEST-AutoCommitTest.testMaxTime-seed#[FE526F9BCE2766B7]) [    ] o.a.s.c.S.Request [collection1]  webapp=null path=null params={q=id:529&qt=standard&start=0&rows=20&version=2.2} hits=0 status=0 QTime=0
   [junit4]   2> 1217382 INFO  (commitScheduler-5326-thread-1) [    ] o.a.s.u.DirectUpdateHandler2 start commit{,optimize=false,openSearcher=true,waitSearcher=true,expungeDeletes=false,softCommit=true,prepareCommit=false}
   [junit4]   2> 1217383 INFO  (commitScheduler-5326-thread-1) [    ] o.a.s.s.SolrIndexSearcher Opening [Searcher@c651b5[collection1] main]
   [junit4]   2> 1217383 INFO  (commitScheduler-5326-thread-1) [    ] o.a.s.u.DirectUpdateHandler2 end_commit_flush
   [junit4]   2> 1217384 INFO  (searcherExecutor-5323-thread-1) [    ] o.a.s.c.SolrCore [collection1] Registered new searcher Searcher@c651b5[collection1] main{ExitableDirectoryReader(UninvertingDirectoryReader(Uninverting(_4(6.3.0):C1)))}
   [junit4]   2> 1217633 INFO  (TEST-AutoCommitTest.testMaxTime-seed#[FE526F9BCE2766B7]) [    ] o.a.s.u.p.LogUpdateProcessorFactory [collection1] {add=[530 (1544177823570198528)]} 0 1252
   [junit4]   2> 1217633 INFO  (TEST-AutoCommitTest.testMaxTime-seed#[FE526F9BCE2766B7]) [    ] o.a.s.c.S.Request [collection1]  webapp=null path=null params={q=id:529&qt=standard&start=0&rows=20&version=2.2} hits=1 status=0 QTime=0
   [junit4]   2> 1217634 INFO  (TEST-AutoCommitTest.testMaxTime-seed#[FE526F9BCE2766B7]) [    ] o.a.s.c.S.Request [collection1]  webapp=null path=null params={q=id:530&qt=standard&start=0&rows=20&version=2.2} hits=0 status=0 QTime=0
   [junit4]   2> 1217634 INFO  (TEST-AutoCommitTest.testMaxTime-seed#[FE526F9BCE2766B7]) [    ] o.a.s.u.p.LogUpdateProcessorFactory [collection1]  webapp=null path=null params={}{delete=[529 (-1544177823571247104)]} 0 0
   [junit4]   2> 1217634 INFO  (TEST-AutoCommitTest.testMaxTime-seed#[FE526F9BCE2766B7]) [    ] o.a.s.c.S.Request [collection1]  webapp=null path=null params={q=id:529&qt=standard&start=0&rows=20&version=2.2} hits=1 status=0 QTime=0
   [junit4]   2> 1218633 INFO  (commitScheduler-5326-thread-1) [    ] o.a.s.u.DirectUpdateHandler2 start commit{,optimize=false,openSearcher=true,waitSearcher=true,expungeDeletes=false,softCommit=true,prepareCommit=false}
   [junit4]   2> 1218635 INFO  (commitScheduler-5326-thread-1) [    ] o.a.s.s.SolrIndexSearcher Opening [Searcher@6c23f2[collection1] main]
   [junit4]   2> 1218635 INFO  (commitScheduler-5326-thread-1) [    ] o.a.s.u.DirectUpdateHandler2 end_commit_flush
   [junit4]   2> 1218635 INFO  (searcherExecutor-5323-thread-1) [    ] o.a.s.c.SolrCore [collection1] Registered new searcher Searcher@6c23f2[collection1] main{ExitableDirectoryReader(UninvertingDirectoryReader(Uninverting(_5(6.3.0):C1)))}
   [junit4]   2> 1219885 INFO  (commitScheduler-5326-thread-1) [    ] o.a.s.u.DirectUpdateHandler2 start commit{,optimize=false,openSearcher=true,waitSearcher=true,expungeDeletes=false,softCommit=true,prepareCommit=false}
   [junit4]   2> 1219887 INFO  (commitScheduler-5326-thread-1) [    ] o.a.s.s.SolrIndexSearcher Opening [Searcher@1c54bfe[collection1] main]
   [junit4]   2> 1219887 INFO  (commitScheduler-5326-thread-1) [    ] o.a.s.u.DirectUpdateHandler2 end_commit_flush
   [junit4]   2> 1219887 INFO  (searcherExecutor-5323-thread-1) [    ] o.a.s.c.SolrCore [collection1] Registered new searcher Searcher@1c54bfe[collection1] main{ExitableDirectoryReader(UninvertingDirectoryReader(Uninverting(_5(6.3.0):C1) Uninverting(_6(6.3.0):C1)))}
   [junit4]   2> 1222106 INFO  (TEST-AutoCommitTest.testMaxTime-seed#[FE526F9BCE2766B7]) [    ] o.a.s.u.p.LogUpdateProcessorFactory [collection1] {add=[550 (1544177824883015680)]} 0 5725
   [junit4]   2> 1222107 INFO  (TEST-AutoCommitTest.testMaxTime-seed#[FE526F9BCE2766B7]) [    ] o.a.s.SolrTestCaseJ4 ###Ending testMaxTime
   [junit4]   2> NOTE: reproduce with: ant test  -Dtestcase=AutoCommitTest -Dtests.method=testMaxTime -Dtests.seed=FE526F9BCE2766B7 -Dtests.multiplier=3 -Dtests.slow=true -Dtests.locale=sbp-TZ -Dtests.timezone=Africa/Blantyre -Dtests.asserts=true -Dtests.file.encoding=UTF-8
   [junit4] FAILURE 5.89s J0 | AutoCommitTest.testMaxTime <<<
   [junit4]    > Throwable #1: java.lang.AssertionError: expected:<2> but was:<3>
   [junit4]    > 	at __randomizedtesting.SeedInfo.seed([FE526F9BCE2766B7:64A6127950BDFA8B]:0)
   [junit4]    > 	at org.apache.solr.update.AutoCommitTest.testMaxTime(AutoCommitTest.java:256)
   [junit4]    > 	at jdk.internal.reflect.NativeMethodAccessorImpl.invoke0(java.base@9-ea/Native Method)
   [junit4]    > 	at jdk.internal.reflect.NativeMethodAccessorImpl.invoke(java.base@9-ea/NativeMethodAccessorImpl.java:62)
   [junit4]    > 	at jdk.internal.reflect.DelegatingMethodAccessorImpl.invoke(java.base@9-ea/DelegatingMethodAccessorImpl.java:43)
   [junit4]    > 	at java.lang.Thread.run(java.base@9-ea/Thread.java:843)
   [junit4]   2> 1222109 INFO  (TEST-AutoCommitTest.testMaxDocs-seed#[FE526F9BCE2766B7]) [    ] o.a.s.SolrTestCaseJ4 ###Starting testMaxDocs
   [junit4]   2> 1222110 INFO  (TEST-AutoCommitTest.testMaxDocs-seed#[FE526F9BCE2766B7]) [    ] o.a.s.s.SolrIndexSearcher Opening [Searcher@15884da[collection1] realtime]
   [junit4]   2> 1222110 INFO  (TEST-AutoCommitTest.testMaxDocs-seed#[FE526F9BCE2766B7]) [    ] o.a.s.u.p.LogUpdateProcessorFactory [collection1]  webapp=null path=null params={}{deleteByQuery=*:* (-1544177828263624704)} 0 0
   [junit4]   2> 1222110 INFO  (TEST-AutoCommitTest.testMaxDocs-seed#[FE526F9BCE2766B7]) [    ] o.a.s.c.SolrResourceLoader new SolrResourceLoader for directory: '/home/jenkins/workspace/Lucene-Solr-6.x-Linux/solr/core/src/test-files/solr/collection1'
   [junit4]   2> 1222110 INFO  (TEST-AutoCommitTest.testMaxDocs-seed#[FE526F9BCE2766B7]) [    ] o.a.s.c.SolrResourceLoader JNDI not configured for solr (NoInitialContextEx)
   [junit4]   2> 1222110 INFO  (TEST-AutoCommitTest.testMaxDocs-seed#[FE526F9BCE2766B7]) [    ] o.a.s.c.SolrResourceLoader using system property solr.solr.home: /home/jenkins/workspace/Lucene-Solr-6.x-Linux/solr/core/src/test-files/solr
   [junit4]   2> 1222110 INFO  (TEST-AutoCommitTest.testMaxDocs-seed#[FE526F9BCE2766B7]) [    ] o.a.s.c.SolrResourceLoader Adding 'file:/home/jenkins/workspace/Lucene-Solr-6.x-Linux/solr/core/src/test-files/solr/collection1/lib/classes/' to classloader
   [junit4]   2> 1222110 INFO  (TEST-AutoCommitTest.testMaxDocs-seed#[FE526F9BCE2766B7]) [    ] o.a.s.c.SolrResourceLoader Adding 'file:/home/jenkins/workspace/Lucene-Solr-6.x-Linux/solr/core/src/test-files/solr/collection1/lib/README' to classloader
   [junit4]   2> 1222125 INFO  (TEST-AutoCommitTest.testMaxDocs-seed#[FE526F9BCE2766B7]) [    ] o.a.s.c.SolrConfig current version of requestparams : -1
   [junit4]   2> 1222131 WARN  (TEST-AutoCommitTest.testMaxDocs-seed#[FE526F9BCE2766B7]) [    ] o.a.s.c.Config Beginning with Solr 5.5, <mergePolicy> is deprecated, use <mergePolicyFactory> instead.
   [junit4]   2> 1222132 INFO  (TEST-AutoCommitTest.testMaxDocs-seed#[FE526F9BCE2766B7]) [    ] o.a.s.c.SolrConfig Using Lucene MatchVersion: 6.3.0
   [junit4]   2> 1222145 INFO  (TEST-AutoCommitTest.testMaxDocs-seed#[FE526F9BCE2766B7]) [    ] o.a.s.c.SolrConfig Loaded SolrConfig: solrconfig.xml
   [junit4]   2> 1222149 INFO  (TEST-AutoCommitTest.testMaxDocs-seed#[FE526F9BCE2766B7]) [    ] o.a.s.s.IndexSchema [collection1] Schema name=test
   [junit4]   2> 1222202 INFO  (TEST-AutoCommitTest.testMaxDocs-seed#[FE526F9BCE2766B7]) [    ] o.a.s.s.OpenExchangeRatesOrgProvider Initialized with rates=open-exchange-rates.json, refreshInterval=1440.
   [junit4]   2> 1222206 INFO  (TEST-AutoCommitTest.testMaxDocs-seed#[FE526F9BCE2766B7]) [    ] o.a.s.s.IndexSchema default search field in schema is text
   [junit4]   2> 1222207 INFO  (TEST-AutoCommitTest.testMaxDocs-seed#[FE526F9BCE2766B7]) [    ] o.a.s.s.IndexSchema unique key field: id
   [junit4]   2> 1222209 INFO  (TEST-AutoCommitTest.testMaxDocs-seed#[FE526F9BCE2766B7]) [    ] o.a.s.s.FileExchangeRateProvider Reloading exchange rates from file currency.xml
   [junit4]   2> 1222210 INFO  (TEST-AutoCommitTest.testMaxDocs-seed#[FE526F9BCE2766B7]) [    ] o.a.s.s.FileExchangeRateProvider Reloading exchange rates from file currency.xml
   [junit4]   2> 1222211 INFO  (TEST-AutoCommitTest.testMaxDocs-seed#[FE526F9BCE2766B7]) [    ] o.a.s.s.OpenExchangeRatesOrgProvider Reloading exchange rates from open-exchange-rates.json
   [junit4]   2> 1222211 INFO  (TEST-AutoCommitTest.testMaxDocs-seed#[FE526F9BCE2766B7]) [    ] o.a.s.s.OpenExchangeRatesOrgProvider Reloading exchange rates from open-exchange-rates.json
   [junit4]   2> 1222212 INFO  (TEST-AutoCommitTest.testMaxDocs-seed#[FE526F9BCE2766B7]) [    ] o.a.s.c.ConfigSetProperties Did not find ConfigSet properties, assuming default properties: Can't find resource 'configsetprops.json' in classpath or '/home/jenkins/workspace/Lucene-Solr-

[...truncated too long message...]

240 INFO  (commitScheduler-5330-thread-1) [    ] o.a.s.u.DirectUpdateHandler2 start commit{,optimize=false,openSearcher=true,waitSearcher=true,expungeDeletes=false,softCommit=true,prepareCommit=false}
   [junit4]   2> 1222242 INFO  (commitScheduler-5330-thread-1) [    ] o.a.s.s.SolrIndexSearcher Opening [Searcher@168e963[collection1] main]
   [junit4]   2> 1222242 INFO  (commitScheduler-5330-thread-1) [    ] o.a.s.u.DirectUpdateHandler2 end_commit_flush
   [junit4]   2> 1222242 INFO  (searcherExecutor-5327-thread-1) [    ] o.a.s.c.SolrCore [collection1] Registered new searcher Searcher@168e963[collection1] main{ExitableDirectoryReader(UninvertingDirectoryReader(Uninverting(_7(6.3.0):C15)))}
   [junit4]   2> 1222490 INFO  (TEST-AutoCommitTest.testMaxDocs-seed#[FE526F9BCE2766B7]) [    ] o.a.s.u.p.LogUpdateProcessorFactory [collection1] {add=[15 (1544177828663132160)]} 0 254
   [junit4]   2> 1222490 INFO  (TEST-AutoCommitTest.testMaxDocs-seed#[FE526F9BCE2766B7]) [    ] o.a.s.c.S.Request [collection1]  webapp=null path=null params={q=id:14&qt=standard&start=0&rows=20&version=2.2} hits=1 status=0 QTime=0
   [junit4]   2> 1222491 INFO  (TEST-AutoCommitTest.testMaxDocs-seed#[FE526F9BCE2766B7]) [    ] o.a.s.c.S.Request [collection1]  webapp=null path=null params={q=id:15&qt=standard&start=0&rows=20&version=2.2} hits=0 status=0 QTime=0
   [junit4]   2> 1222491 INFO  (TEST-AutoCommitTest.testMaxDocs-seed#[FE526F9BCE2766B7]) [    ] o.a.s.SolrTestCaseJ4 ###Ending testMaxDocs
   [junit4]   2> 1222491 INFO  (SUITE-AutoCommitTest-seed#[FE526F9BCE2766B7]-worker) [    ] o.a.s.SolrTestCaseJ4 ###deleteCore
   [junit4]   2> 1222491 INFO  (SUITE-AutoCommitTest-seed#[FE526F9BCE2766B7]-worker) [    ] o.a.s.c.CoreContainer Shutting down CoreContainer instance=15610052
   [junit4]   2> 1222491 INFO  (coreCloseExecutor-5331-thread-1) [    ] o.a.s.c.SolrCore [collection1]  CLOSING SolrCore org.apache.solr.core.SolrCore@d6d879
   [junit4]   2> 1222492 INFO  (coreCloseExecutor-5331-thread-1) [    ] o.a.s.u.DirectUpdateHandler2 closing DirectUpdateHandler2{commits=1,autocommits=0,soft autocommit maxDocs=14,soft autocommits=1,optimizes=0,rollbacks=0,expungeDeletes=0,docsPending=16,adds=1,deletesById=0,deletesByQuery=0,errors=0,cumulative_adds=16,cumulative_deletesById=0,cumulative_deletesByQuery=0,cumulative_errors=0,transaction_logs_total_size=0,transaction_logs_total_number=0}
   [junit4]   2> 1222492 INFO  (coreCloseExecutor-5331-thread-1) [    ] o.a.s.u.SolrCoreState Closing SolrCoreState
   [junit4]   2> 1222492 INFO  (coreCloseExecutor-5331-thread-1) [    ] o.a.s.u.DefaultSolrCoreState SolrCoreState ref count has reached 0 - closing IndexWriter
   [junit4]   2> 1222492 INFO  (coreCloseExecutor-5331-thread-1) [    ] o.a.s.u.DefaultSolrCoreState closing IndexWriter with IndexWriterCloser
   [junit4]   2> 1222492 INFO  (coreCloseExecutor-5331-thread-1) [    ] o.a.s.u.DirectUpdateHandler2 Committing on IndexWriter close.
   [junit4]   2> 1222493 INFO  (coreCloseExecutor-5331-thread-1) [    ] o.a.s.c.SolrDeletionPolicy SolrDeletionPolicy.onCommit: commits: num=2
   [junit4]   2> 	commit{dir=MockDirectoryWrapper(RAMDirectory@ba4e61 lockFactory=org.apache.lucene.store.SingleInstanceLockFactory@1fa2305),segFN=segments_3,generation=3}
   [junit4]   2> 	commit{dir=MockDirectoryWrapper(RAMDirectory@ba4e61 lockFactory=org.apache.lucene.store.SingleInstanceLockFactory@1fa2305),segFN=segments_4,generation=4}
   [junit4]   2> 1222493 INFO  (coreCloseExecutor-5331-thread-1) [    ] o.a.s.c.SolrDeletionPolicy newest commit generation = 4
   [junit4]   2> 1222493 INFO  (coreCloseExecutor-5331-thread-1) [    ] o.a.s.c.SolrCore [collection1] Closing main searcher on request.
   [junit4]   2> 1222500 INFO  (coreCloseExecutor-5331-thread-1) [    ] o.a.s.c.CachingDirectoryFactory Closing MockDirectoryFactory - 3 directories currently being tracked
   [junit4]   2> 1222501 INFO  (coreCloseExecutor-5331-thread-1) [    ] o.a.s.c.CachingDirectoryFactory looking to close /home/jenkins/workspace/Lucene-Solr-6.x-Linux/solr/build/solr-core/test/J0/temp/solr.update.AutoCommitTest_FE526F9BCE2766B7-001/init-core-data-001 [CachedDir<<refCount=0;path=/home/jenkins/workspace/Lucene-Solr-6.x-Linux/solr/build/solr-core/test/J0/temp/solr.update.AutoCommitTest_FE526F9BCE2766B7-001/init-core-data-001;done=false>>]
   [junit4]   2> 1222501 INFO  (coreCloseExecutor-5331-thread-1) [    ] o.a.s.c.CachingDirectoryFactory Closing directory, CoreContainer#isShutdown=true
   [junit4]   2> 1222501 INFO  (coreCloseExecutor-5331-thread-1) [    ] o.a.s.c.CachingDirectoryFactory Closing directory: /home/jenkins/workspace/Lucene-Solr-6.x-Linux/solr/build/solr-core/test/J0/temp/solr.update.AutoCommitTest_FE526F9BCE2766B7-001/init-core-data-001
   [junit4]   2> 1222501 INFO  (coreCloseExecutor-5331-thread-1) [    ] o.a.s.c.CachingDirectoryFactory looking to close /home/jenkins/workspace/Lucene-Solr-6.x-Linux/solr/build/solr-core/test/J0/temp/solr.update.AutoCommitTest_FE526F9BCE2766B7-001/init-core-data-001/index [CachedDir<<refCount=0;path=/home/jenkins/workspace/Lucene-Solr-6.x-Linux/solr/build/solr-core/test/J0/temp/solr.update.AutoCommitTest_FE526F9BCE2766B7-001/init-core-data-001/index;done=false>>]
   [junit4]   2> 1222501 INFO  (coreCloseExecutor-5331-thread-1) [    ] o.a.s.c.CachingDirectoryFactory Closing directory, CoreContainer#isShutdown=true
   [junit4]   2> 1222501 INFO  (coreCloseExecutor-5331-thread-1) [    ] o.a.s.c.CachingDirectoryFactory Closing directory: /home/jenkins/workspace/Lucene-Solr-6.x-Linux/solr/build/solr-core/test/J0/temp/solr.update.AutoCommitTest_FE526F9BCE2766B7-001/init-core-data-001/index
   [junit4]   2> 1222501 INFO  (coreCloseExecutor-5331-thread-1) [    ] o.a.s.c.CachingDirectoryFactory looking to close /home/jenkins/workspace/Lucene-Solr-6.x-Linux/solr/build/solr-core/test/J0/temp/solr.update.AutoCommitTest_FE526F9BCE2766B7-001/init-core-data-001/snapshot_metadata [CachedDir<<refCount=0;path=/home/jenkins/workspace/Lucene-Solr-6.x-Linux/solr/build/solr-core/test/J0/temp/solr.update.AutoCommitTest_FE526F9BCE2766B7-001/init-core-data-001/snapshot_metadata;done=false>>]
   [junit4]   2> 1222501 INFO  (coreCloseExecutor-5331-thread-1) [    ] o.a.s.c.CachingDirectoryFactory Closing directory, CoreContainer#isShutdown=true
   [junit4]   2> 1222501 INFO  (coreCloseExecutor-5331-thread-1) [    ] o.a.s.c.CachingDirectoryFactory Closing directory: /home/jenkins/workspace/Lucene-Solr-6.x-Linux/solr/build/solr-core/test/J0/temp/solr.update.AutoCommitTest_FE526F9BCE2766B7-001/init-core-data-001/snapshot_metadata
   [junit4]   2> NOTE: leaving temporary files on disk at: /home/jenkins/workspace/Lucene-Solr-6.x-Linux/solr/build/solr-core/test/J0/temp/solr.update.AutoCommitTest_FE526F9BCE2766B7-001
   [junit4]   2> NOTE: test params are: codec=FastDecompressionCompressingStoredFields(storedFieldsFormat=CompressingStoredFieldsFormat(compressionMode=FAST_DECOMPRESSION, chunkSize=23899, maxDocsPerChunk=2, blockSize=5), termVectorsFormat=CompressingTermVectorsFormat(compressionMode=FAST_DECOMPRESSION, chunkSize=23899, blockSize=5)), sim=ClassicSimilarity, locale=sbp-TZ, timezone=Africa/Blantyre
   [junit4]   2> NOTE: Linux 4.4.0-31-generic i386/Oracle Corporation 9-ea (32-bit)/cpus=12,threads=1,free=143401520,total=430178304
   [junit4]   2> NOTE: All tests run in this JVM: [StressHdfsTest, TestHdfsCloudBackupRestore, BasicZkTest, FileBasedSpellCheckerTest, TestPivotHelperCode, TestFieldSortValues, TestPseudoReturnFields, TestUseDocValuesAsStored2, ResponseLogComponentTest, TestSubQueryTransformer, TestImplicitCoreProperties, JsonLoaderTest, TestNRTOpen, ZkStateWriterTest, UUIDFieldTest, TestReRankQParserPlugin, XsltUpdateRequestHandlerTest, URLClassifyProcessorTest, AlternateDirectoryTest, ZkNodePropsTest, DistributedQueueTest, TestClassicSimilarityFactory, TestJsonRequest, TestHashQParserPlugin, TestCrossCoreJoin, HdfsDirectoryTest, CachingDirectoryFactoryTest, SparseHLLTest, TestBackupRepositoryFactory, QueryElevationComponentTest, TestConfigReload, CursorMarkTest, BlockJoinFacetDistribTest, TestPerFieldSimilarityClassic, TestReqParamsAPI, ReturnFieldsTest, TestLocalFSCloudBackupRestore, TestRandomFaceting, CheckHdfsIndexTest, BigEndianAscendingWordSerializerTest, TestRealTimeGet, TestCloudSchemaless, IgnoreCommitOptimizeUpdateProcessorFactoryTest, CollectionsAPISolrJTest, ActionThrottleTest, GraphQueryTest, TestPhraseSuggestions, RemoteQueryErrorTest, RulesTest, OverseerTaskQueueTest, TestConfig, TestCollapseQParserPlugin, CursorPagingTest, TestSolr4Spatial2, PrimUtilsTest, TestConfigSetsAPIExclusivity, PeerSyncTest, TestFieldTypeResource, TestSolrConfigHandler, TestSolrConfigHandlerCloud, DefaultValueUpdateProcessorTest, HdfsNNFailoverTest, SynonymTokenizerTest, TestArbitraryIndexDir, CdcrBootstrapTest, TestManagedSchemaAPI, DistributedExpandComponentTest, BasicDistributedZkTest, RestartWhileUpdatingTest, TestManagedStopFilterFactory, SolrCloudExampleTest, TestLMDirichletSimilarityFactory, TestSolrCoreSnapshots, DeleteReplicaTest, SolrCoreTest, TestRandomDVFaceting, BooleanFieldTest, TestQueryWrapperFilter, TestReplicationHandler, SaslZkACLProviderTest, TestStressUserVersions, TestOmitPositions, TestFaceting, TestFunctionQuery, TestNumericTerms64, IndexSchemaTest, BlockCacheTest, HdfsTlogReplayBufferedWhileIndexingTest, DistributedQueryElevationComponentTest, TestRTGBase, TestBulkSchemaAPI, DistributedSpellCheckComponentTest, TestDocSet, TestFoldingMultitermQuery, ConjunctionSolrSpellCheckerTest, SortSpecParsingTest, CleanupOldIndexTest, TestFastOutputStream, CurrencyFieldOpenExchangeTest, DocValuesMissingTest, TestRequestStatusCollectionAPI, DistribCursorPagingTest, CollectionStateFormat2Test, IndexSchemaRuntimeFieldTest, DateFieldTest, ConnectionManagerTest, LeaderElectionIntegrationTest, RecoveryZkTest, ZkSolrClientTest, AutoCommitTest]
   [junit4] Completed [317/631 (1!)] on J0 in 14.66s, 3 tests, 1 failure, 1 error <<< FAILURES!

[...truncated 50787 lines...]