You are viewing a plain text version of this content. The canonical link for it is here.
Posted to builds@beam.apache.org by Apache Jenkins Server <je...@builds.apache.org> on 2019/04/24 19:06:13 UTC
Build failed in Jenkins: beam_PerformanceTests_MongoDBIO_IT #1562
See <https://builds.apache.org/job/beam_PerformanceTests_MongoDBIO_IT/1562/display/redirect?page=changes>
Changes:
[kcweaver] [BEAM-6760] website: disable testing external links by default
[kcweaver] add website postcommit test that checks external links
[daniel.o.programmer] [BEAM-7087] Creating "errors" package internal to Beam Go SDK
[amaliujia] [SQL] expose a public entry for toRowList.
[bhulette] Add null check to fieldToAvatica
[thw] [BEAM-7015] Remove duplicate standard_coders.yaml
------------------------------------------
[...truncated 331.43 KB...]
INFO: 2019-04-24T19:04:58.857Z: Fusing unzipped copy of PAssert$0/GroupGlobally/GatherAllOutputs/GroupByKey/Reify, through flatten Calculate hashcode/Flatten.PCollections/Unzipped-3, into producer PAssert$0/GroupGlobally/GatherAllOutputs/Window.Into()/Window.Assign
Apr 24, 2019 7:05:04 PM org.apache.beam.runners.dataflow.util.MonitoringUtil$LoggingHandler process
INFO: 2019-04-24T19:04:58.920Z: Fusing consumer PAssert$0/GroupGlobally/GatherAllOutputs/GroupByKey/Reify into PAssert$0/GroupGlobally/GatherAllOutputs/Window.Into()/Window.Assign
Apr 24, 2019 7:05:04 PM org.apache.beam.runners.dataflow.util.MonitoringUtil$LoggingHandler process
INFO: 2019-04-24T19:04:58.974Z: Fusing consumer Calculate hashcode/Combine.perKey(Hashing)/GroupByKey/Write into Calculate hashcode/Combine.perKey(Hashing)/GroupByKey/Reify
Apr 24, 2019 7:05:04 PM org.apache.beam.runners.dataflow.util.MonitoringUtil$LoggingHandler process
INFO: 2019-04-24T19:04:59.033Z: Fusing consumer Calculate hashcode/WithKeys/AddKeys/Map into Map documents to Strings/Map
Apr 24, 2019 7:05:04 PM org.apache.beam.runners.dataflow.util.MonitoringUtil$LoggingHandler process
INFO: 2019-04-24T19:04:59.094Z: Fusing consumer Collect read time metrics into Read all documents/Read(BoundedMongoDbSource)
Apr 24, 2019 7:05:04 PM org.apache.beam.runners.dataflow.util.MonitoringUtil$LoggingHandler process
INFO: 2019-04-24T19:04:59.144Z: Fusing consumer Calculate hashcode/Combine.perKey(Hashing)/Combine.GroupedValues into Calculate hashcode/Combine.perKey(Hashing)/GroupByKey/Read
Apr 24, 2019 7:05:04 PM org.apache.beam.runners.dataflow.util.MonitoringUtil$LoggingHandler process
INFO: 2019-04-24T19:04:59.188Z: Fusing consumer Calculate hashcode/Values/Values/Map into Calculate hashcode/Combine.perKey(Hashing)/Combine.GroupedValues/Extract
Apr 24, 2019 7:05:04 PM org.apache.beam.runners.dataflow.util.MonitoringUtil$LoggingHandler process
INFO: 2019-04-24T19:04:59.263Z: Fusing consumer Calculate hashcode/Combine.perKey(Hashing)/GroupByKey/Reify into Calculate hashcode/Combine.perKey(Hashing)/GroupByKey+Calculate hashcode/Combine.perKey(Hashing)/Combine.GroupedValues/Partial
Apr 24, 2019 7:05:04 PM org.apache.beam.runners.dataflow.util.MonitoringUtil$LoggingHandler process
INFO: 2019-04-24T19:04:59.305Z: Fusing consumer Map documents to Strings/Map into Collect read time metrics
Apr 24, 2019 7:05:04 PM org.apache.beam.runners.dataflow.util.MonitoringUtil$LoggingHandler process
INFO: 2019-04-24T19:04:59.348Z: Fusing consumer Calculate hashcode/Combine.perKey(Hashing)/Combine.GroupedValues/Extract into Calculate hashcode/Combine.perKey(Hashing)/Combine.GroupedValues
Apr 24, 2019 7:05:04 PM org.apache.beam.runners.dataflow.util.MonitoringUtil$LoggingHandler process
INFO: 2019-04-24T19:04:59.426Z: Fusing consumer Calculate hashcode/Combine.perKey(Hashing)/GroupByKey+Calculate hashcode/Combine.perKey(Hashing)/Combine.GroupedValues/Partial into Calculate hashcode/WithKeys/AddKeys/Map
Apr 24, 2019 7:05:04 PM org.apache.beam.runners.dataflow.util.MonitoringUtil$LoggingHandler process
INFO: 2019-04-24T19:04:59.470Z: Fusing consumer Calculate hashcode/ProduceDefault into Calculate hashcode/CreateVoid/Read(CreateSource)
Apr 24, 2019 7:05:04 PM org.apache.beam.runners.dataflow.util.MonitoringUtil$LoggingHandler process
INFO: 2019-04-24T19:04:59.535Z: Fusing consumer PAssert$0/GroupGlobally/GroupDummyAndContents/Reify into PAssert$0/GroupGlobally/WindowIntoDummy/Window.Assign
Apr 24, 2019 7:05:04 PM org.apache.beam.runners.dataflow.util.MonitoringUtil$LoggingHandler process
INFO: 2019-04-24T19:04:59.596Z: Fusing consumer PAssert$0/GroupGlobally/GroupDummyAndContents/Write into PAssert$0/GroupGlobally/GroupDummyAndContents/Reify
Apr 24, 2019 7:05:04 PM org.apache.beam.runners.dataflow.util.MonitoringUtil$LoggingHandler process
INFO: 2019-04-24T19:04:59.658Z: Fusing consumer PAssert$0/GroupGlobally/WindowIntoDummy/Window.Assign into PAssert$0/GroupGlobally/Create.Values/Read(CreateSource)
Apr 24, 2019 7:05:04 PM org.apache.beam.runners.dataflow.util.MonitoringUtil$LoggingHandler process
INFO: 2019-04-24T19:05:00.392Z: Executing operation PAssert$0/GroupGlobally/GatherAllOutputs/GroupByKey/Create
Apr 24, 2019 7:05:04 PM org.apache.beam.runners.dataflow.util.MonitoringUtil$LoggingHandler process
INFO: 2019-04-24T19:05:00.454Z: Executing operation PAssert$0/GroupGlobally/GroupDummyAndContents/Create
Apr 24, 2019 7:05:04 PM org.apache.beam.runners.dataflow.util.MonitoringUtil$LoggingHandler process
INFO: 2019-04-24T19:05:00.518Z: Executing operation Calculate hashcode/Combine.perKey(Hashing)/GroupByKey/Create
Apr 24, 2019 7:05:04 PM org.apache.beam.runners.dataflow.util.MonitoringUtil$LoggingHandler process
INFO: 2019-04-24T19:05:00.531Z: Starting 1 workers in us-central1-a...
Apr 24, 2019 7:05:04 PM org.apache.beam.runners.dataflow.util.MonitoringUtil$LoggingHandler process
INFO: 2019-04-24T19:05:01.033Z: Executing operation Read all documents/Read(BoundedMongoDbSource)+Collect read time metrics+Map documents to Strings/Map+Calculate hashcode/WithKeys/AddKeys/Map+Calculate hashcode/Combine.perKey(Hashing)/GroupByKey+Calculate hashcode/Combine.perKey(Hashing)/Combine.GroupedValues/Partial+Calculate hashcode/Combine.perKey(Hashing)/GroupByKey/Reify+Calculate hashcode/Combine.perKey(Hashing)/GroupByKey/Write
Apr 24, 2019 7:05:04 PM org.apache.beam.runners.dataflow.util.MonitoringUtil$LoggingHandler process
INFO: 2019-04-24T19:05:01.118Z: Executing operation PAssert$0/GroupGlobally/Create.Values/Read(CreateSource)+PAssert$0/GroupGlobally/WindowIntoDummy/Window.Assign+PAssert$0/GroupGlobally/GroupDummyAndContents/Reify+PAssert$0/GroupGlobally/GroupDummyAndContents/Write
Apr 24, 2019 7:05:40 PM org.apache.beam.runners.dataflow.util.MonitoringUtil$LoggingHandler process
INFO: 2019-04-24T19:05:39.411Z: Workers have started successfully.
Apr 24, 2019 7:05:52 PM org.apache.beam.runners.dataflow.util.MonitoringUtil$LoggingHandler process
INFO: 2019-04-24T19:05:50.750Z: Autoscaling: Raised the number of workers to 1 based on the rate of progress in the currently running step(s).
Apr 24, 2019 7:06:09 PM org.apache.beam.runners.dataflow.DataflowPipelineJob lambda$waitUntilFinish$0
WARNING: Job is already running in Google Cloud Platform, Ctrl-C will not cancel it.
To cancel the job in the cloud, run:
> gcloud dataflow jobs --project=apache-beam-testing cancel --region=us-central1 2019-04-24_12_04_44-16919424277233160441
org.apache.beam.sdk.io.mongodb.MongoDBIOIT > testWriteAndRead SKIPPED
> Task :beam-sdks-java-io-mongodb:integrationTest FAILED
:beam-sdks-java-io-mongodb:integrationTest (Thread[Execution worker for ':' Thread 6,5,main]) completed. Took 9 mins 2.293 secs.
Deprecated Gradle features were used in this build, making it incompatible with Gradle 6.0.
Use '--warning-mode all' to show the individual deprecation warnings.
See https://docs.gradle.org/5.2.1/userguide/command_line_interface.html#sec:command_line_warnings
79 actionable tasks: 2 executed, 77 up-to-date
Publishing build scan...
STDERR:
FAILURE: Build failed with an exception.
* What went wrong:
Execution failed for task ':beam-sdks-java-io-mongodb:integrationTest'.
> Process 'Gradle Test Executor 1' finished with non-zero exit value 143
This problem might be caused by incorrect test process configuration.
Please refer to the test execution section in the User Manual at https://docs.gradle.org/5.2.1/userguide/java_testing.html#sec:test_execution
* Try:
Run with --debug option to get more log output. Run with --scan to get full insights.
* Exception is:
org.gradle.api.tasks.TaskExecutionException: Execution failed for task ':beam-sdks-java-io-mongodb:integrationTest'.
at org.gradle.api.internal.tasks.execution.ExecuteActionsTaskExecuter$2.accept(ExecuteActionsTaskExecuter.java:121)
at org.gradle.api.internal.tasks.execution.ExecuteActionsTaskExecuter$2.accept(ExecuteActionsTaskExecuter.java:117)
at org.gradle.internal.Try$Failure.ifSuccessfulOrElse(Try.java:184)
at org.gradle.api.internal.tasks.execution.ExecuteActionsTaskExecuter.execute(ExecuteActionsTaskExecuter.java:110)
at org.gradle.api.internal.tasks.execution.ResolveIncrementalChangesTaskExecuter.execute(ResolveIncrementalChangesTaskExecuter.java:84)
at org.gradle.api.internal.tasks.execution.ResolveTaskOutputCachingStateExecuter.execute(ResolveTaskOutputCachingStateExecuter.java:91)
at org.gradle.api.internal.tasks.execution.FinishSnapshotTaskInputsBuildOperationTaskExecuter.execute(FinishSnapshotTaskInputsBuildOperationTaskExecuter.java:51)
at org.gradle.api.internal.tasks.execution.ResolveBuildCacheKeyExecuter.execute(ResolveBuildCacheKeyExecuter.java:102)
at org.gradle.api.internal.tasks.execution.ResolveBeforeExecutionStateTaskExecuter.execute(ResolveBeforeExecutionStateTaskExecuter.java:74)
at org.gradle.api.internal.tasks.execution.ValidatingTaskExecuter.execute(ValidatingTaskExecuter.java:58)
at org.gradle.api.internal.tasks.execution.SkipEmptySourceFilesTaskExecuter.execute(SkipEmptySourceFilesTaskExecuter.java:109)
at org.gradle.api.internal.tasks.execution.ResolveBeforeExecutionOutputsTaskExecuter.execute(ResolveBeforeExecutionOutputsTaskExecuter.java:67)
at org.gradle.api.internal.tasks.execution.StartSnapshotTaskInputsBuildOperationTaskExecuter.execute(StartSnapshotTaskInputsBuildOperationTaskExecuter.java:52)
at org.gradle.api.internal.tasks.execution.ResolveAfterPreviousExecutionStateTaskExecuter.execute(ResolveAfterPreviousExecutionStateTaskExecuter.java:46)
at org.gradle.api.internal.tasks.execution.CleanupStaleOutputsExecuter.execute(CleanupStaleOutputsExecuter.java:93)
at org.gradle.api.internal.tasks.execution.FinalizePropertiesTaskExecuter.execute(FinalizePropertiesTaskExecuter.java:45)
at org.gradle.api.internal.tasks.execution.ResolveTaskExecutionModeExecuter.execute(ResolveTaskExecutionModeExecuter.java:94)
at org.gradle.api.internal.tasks.execution.SkipTaskWithNoActionsExecuter.execute(SkipTaskWithNoActionsExecuter.java:57)
at org.gradle.api.internal.tasks.execution.SkipOnlyIfTaskExecuter.execute(SkipOnlyIfTaskExecuter.java:56)
at org.gradle.api.internal.tasks.execution.CatchExceptionTaskExecuter.execute(CatchExceptionTaskExecuter.java:36)
at org.gradle.api.internal.tasks.execution.EventFiringTaskExecuter$1.executeTask(EventFiringTaskExecuter.java:63)
at org.gradle.api.internal.tasks.execution.EventFiringTaskExecuter$1.call(EventFiringTaskExecuter.java:49)
at org.gradle.api.internal.tasks.execution.EventFiringTaskExecuter$1.call(EventFiringTaskExecuter.java:46)
at org.gradle.internal.operations.DefaultBuildOperationExecutor$CallableBuildOperationWorker.execute(DefaultBuildOperationExecutor.java:416)
at org.gradle.internal.operations.DefaultBuildOperationExecutor$CallableBuildOperationWorker.execute(DefaultBuildOperationExecutor.java:406)
at org.gradle.internal.operations.DefaultBuildOperationExecutor$1.execute(DefaultBuildOperationExecutor.java:165)
at org.gradle.internal.operations.DefaultBuildOperationExecutor.execute(DefaultBuildOperationExecutor.java:250)
at org.gradle.internal.operations.DefaultBuildOperationExecutor.execute(DefaultBuildOperationExecutor.java:158)
at org.gradle.internal.operations.DefaultBuildOperationExecutor.call(DefaultBuildOperationExecutor.java:102)
at org.gradle.internal.operations.DelegatingBuildOperationExecutor.call(DelegatingBuildOperationExecutor.java:36)
at org.gradle.api.internal.tasks.execution.EventFiringTaskExecuter.execute(EventFiringTaskExecuter.java:46)
at org.gradle.execution.plan.LocalTaskNodeExecutor.execute(LocalTaskNodeExecutor.java:43)
at org.gradle.execution.taskgraph.DefaultTaskExecutionGraph$InvokeNodeExecutorsAction.execute(DefaultTaskExecutionGraph.java:355)
at org.gradle.execution.taskgraph.DefaultTaskExecutionGraph$InvokeNodeExecutorsAction.execute(DefaultTaskExecutionGraph.java:343)
at org.gradle.execution.taskgraph.DefaultTaskExecutionGraph$BuildOperationAwareExecutionAction.execute(DefaultTaskExecutionGraph.java:336)
at org.gradle.execution.taskgraph.DefaultTaskExecutionGraph$BuildOperationAwareExecutionAction.execute(DefaultTaskExecutionGraph.java:322)
at org.gradle.execution.plan.DefaultPlanExecutor$ExecutorWorker$1.execute(DefaultPlanExecutor.java:134)
at org.gradle.execution.plan.DefaultPlanExecutor$ExecutorWorker$1.execute(DefaultPlanExecutor.java:129)
at org.gradle.execution.plan.DefaultPlanExecutor$ExecutorWorker.execute(DefaultPlanExecutor.java:202)
at org.gradle.execution.plan.DefaultPlanExecutor$ExecutorWorker.executeNextNode(DefaultPlanExecutor.java:193)
at org.gradle.execution.plan.DefaultPlanExecutor$ExecutorWorker.run(DefaultPlanExecutor.java:129)
at org.gradle.internal.concurrent.ExecutorPolicy$CatchAndRecordFailures.onExecute(ExecutorPolicy.java:63)
at org.gradle.internal.concurrent.ManagedExecutorImpl$1.run(ManagedExecutorImpl.java:46)
at org.gradle.internal.concurrent.ThreadFactoryImpl$ManagedThreadRunnable.run(ThreadFactoryImpl.java:55)
Caused by: org.gradle.process.internal.ExecException: Process 'Gradle Test Executor 1' finished with non-zero exit value 143
This problem might be caused by incorrect test process configuration.
Please refer to the test execution section in the User Manual at https://docs.gradle.org/5.2.1/userguide/java_testing.html#sec:test_execution
at org.gradle.api.internal.tasks.testing.worker.ForkingTestClassProcessor.stop(ForkingTestClassProcessor.java:163)
at org.gradle.api.internal.tasks.testing.processors.RestartEveryNTestClassProcessor.endBatch(RestartEveryNTestClassProcessor.java:77)
at org.gradle.api.internal.tasks.testing.processors.RestartEveryNTestClassProcessor.stop(RestartEveryNTestClassProcessor.java:62)
at org.gradle.internal.dispatch.ReflectionDispatch.dispatch(ReflectionDispatch.java:35)
at org.gradle.internal.dispatch.ReflectionDispatch.dispatch(ReflectionDispatch.java:24)
at org.gradle.internal.dispatch.FailureHandlingDispatch.dispatch(FailureHandlingDispatch.java:29)
at org.gradle.internal.dispatch.AsyncDispatch.dispatchMessages(AsyncDispatch.java:87)
at org.gradle.internal.dispatch.AsyncDispatch.access$000(AsyncDispatch.java:36)
at org.gradle.internal.dispatch.AsyncDispatch$1.run(AsyncDispatch.java:71)
at org.gradle.internal.concurrent.InterruptibleRunnable.run(InterruptibleRunnable.java:42)
at org.gradle.internal.operations.CurrentBuildOperationPreservingRunnable.run(CurrentBuildOperationPreservingRunnable.java:42)
... 3 more
* Get more help at https://help.gradle.org
BUILD FAILED in 9m 5s
The message received from the daemon indicates that the daemon has disappeared.
Build request sent: Build{id=fb44eda7-e68a-455f-81cb-751a3ad89a67, currentDir=<https://builds.apache.org/job/beam_PerformanceTests_MongoDBIO_IT/ws/src}>
Attempting to read last messages from the daemon log...
Daemon pid: 28686
log file: /home/jenkins/.gradle/daemon/5.2.1/daemon-28686.out.log
----- Last 20 lines from daemon log file - daemon-28686.out.log -----
at org.gradle.internal.dispatch.FailureHandlingDispatch.dispatch(FailureHandlingDispatch.java:29)
at org.gradle.internal.dispatch.AsyncDispatch.dispatchMessages(AsyncDispatch.java:87)
at org.gradle.internal.dispatch.AsyncDispatch.access$000(AsyncDispatch.java:36)
at org.gradle.internal.dispatch.AsyncDispatch$1.run(AsyncDispatch.java:71)
at org.gradle.internal.concurrent.InterruptibleRunnable.run(InterruptibleRunnable.java:42)
at org.gradle.internal.operations.CurrentBuildOperationPreservingRunnable.run(CurrentBuildOperationPreservingRunnable.java:42)
... 3 more
* Get more help at https://help.gradle.org
Deprecated Gradle features were used in this build, making it incompatible with Gradle 6.0.
Use '--warning-mode all' to show the individual deprecation warnings.
See https://docs.gradle.org/5.2.1/userguide/command_line_interface.html#sec:command_line_warnings
BUILD FAILED in 9m 5s
79 actionable tasks: 2 executed, 77 up-to-date
Publishing build scan...
Daemon vm is shutting down... The daemon has exited normally or was terminated in response to a user interrupt.
----- End of the daemon log -----
FAILURE: Build failed with an exception.
* What went wrong:
Gradle build daemon disappeared unexpectedly (it may have been killed or may have crashed)
* Try:
Run with --debug option to get more log output. Run with --scan to get full insights.
* Exception is:
org.gradle.launcher.daemon.client.DaemonDisappearedException: Gradle build daemon disappeared unexpectedly (it may have been killed or may have crashed)
at org.gradle.launcher.daemon.client.DaemonClient.handleDaemonDisappearance(DaemonClient.java:241)
at org.gradle.launcher.daemon.client.DaemonClient.monitorBuild(DaemonClient.java:217)
at org.gradle.launcher.daemon.client.DaemonClient.executeBuild(DaemonClient.java:179)
at org.gradle.launcher.daemon.client.DaemonClient.execute(DaemonClient.java:142)
at org.gradle.launcher.daemon.client.DaemonClient.execute(DaemonClient.java:94)
at org.gradle.launcher.cli.RunBuildAction.run(RunBuildAction.java:55)
at org.gradle.internal.Actions$RunnableActionAdapter.execute(Actions.java:207)
at org.gradle.launcher.cli.CommandLineActionFactory$ParseAndBuildAction.execute(CommandLineActionFactory.java:403)
at org.gradle.launcher.cli.CommandLineActionFactory$ParseAndBuildAction.execute(CommandLineActionFactory.java:376)
at org.gradle.launcher.cli.ExceptionReportingAction.execute(ExceptionReportingAction.java:37)
at org.gradle.launcher.cli.ExceptionReportingAction.execute(ExceptionReportingAction.java:23)
at org.gradle.launcher.cli.CommandLineActionFactory$WithLogging.execute(CommandLineActionFactory.java:369)
at org.gradle.launcher.cli.CommandLineActionFactory$WithLogging.execute(CommandLineActionFactory.java:299)
at org.gradle.launcher.Main.doAction(Main.java:36)
at org.gradle.launcher.bootstrap.EntryPoint.run(EntryPoint.java:45)
at sun.reflect.NativeMethodAccessorImpl.invoke0(Native Method)
at sun.reflect.NativeMethodAccessorImpl.invoke(NativeMethodAccessorImpl.java:62)
at sun.reflect.DelegatingMethodAccessorImpl.invoke(DelegatingMethodAccessorImpl.java:43)
at java.lang.reflect.Method.invoke(Method.java:498)
at org.gradle.launcher.bootstrap.ProcessBootstrap.runNoExit(ProcessBootstrap.java:60)
at org.gradle.launcher.bootstrap.ProcessBootstrap.run(ProcessBootstrap.java:37)
at org.gradle.launcher.GradleMain.main(GradleMain.java:23)
at sun.reflect.NativeMethodAccessorImpl.invoke0(Native Method)
at sun.reflect.NativeMethodAccessorImpl.invoke(NativeMethodAccessorImpl.java:62)
at sun.reflect.DelegatingMethodAccessorImpl.invoke(DelegatingMethodAccessorImpl.java:43)
at java.lang.reflect.Method.invoke(Method.java:498)
at org.gradle.wrapper.BootstrapMainStarter.start(BootstrapMainStarter.java:31)
at org.gradle.wrapper.WrapperExecutor.execute(WrapperExecutor.java:108)
at org.gradle.wrapper.GradleWrapperMain.main(GradleWrapperMain.java:61)
* Get more help at https://help.gradle.org
2019-04-24 19:06:11,666 32456dc1 MainThread beam_integration_benchmark(1/1) ERROR Error during benchmark beam_integration_benchmark
Traceback (most recent call last):
File "<https://builds.apache.org/job/beam_PerformanceTests_MongoDBIO_IT/ws/PerfKitBenchmarker/perfkitbenchmarker/pkb.py",> line 760, in RunBenchmark
DoRunPhase(spec, collector, detailed_timer)
File "<https://builds.apache.org/job/beam_PerformanceTests_MongoDBIO_IT/ws/PerfKitBenchmarker/perfkitbenchmarker/pkb.py",> line 609, in DoRunPhase
samples = spec.BenchmarkRun(spec)
File "<https://builds.apache.org/job/beam_PerformanceTests_MongoDBIO_IT/ws/PerfKitBenchmarker/perfkitbenchmarker/linux_benchmarks/beam_integration_benchmark.py",> line 160, in Run
job_type=job_type)
File "<https://builds.apache.org/job/beam_PerformanceTests_MongoDBIO_IT/ws/PerfKitBenchmarker/perfkitbenchmarker/providers/gcp/gcp_dpb_dataflow.py",> line 90, in SubmitJob
assert retcode == 0, "Integration Test Failed."
AssertionError: Integration Test Failed.
2019-04-24 19:06:11,667 32456dc1 MainThread beam_integration_benchmark(1/1) INFO Cleaning up benchmark beam_integration_benchmark
2019-04-24 19:06:11,668 32456dc1 MainThread beam_integration_benchmark(1/1) INFO Running: kubectl --kubeconfig=<https://builds.apache.org/job/beam_PerformanceTests_MongoDBIO_IT/ws/config-beam-performancetests-mongodbio-it-1562> delete -f <https://builds.apache.org/job/beam_PerformanceTests_MongoDBIO_IT/ws/src/.test-infra/kubernetes/mongodb/load-balancer/mongo.yml> --ignore-not-found
2019-04-24 19:06:12,629 32456dc1 MainThread beam_integration_benchmark(1/1) ERROR Exception running benchmark
Traceback (most recent call last):
File "<https://builds.apache.org/job/beam_PerformanceTests_MongoDBIO_IT/ws/PerfKitBenchmarker/perfkitbenchmarker/pkb.py",> line 903, in RunBenchmarkTask
RunBenchmark(spec, collector)
File "<https://builds.apache.org/job/beam_PerformanceTests_MongoDBIO_IT/ws/PerfKitBenchmarker/perfkitbenchmarker/pkb.py",> line 760, in RunBenchmark
DoRunPhase(spec, collector, detailed_timer)
File "<https://builds.apache.org/job/beam_PerformanceTests_MongoDBIO_IT/ws/PerfKitBenchmarker/perfkitbenchmarker/pkb.py",> line 609, in DoRunPhase
samples = spec.BenchmarkRun(spec)
File "<https://builds.apache.org/job/beam_PerformanceTests_MongoDBIO_IT/ws/PerfKitBenchmarker/perfkitbenchmarker/linux_benchmarks/beam_integration_benchmark.py",> line 160, in Run
job_type=job_type)
File "<https://builds.apache.org/job/beam_PerformanceTests_MongoDBIO_IT/ws/PerfKitBenchmarker/perfkitbenchmarker/providers/gcp/gcp_dpb_dataflow.py",> line 90, in SubmitJob
assert retcode == 0, "Integration Test Failed."
AssertionError: Integration Test Failed.
2019-04-24 19:06:12,630 32456dc1 MainThread beam_integration_benchmark(1/1) ERROR Benchmark 1/1 beam_integration_benchmark (UID: beam_integration_benchmark0) failed. Execution will continue.
2019-04-24 19:06:12,630 32456dc1 MainThread beam_integration_benchmark(1/1) INFO Benchmark run statuses:
---------------------------------------------------------------------------------
Name UID Status Failed Substatus
---------------------------------------------------------------------------------
beam_integration_benchmark beam_integration_benchmark0 FAILED
---------------------------------------------------------------------------------
Success rate: 0.00% (0/1)
2019-04-24 19:06:12,631 32456dc1 MainThread beam_integration_benchmark(1/1) INFO Complete logs can be found at: <https://builds.apache.org/job/beam_PerformanceTests_MongoDBIO_IT/ws/runs/32456dc1/pkb.log>
2019-04-24 19:06:12,631 32456dc1 MainThread beam_integration_benchmark(1/1) INFO Completion statuses can be found at: <https://builds.apache.org/job/beam_PerformanceTests_MongoDBIO_IT/ws/runs/32456dc1/completion_statuses.json>
Build step 'Execute shell' marked build as failure
---------------------------------------------------------------------
To unsubscribe, e-mail: builds-unsubscribe@beam.apache.org
For additional commands, e-mail: builds-help@beam.apache.org
Jenkins build is back to normal :
beam_PerformanceTests_MongoDBIO_IT #1563
Posted by Apache Jenkins Server <je...@builds.apache.org>.
See <https://builds.apache.org/job/beam_PerformanceTests_MongoDBIO_IT/1563/display/redirect?page=changes>
---------------------------------------------------------------------
To unsubscribe, e-mail: builds-unsubscribe@beam.apache.org
For additional commands, e-mail: builds-help@beam.apache.org