You are viewing a plain text version of this content. The canonical link for it is here.
Posted to builds@solr.apache.org by Apache Jenkins Server <je...@builds.apache.org> on 2025/02/13 09:25:22 UTC
[JENKINS] Solr » Solr-Smoketest-9.x - Build # 615 - Failure!
Build: https://ci-builds.apache.org/job/Solr/job/Solr-Smoketest-9.x/615/
Log:
Started by timer
Running as SYSTEM
[EnvInject] - Loading node environment variables.
Building remotely on lucene-solr-2 (solr lucene) in workspace /home/jenkins/jenkins-slave/workspace/Solr/Solr-Smoketest-9.x
[WS-CLEANUP] Deleting project workspace...
[WS-CLEANUP] Deferred wipeout is used...
[WS-CLEANUP] Done
The recommended git tool is: NONE
No credentials specified
Cloning the remote Git repository
Cloning repository https://github.com/apache/solr.git
> git init /home/jenkins/jenkins-slave/workspace/Solr/Solr-Smoketest-9.x # timeout=10
Fetching upstream changes from https://github.com/apache/solr.git
> git --version # timeout=10
> git --version # 'git version 2.25.1'
> git fetch --tags --force --progress -- https://github.com/apache/solr.git +refs/heads/*:refs/remotes/origin/* # timeout=10
> git config remote.origin.url https://github.com/apache/solr.git # timeout=10
> git config --add remote.origin.fetch +refs/heads/*:refs/remotes/origin/* # timeout=10
Avoid second fetch
> git rev-parse origin/branch_9x^{commit} # timeout=10
Checking out Revision 933abef4dbe137343e196818b8d16653d70c0667 (origin/branch_9x)
> git config core.sparsecheckout # timeout=10
> git checkout -f 933abef4dbe137343e196818b8d16653d70c0667 # timeout=10
> git branch -a -v --no-abbrev # timeout=10
> git checkout -b branch_9x 933abef4dbe137343e196818b8d16653d70c0667 # timeout=10
Commit message: "SOLR-17663: Protect TimeOut from overflow. (#3173)"
> git rev-list --no-walk e9594886e8a31c7d10a7266c6307cdc0bb3a2c30 # timeout=10
No emails were triggered.
provisioning config files...
copy managed file [gradle.properties] to file:/home/jenkins/jenkins-slave/workspace/Solr/Solr-Smoketest-9.x/gradle.properties
[Gradle] - Launching build.
[Solr-Smoketest-9.x] $ /home/jenkins/jenkins-slave/workspace/Solr/Solr-Smoketest-9.x/gradlew -Dversion.suffix= -Dgradle.user.home=/home/jenkins/jenkins-slave/workspace/Solr/.gradle -Porg.gradle.daemon=false -Pvalidation.git.failOnModified=false --continue clean assembleRelease
Downloading gradle-wrapper.jar from https://raw.githubusercontent.com/gradle/gradle/v8.10.2/gradle/wrapper/gradle-wrapper.jar
To honour the JVM settings for this build a single-use Daemon process will be forked. For more on this, please refer to https://docs.gradle.org/8.10/userguide/gradle_daemon.html#sec:disabling_the_daemon in the Gradle documentation.
Daemon will be stopped at the end of the build
FAILURE: Build failed with an exception.
* What went wrong:
Could not isolate parameters org.gradle.api.internal.initialization.transform.MergeInstrumentationAnalysisTransform$Parameters_Decorated@37d0520f of artifact transform MergeInstrumentationAnalysisTransform
> Could not isolate value org.gradle.api.internal.initialization.transform.MergeInstrumentationAnalysisTransform$Parameters_Decorated@37d0520f of type MergeInstrumentationAnalysisTransform.Parameters
> A build operation failed.
Could not read workspace metadata from /home/jenkins/jenkins-slave/workspace/Solr/.gradle/caches/8.10/transforms/3984eedd80f936d2b7c18eac5bdc591a/metadata.bin
> Could not read workspace metadata from /home/jenkins/jenkins-slave/workspace/Solr/.gradle/caches/8.10/transforms/3984eedd80f936d2b7c18eac5bdc591a/metadata.bin
* Try:
> Run with --stacktrace option to get the stack trace.
> Run with --info or --debug option to get more log output.
> Run with --scan to get full insights.
> Get more help at https://help.gradle.org.
Deprecated Gradle features were used in this build, making it incompatible with Gradle 9.0.
You can use '--warning-mode all' to show the individual deprecation warnings and determine if they come from your own scripts or plugins.
For more on this, please refer to https://docs.gradle.org/8.10/userguide/command_line_interface.html#sec:command_line_warnings in the Gradle documentation.
BUILD FAILED in 9s
Build step 'Invoke Gradle script' changed build result to FAILURE
Build step 'Invoke Gradle script' marked build as failure
Email was triggered for: Failure - Any
Sending email for trigger: Failure - Any
[JENKINS] Solr » Solr-Smoketest-9.x - Build # 616 - Still Failing!
Posted by Apache Jenkins Server <je...@builds.apache.org>.
Build: https://ci-builds.apache.org/job/Solr/job/Solr-Smoketest-9.x/616/
Log:
Started by timer
Running as SYSTEM
[EnvInject] - Loading node environment variables.
Building remotely on lucene-solr-1 (solr lucene) in workspace /home/jenkins/jenkins-slave/workspace/Solr/Solr-Smoketest-9.x
[WS-CLEANUP] Deleting project workspace...
[WS-CLEANUP] Deferred wipeout is used...
[WS-CLEANUP] Done
The recommended git tool is: NONE
No credentials specified
Cloning the remote Git repository
Cloning repository https://github.com/apache/solr.git
> git init /home/jenkins/jenkins-slave/workspace/Solr/Solr-Smoketest-9.x # timeout=10
Fetching upstream changes from https://github.com/apache/solr.git
> git --version # timeout=10
> git --version # 'git version 2.17.1'
> git fetch --tags --progress -- https://github.com/apache/solr.git +refs/heads/*:refs/remotes/origin/* # timeout=10
> git config remote.origin.url https://github.com/apache/solr.git # timeout=10
> git config --add remote.origin.fetch +refs/heads/*:refs/remotes/origin/* # timeout=10
Avoid second fetch
> git rev-parse origin/branch_9x^{commit} # timeout=10
Checking out Revision 9af999a2b7c5fe800d10312896f6458cad5bc252 (origin/branch_9x)
> git config core.sparsecheckout # timeout=10
> git checkout -f 9af999a2b7c5fe800d10312896f6458cad5bc252 # timeout=10
> git branch -a -v --no-abbrev # timeout=10
> git checkout -b branch_9x 9af999a2b7c5fe800d10312896f6458cad5bc252 # timeout=10
Commit message: "SOLR-17630 Add SolrCloudManager.getSolrClient (#3049)"
> git rev-list --no-walk 933abef4dbe137343e196818b8d16653d70c0667 # timeout=10
No emails were triggered.
provisioning config files...
copy managed file [gradle.properties] to file:/home/jenkins/jenkins-slave/workspace/Solr/Solr-Smoketest-9.x/gradle.properties
[Gradle] - Launching build.
[Solr-Smoketest-9.x] $ /home/jenkins/jenkins-slave/workspace/Solr/Solr-Smoketest-9.x/gradlew -Dversion.suffix= -Dgradle.user.home=/home/jenkins/jenkins-slave/workspace/Solr/.gradle -Porg.gradle.daemon=false -Pvalidation.git.failOnModified=false --continue clean assembleRelease
Downloading gradle-wrapper.jar from https://raw.githubusercontent.com/gradle/gradle/v8.10.2/gradle/wrapper/gradle-wrapper.jar
To honour the JVM settings for this build a single-use Daemon process will be forked. For more on this, please refer to https://docs.gradle.org/8.10/userguide/gradle_daemon.html#sec:disabling_the_daemon in the Gradle documentation.
Daemon will be stopped at the end of the build
> Task :buildSrc:compileJava
Note: /home/jenkins/jenkins-slave/workspace/Solr/Solr-Smoketest-9.x/buildSrc/src/main/java/org/apache/lucene/gradle/Checksum.java uses or overrides a deprecated API.
Note: Recompile with -Xlint:deprecation for details.
> Task :buildSrc:compileGroovy NO-SOURCE
> Task :buildSrc:processResources NO-SOURCE
> Task :buildSrc:classes
> Task :buildSrc:jar
> Task :clean
> Task :solr:clean UP-TO-DATE
> Task :solr:api:clean
> Task :solr:benchmark:clean
> Task :solr:core:clean
> Task :solr:cross-dc-manager:clean
> Task :solr:distribution:clean UP-TO-DATE
> Task :solr:docker:clean UP-TO-DATE
> Task :solr:documentation:clean UP-TO-DATE
> Task :solr:example:clean UP-TO-DATE
> Task :solr:modules:clean UP-TO-DATE
> Task :solr:packaging:clean UP-TO-DATE
> Task :solr:prometheus-exporter:clean
> Task :solr:server:clean
> Task :solr:solr-ref-guide:clean
> Task :solr:solrj:clean
> Task :solr:solrj-streaming:clean
> Task :solr:solrj-zookeeper:clean
> Task :solr:test-framework:clean
> Task :solr:webapp:clean
> Task :solr:modules:analysis-extras:clean
> Task :solr:modules:analytics:clean
> Task :solr:modules:clustering:clean
> Task :solr:modules:cross-dc:clean
> Task :solr:modules:extraction:clean
> Task :solr:modules:gcs-repository:clean
> Task :solr:modules:hadoop-auth:clean
> Task :solr:modules:hdfs:clean
> Task :solr:modules:jaegertracer-configurator:clean
> Task :solr:modules:jwt-auth:clean
> Task :solr:modules:langid:clean
> Task :solr:modules:llm:clean
> Task :solr:modules:ltr:clean
> Task :solr:modules:opentelemetry:clean
> Task :solr:modules:s3-repository:clean
> Task :solr:modules:scripting:clean
> Task :solr:modules:sql:clean
> Task :mavenLocalClean UP-TO-DATE
> Task :solr-missing-doclet:compileJava
> Task :solr-missing-doclet:processResources NO-SOURCE
> Task :solr-missing-doclet:classes
> Task :solr-missing-doclet:jar
> Task :gitStatus
> Task :checkJdkInternalsExportedToGradle
> Task :solr:api:compileJava
> Task :solr:api:processResources NO-SOURCE
> Task :solr:api:classes
> Task :solr:api:jar
> Task :solr:api:generateMetadataFileForJarsPublication SKIPPED
> Task :solr:api:generatePomFileForJarsPublication
> Task :solr:api:renderJavadoc
> Task :solr:api:javadoc SKIPPED
> Task :solr:api:javadocJar
> Task :solr:api:sourcesJar
> Task :solr:api:signJarsPublication SKIPPED
> Task :solr:api:publishJarsPublicationToBuildRepository
> Task :solr:api:resolve
SLF4J(W): No SLF4J providers were found.
SLF4J(W): Defaulting to no-operation (NOP) logger implementation
SLF4J(W): See https://www.slf4j.org/codes.html#noProviders for further details.
> Task :solr:solrj:openApiGenerate
Cleaned up output directory /home/jenkins/jenkins-slave/workspace/Solr/Solr-Smoketest-9.x/solr/solrj/build/generated/ before code generation (cleanupOutput set to true).
Multiple schemas found in the OAS 'content' section, returning only the first one (application/json)
Multiple schemas found in the OAS 'content' section, returning only the first one (application/json)
Multiple schemas found in the OAS 'content' section, returning only the first one (application/vnd.apache.solr.raw)
Multiple schemas found in the OAS 'content' section, returning only the first one (application/vnd.apache.solr.raw)
################################################################################
# Thanks for using OpenAPI Generator. #
# Please consider donation to help us maintain this project 🙏 #
# https://opencollective.com/openapi_generator/donate #
################################################################################
Successfully generated code to /home/jenkins/jenkins-slave/workspace/Solr/Solr-Smoketest-9.x/solr/solrj/build/generated/
> Task :spotlessInternalRegisterDependencies
> Task :solr:solrj:generatedSpotlessHelper
> Task :solr:solrj:generatedSpotless
> Task :solr:solrj:compileJava
Note: Some input files use or override a deprecated API.
Note: Recompile with -Xlint:deprecation for details.
> Task :solr:solrj-streaming:compileJava
Note: Some input files use or override a deprecated API.
Note: Recompile with -Xlint:deprecation for details.
> Task :solr:solrj-zookeeper:compileJava
Note: Some input files use or override a deprecated API.
Note: Recompile with -Xlint:deprecation for details.
> Task :solr:core:compileJava
Note: Some input files use or override a deprecated API.
Note: Recompile with -Xlint:deprecation for details.
> Task :solr:core:processResources
> Task :solr:core:classes
> Task :solr:core:jar
> Task :solr:core:generateMetadataFileForJarsPublication SKIPPED
> Task :solr:core:generatePomFileForJarsPublication
> Task :solr:solrj:renderJavadoc
> Task :solr:solrj-streaming:renderJavadoc
> Task :solr:solrj-zookeeper:renderJavadoc
> Task :solr:core:renderJavadoc
> Task :solr:core:javadoc SKIPPED
> Task :solr:core:javadocJar
> Task :solr:core:sourcesJar
> Task :solr:core:signJarsPublication SKIPPED
> Task :solr:core:publishJarsPublicationToBuildRepository
> Task :solr:modules:cross-dc:compileJava
Note: Some input files use or override a deprecated API.
Note: Recompile with -Xlint:deprecation for details.
> Task :solr:cross-dc-manager:compileJava
Note: /home/jenkins/jenkins-slave/workspace/Solr/Solr-Smoketest-9.x/solr/cross-dc-manager/src/java/org/apache/solr/crossdc/manager/consumer/Util.java uses or overrides a deprecated API.
Note: Recompile with -Xlint:deprecation for details.
> Task :solr:cross-dc-manager:processResources NO-SOURCE
> Task :solr:cross-dc-manager:classes
> Task :solr:cross-dc-manager:jar
> Task :solr:cross-dc-manager:generateMetadataFileForJarsPublication SKIPPED
> Task :solr:cross-dc-manager:generatePomFileForJarsPublication
> Task :solr:modules:cross-dc:renderJavadoc
> Task :solr:cross-dc-manager:renderJavadoc
> Task :solr:cross-dc-manager:javadoc SKIPPED
> Task :solr:cross-dc-manager:javadocJar
> Task :solr:cross-dc-manager:sourcesJar
> Task :solr:cross-dc-manager:signJarsPublication SKIPPED
> Task :solr:cross-dc-manager:publishJarsPublicationToBuildRepository
> Task :solr:prometheus-exporter:compileJava
Note: Some input files use or override a deprecated API.
Note: Recompile with -Xlint:deprecation for details.
> Task :solr:prometheus-exporter:processResources NO-SOURCE
> Task :solr:prometheus-exporter:classes
> Task :solr:prometheus-exporter:jar
> Task :solr:prometheus-exporter:generateMetadataFileForJarsPublication SKIPPED
> Task :solr:prometheus-exporter:generatePomFileForJarsPublication
> Task :solr:prometheus-exporter:renderJavadoc
> Task :solr:prometheus-exporter:javadoc SKIPPED
> Task :solr:prometheus-exporter:javadocJar
> Task :solr:prometheus-exporter:sourcesJar
> Task :solr:prometheus-exporter:signJarsPublication SKIPPED
> Task :solr:prometheus-exporter:publishJarsPublicationToBuildRepository
> Task :solr:solrj:processResources
> Task :solr:solrj:classes
> Task :solr:solrj:jar
> Task :solr:solrj:generateMetadataFileForJarsPublication SKIPPED
> Task :solr:solrj:generatePomFileForJarsPublication
> Task :solr:solrj:javadoc SKIPPED
> Task :solr:solrj:javadocJar
> Task :solr:solrj:sourcesJar
> Task :solr:solrj:signJarsPublication SKIPPED
> Task :solr:solrj:publishJarsPublicationToBuildRepository
> Task :solr:solrj-streaming:processResources
> Task :solr:solrj-streaming:classes
> Task :solr:solrj-streaming:jar
> Task :solr:solrj-streaming:generateMetadataFileForJarsPublication SKIPPED
> Task :solr:solrj-streaming:generatePomFileForJarsPublication
> Task :solr:solrj-streaming:javadoc SKIPPED
> Task :solr:solrj-streaming:javadocJar
> Task :solr:solrj-streaming:sourcesJar
> Task :solr:solrj-streaming:signJarsPublication SKIPPED
> Task :solr:solrj-streaming:publishJarsPublicationToBuildRepository
> Task :solr:solrj-zookeeper:processResources NO-SOURCE
> Task :solr:solrj-zookeeper:classes
> Task :solr:solrj-zookeeper:jar
> Task :solr:solrj-zookeeper:generateMetadataFileForJarsPublication SKIPPED
> Task :solr:solrj-zookeeper:generatePomFileForJarsPublication
> Task :solr:solrj-zookeeper:javadoc SKIPPED
> Task :solr:solrj-zookeeper:javadocJar
> Task :solr:solrj-zookeeper:sourcesJar
> Task :solr:solrj-zookeeper:signJarsPublication SKIPPED
> Task :solr:solrj-zookeeper:publishJarsPublicationToBuildRepository
> Task :solr:test-framework:compileJava
Note: Some input files use or override a deprecated API.
Note: Recompile with -Xlint:deprecation for details.
> Task :solr:test-framework:processResources
> Task :solr:test-framework:classes
> Task :solr:test-framework:jar
> Task :solr:test-framework:generateMetadataFileForJarsPublication SKIPPED
> Task :solr:test-framework:generatePomFileForJarsPublication
> Task :solr:test-framework:renderJavadoc
> Task :solr:test-framework:javadoc SKIPPED
> Task :solr:test-framework:javadocJar
> Task :solr:test-framework:sourcesJar
> Task :solr:test-framework:signJarsPublication SKIPPED
> Task :solr:test-framework:publishJarsPublicationToBuildRepository
> Task :solr:modules:analysis-extras:compileJava
Note: /home/jenkins/jenkins-slave/workspace/Solr/Solr-Smoketest-9.x/solr/modules/analysis-extras/src/java/org/apache/solr/schema/ICUCollationField.java uses or overrides a deprecated API.
Note: Recompile with -Xlint:deprecation for details.
> Task :solr:modules:analysis-extras:processResources NO-SOURCE
> Task :solr:modules:analysis-extras:classes
> Task :solr:modules:analysis-extras:jar
> Task :solr:modules:analysis-extras:generateMetadataFileForJarsPublication SKIPPED
> Task :solr:modules:analysis-extras:generatePomFileForJarsPublication
> Task :solr:modules:analysis-extras:renderJavadoc
> Task :solr:modules:analysis-extras:javadoc SKIPPED
> Task :solr:modules:analysis-extras:javadocJar
> Task :solr:modules:analysis-extras:sourcesJar
> Task :solr:modules:analysis-extras:signJarsPublication SKIPPED
> Task :solr:modules:analysis-extras:publishJarsPublicationToBuildRepository
> Task :solr:modules:analytics:compileJava
Note: Some input files use or override a deprecated API.
Note: Recompile with -Xlint:deprecation for details.
> Task :solr:modules:analytics:processResources NO-SOURCE
> Task :solr:modules:analytics:classes
> Task :solr:modules:analytics:jar
> Task :solr:modules:analytics:generateMetadataFileForJarsPublication SKIPPED
> Task :solr:modules:analytics:generatePomFileForJarsPublication
> Task :solr:modules:analytics:renderJavadoc
> Task :solr:modules:analytics:javadoc SKIPPED
> Task :solr:modules:analytics:javadocJar
> Task :solr:modules:analytics:sourcesJar
> Task :solr:modules:analytics:signJarsPublication SKIPPED
> Task :solr:modules:analytics:publishJarsPublicationToBuildRepository
> Task :solr:modules:clustering:compileJava
> Task :solr:modules:clustering:processResources NO-SOURCE
> Task :solr:modules:clustering:classes
> Task :solr:modules:clustering:jar
> Task :solr:modules:clustering:generateMetadataFileForJarsPublication SKIPPED
> Task :solr:modules:clustering:generatePomFileForJarsPublication
> Task :solr:modules:clustering:renderJavadoc
> Task :solr:modules:clustering:javadoc SKIPPED
> Task :solr:modules:clustering:javadocJar
> Task :solr:modules:clustering:sourcesJar
> Task :solr:modules:clustering:signJarsPublication SKIPPED
> Task :solr:modules:clustering:publishJarsPublicationToBuildRepository
> Task :solr:modules:cross-dc:processResources NO-SOURCE
> Task :solr:modules:cross-dc:classes
> Task :solr:modules:cross-dc:jar
> Task :solr:modules:cross-dc:generateMetadataFileForJarsPublication SKIPPED
> Task :solr:modules:cross-dc:generatePomFileForJarsPublication
> Task :solr:modules:cross-dc:javadoc SKIPPED
> Task :solr:modules:cross-dc:javadocJar
> Task :solr:modules:cross-dc:sourcesJar
> Task :solr:modules:cross-dc:signJarsPublication SKIPPED
> Task :solr:modules:cross-dc:publishJarsPublicationToBuildRepository
> Task :solr:modules:extraction:compileJava
Note: /home/jenkins/jenkins-slave/workspace/Solr/Solr-Smoketest-9.x/solr/modules/extraction/src/java/org/apache/solr/handler/extraction/ExtractingDocumentLoader.java uses or overrides a deprecated API.
Note: Recompile with -Xlint:deprecation for details.
> Task :solr:modules:extraction:processResources
> Task :solr:modules:extraction:classes
> Task :solr:modules:extraction:jar
> Task :solr:modules:extraction:generateMetadataFileForJarsPublication SKIPPED
> Task :solr:modules:extraction:generatePomFileForJarsPublication
> Task :solr:modules:extraction:renderJavadoc
> Task :solr:modules:extraction:javadoc SKIPPED
> Task :solr:modules:extraction:javadocJar
> Task :solr:modules:extraction:sourcesJar
> Task :solr:modules:extraction:signJarsPublication SKIPPED
> Task :solr:modules:extraction:publishJarsPublicationToBuildRepository
> Task :solr:modules:gcs-repository:compileJava
Note: /home/jenkins/jenkins-slave/workspace/Solr/Solr-Smoketest-9.x/solr/modules/gcs-repository/src/java/org/apache/solr/gcs/GCSConfigParser.java uses or overrides a deprecated API.
Note: Recompile with -Xlint:deprecation for details.
> Task :solr:modules:gcs-repository:processResources NO-SOURCE
> Task :solr:modules:gcs-repository:classes
> Task :solr:modules:gcs-repository:jar
> Task :solr:modules:gcs-repository:generateMetadataFileForJarsPublication SKIPPED
> Task :solr:modules:gcs-repository:generatePomFileForJarsPublication
> Task :solr:modules:gcs-repository:renderJavadoc
> Task :solr:modules:gcs-repository:javadoc SKIPPED
> Task :solr:modules:gcs-repository:javadocJar
> Task :solr:modules:gcs-repository:sourcesJar
> Task :solr:modules:gcs-repository:signJarsPublication SKIPPED
> Task :solr:modules:gcs-repository:publishJarsPublicationToBuildRepository
> Task :solr:modules:hadoop-auth:compileJava
Note: Some input files use or override a deprecated API.
Note: Recompile with -Xlint:deprecation for details.
> Task :solr:modules:hadoop-auth:processResources NO-SOURCE
> Task :solr:modules:hadoop-auth:classes
> Task :solr:modules:hadoop-auth:jar
> Task :solr:modules:hadoop-auth:generateMetadataFileForJarsPublication SKIPPED
> Task :solr:modules:hadoop-auth:generatePomFileForJarsPublication
> Task :solr:modules:hadoop-auth:renderJavadoc
> Task :solr:modules:hadoop-auth:javadoc SKIPPED
> Task :solr:modules:hadoop-auth:javadocJar
> Task :solr:modules:hadoop-auth:sourcesJar
> Task :solr:modules:hadoop-auth:signJarsPublication SKIPPED
> Task :solr:modules:hadoop-auth:publishJarsPublicationToBuildRepository
> Task :solr:modules:hdfs:compileJava
Note: Some input files use or override a deprecated API.
Note: Recompile with -Xlint:deprecation for details.
> Task :solr:modules:hdfs:processResources NO-SOURCE
> Task :solr:modules:hdfs:classes
> Task :solr:modules:hdfs:jar
> Task :solr:modules:hdfs:generateMetadataFileForJarsPublication SKIPPED
> Task :solr:modules:hdfs:generatePomFileForJarsPublication
> Task :solr:modules:hdfs:renderJavadoc
> Task :solr:modules:hdfs:javadoc SKIPPED
> Task :solr:modules:hdfs:javadocJar
> Task :solr:modules:hdfs:sourcesJar
> Task :solr:modules:hdfs:signJarsPublication SKIPPED
> Task :solr:modules:hdfs:publishJarsPublicationToBuildRepository
> Task :solr:modules:jaegertracer-configurator:compileJava
> Task :solr:modules:jaegertracer-configurator:processResources NO-SOURCE
> Task :solr:modules:jaegertracer-configurator:classes
> Task :solr:modules:jaegertracer-configurator:jar
> Task :solr:modules:jaegertracer-configurator:generateMetadataFileForJarsPublication SKIPPED
> Task :solr:modules:jaegertracer-configurator:generatePomFileForJarsPublication
> Task :solr:modules:jaegertracer-configurator:renderJavadoc
> Task :solr:modules:jaegertracer-configurator:javadoc SKIPPED
> Task :solr:modules:jaegertracer-configurator:javadocJar
> Task :solr:modules:jaegertracer-configurator:sourcesJar
> Task :solr:modules:jaegertracer-configurator:signJarsPublication SKIPPED
> Task :solr:modules:jaegertracer-configurator:publishJarsPublicationToBuildRepository
> Task :solr:modules:jwt-auth:compileJava
> Task :solr:modules:jwt-auth:processResources NO-SOURCE
> Task :solr:modules:jwt-auth:classes
> Task :solr:modules:jwt-auth:jar
> Task :solr:modules:jwt-auth:generateMetadataFileForJarsPublication SKIPPED
> Task :solr:modules:jwt-auth:generatePomFileForJarsPublication
> Task :solr:modules:jwt-auth:renderJavadoc
> Task :solr:modules:jwt-auth:javadoc SKIPPED
> Task :solr:modules:jwt-auth:javadocJar
> Task :solr:modules:jwt-auth:sourcesJar
> Task :solr:modules:jwt-auth:signJarsPublication SKIPPED
> Task :solr:modules:jwt-auth:publishJarsPublicationToBuildRepository
> Task :solr:modules:langid:compileJava
Note: Some input files use or override a deprecated API.
Note: Recompile with -Xlint:deprecation for details.
> Task :solr:modules:langid:processResources
> Task :solr:modules:langid:classes
> Task :solr:modules:langid:jar
> Task :solr:modules:langid:generateMetadataFileForJarsPublication SKIPPED
> Task :solr:modules:langid:generatePomFileForJarsPublication
> Task :solr:modules:langid:renderJavadoc
> Task :solr:modules:langid:javadoc SKIPPED
> Task :solr:modules:langid:javadocJar
> Task :solr:modules:langid:sourcesJar
> Task :solr:modules:langid:signJarsPublication SKIPPED
> Task :solr:modules:langid:publishJarsPublicationToBuildRepository
> Task :solr:modules:llm:compileJava
> Task :solr:modules:llm:processResources NO-SOURCE
> Task :solr:modules:llm:classes
> Task :solr:modules:llm:jar
> Task :solr:modules:llm:generateMetadataFileForJarsPublication SKIPPED
> Task :solr:modules:llm:generatePomFileForJarsPublication
> Task :solr:modules:llm:renderJavadoc
> Task :solr:modules:llm:javadoc SKIPPED
> Task :solr:modules:llm:javadocJar
> Task :solr:modules:llm:sourcesJar
> Task :solr:modules:llm:signJarsPublication SKIPPED
> Task :solr:modules:llm:publishJarsPublicationToBuildRepository
> Task :solr:modules:ltr:compileJava
Note: Some input files use or override a deprecated API.
Note: Recompile with -Xlint:deprecation for details.
> Task :solr:modules:ltr:processResources NO-SOURCE
> Task :solr:modules:ltr:classes
> Task :solr:modules:ltr:jar
> Task :solr:modules:ltr:generateMetadataFileForJarsPublication SKIPPED
> Task :solr:modules:ltr:generatePomFileForJarsPublication
> Task :solr:modules:ltr:renderJavadoc
> Task :solr:modules:ltr:javadoc SKIPPED
> Task :solr:modules:ltr:javadocJar
> Task :solr:modules:ltr:sourcesJar
> Task :solr:modules:ltr:signJarsPublication SKIPPED
> Task :solr:modules:ltr:publishJarsPublicationToBuildRepository
> Task :solr:modules:opentelemetry:compileJava
> Task :solr:modules:opentelemetry:processResources NO-SOURCE
> Task :solr:modules:opentelemetry:classes
> Task :solr:modules:opentelemetry:jar
> Task :solr:modules:opentelemetry:generateMetadataFileForJarsPublication SKIPPED
> Task :solr:modules:opentelemetry:generatePomFileForJarsPublication
> Task :solr:modules:opentelemetry:renderJavadoc
> Task :solr:modules:opentelemetry:javadoc SKIPPED
> Task :solr:modules:opentelemetry:javadocJar
> Task :solr:modules:opentelemetry:sourcesJar
> Task :solr:modules:opentelemetry:signJarsPublication SKIPPED
> Task :solr:modules:opentelemetry:publishJarsPublicationToBuildRepository
> Task :solr:modules:s3-repository:compileJava
Note: /home/jenkins/jenkins-slave/workspace/Solr/Solr-Smoketest-9.x/solr/modules/s3-repository/src/java/org/apache/solr/s3/S3StorageClient.java uses or overrides a deprecated API.
Note: Recompile with -Xlint:deprecation for details.
> Task :solr:modules:s3-repository:processResources NO-SOURCE
> Task :solr:modules:s3-repository:classes
> Task :solr:modules:s3-repository:jar
> Task :solr:modules:s3-repository:generateMetadataFileForJarsPublication SKIPPED
> Task :solr:modules:s3-repository:generatePomFileForJarsPublication
> Task :solr:modules:s3-repository:renderJavadoc
> Task :solr:modules:s3-repository:javadoc SKIPPED
> Task :solr:modules:s3-repository:javadocJar
> Task :solr:modules:s3-repository:sourcesJar
> Task :solr:modules:s3-repository:signJarsPublication SKIPPED
> Task :solr:modules:s3-repository:publishJarsPublicationToBuildRepository
> Task :solr:modules:scripting:compileJava
Note: /home/jenkins/jenkins-slave/workspace/Solr/Solr-Smoketest-9.x/solr/modules/scripting/src/java/org/apache/solr/scripting/xslt/XSLTUpdateRequestHandler.java uses or overrides a deprecated API.
Note: Recompile with -Xlint:deprecation for details.
> Task :solr:modules:scripting:processResources NO-SOURCE
> Task :solr:modules:scripting:classes
> Task :solr:modules:scripting:jar
> Task :solr:modules:scripting:generateMetadataFileForJarsPublication SKIPPED
> Task :solr:modules:scripting:generatePomFileForJarsPublication
> Task :solr:modules:scripting:renderJavadoc
> Task :solr:modules:scripting:javadoc SKIPPED
> Task :solr:modules:scripting:javadocJar
> Task :solr:modules:scripting:sourcesJar
> Task :solr:modules:scripting:signJarsPublication SKIPPED
> Task :solr:modules:scripting:publishJarsPublicationToBuildRepository
> Task :solr:modules:sql:compileJava
Note: Some input files use or override a deprecated API.
Note: Recompile with -Xlint:deprecation for details.
> Task :solr:modules:sql:processResources
> Task :solr:modules:sql:classes
> Task :solr:modules:sql:jar
> Task :solr:modules:sql:generateMetadataFileForJarsPublication SKIPPED
> Task :solr:modules:sql:generatePomFileForJarsPublication
> Task :solr:modules:sql:renderJavadoc
> Task :solr:modules:sql:javadoc SKIPPED
> Task :solr:modules:sql:javadocJar
> Task :solr:modules:sql:sourcesJar
> Task :solr:modules:sql:signJarsPublication SKIPPED
> Task :solr:modules:sql:publishJarsPublicationToBuildRepository
> Task :mavenToLocalFolder
Local maven artifacts (poms, jars) created at: /home/jenkins/jenkins-slave/workspace/Solr/Solr-Smoketest-9.x/build/maven-local
> Task :checkWorkingCopyClean
> Task :solr:distribution:assembleSourceTgz
> Task :solr:cross-dc-manager:assemblePackaging
> Task :solr:docker:createBodySnippetDockerfile
> Task :solr:docker:createDockerfileLocal
> Task :solr:docker:assemblePackaging
> Task :solr:documentation:changesToHtml
> Task :solr:documentation:copyDocumentationAssets
> Task :solr:documentation:markdownToHtml
> Task :solr:documentation:copyChangesToHtmlForMiniSite
> Task :solr:documentation:copyMiniDocumentationAssets
> Task :solr:documentation:createMiniDocumentationIndex
> Task :solr:documentation:documentationMinimal
> Task :solr:core:assemblePostJar
> Task :solr:example:assemblePackaging
> Task :solr:prometheus-exporter:assemblePackaging
> Task :solr:webapp:compileJava NO-SOURCE
> Task :solr:webapp:processResources NO-SOURCE
> Task :solr:webapp:classes UP-TO-DATE
> Task :solr:api:buildJSClient
allOf with multiple schemas defined. Using only the first one: RoutedAliasProperties
allOf with multiple schemas defined. Using only the first one: RoutedAliasProperties
Multiple schemas found in the OAS 'content' section, returning only the first one (application/json)
Multiple schemas found in the OAS 'content' section, returning only the first one (application/json)
Multiple schemas found in the OAS 'content' section, returning only the first one (application/vnd.apache.solr.raw)
Multiple schemas found in the OAS 'content' section, returning only the first one (application/vnd.apache.solr.raw)
################################################################################
# Thanks for using OpenAPI Generator. #
# Please consider donation to help us maintain this project 🙏 #
# https://opencollective.com/openapi_generator/donate #
################################################################################
Successfully generated code to /home/jenkins/jenkins-slave/workspace/Solr/Solr-Smoketest-9.x/solr/api/build/generated/js
> Task :solr:webapp:nodeSetup
> Task :solr:webapp:npmSetup SKIPPED
> Task :solr:webapp:downloadBrowserify
npm WARN deprecated inflight@1.0.6: This module is not supported, and leaks memory. Do not use it. Check out lru-cache if you want a good and tested way to coalesce async requests by a key value, which is much more comprehensive and powerful.
npm WARN deprecated glob@7.2.3: Glob versions prior to v9 are no longer supported
added 173 packages, changed 1 package, and audited 175 packages in 8s
38 packages are looking for funding
run `npm fund` for details
found 0 vulnerabilities
> Task :solr:webapp:syncJSClientSourceCode
> Task :solr:webapp:jsClientDownloadDeps
npm WARN deprecated inflight@1.0.6: This module is not supported, and leaks memory. Do not use it. Check out lru-cache if you want a good and tested way to coalesce async requests by a key value, which is much more comprehensive and powerful.
npm WARN deprecated @babel/plugin-proposal-numeric-separator@7.18.6: This proposal has been merged to the ECMAScript standard and thus this plugin is no longer maintained. Please use @babel/plugin-transform-numeric-separator instead.
npm WARN deprecated @babel/plugin-proposal-nullish-coalescing-operator@7.18.6: This proposal has been merged to the ECMAScript standard and thus this plugin is no longer maintained. Please use @babel/plugin-transform-nullish-coalescing-operator instead.
npm WARN deprecated @babel/plugin-proposal-export-namespace-from@7.18.9: This proposal has been merged to the ECMAScript standard and thus this plugin is no longer maintained. Please use @babel/plugin-transform-export-namespace-from instead.
npm WARN deprecated @babel/plugin-proposal-json-strings@7.18.6: This proposal has been merged to the ECMAScript standard and thus this plugin is no longer maintained. Please use @babel/plugin-transform-json-strings instead.
npm WARN deprecated @babel/plugin-proposal-class-properties@7.18.6: This proposal has been merged to the ECMAScript standard and thus this plugin is no longer maintained. Please use @babel/plugin-transform-class-properties instead.
npm WARN deprecated @babel/plugin-proposal-logical-assignment-operators@7.20.7: This proposal has been merged to the ECMAScript standard and thus this plugin is no longer maintained. Please use @babel/plugin-transform-logical-assignment-operators instead.
npm WARN deprecated @babel/plugin-proposal-optional-chaining@7.21.0: This proposal has been merged to the ECMAScript standard and thus this plugin is no longer maintained. Please use @babel/plugin-transform-optional-chaining instead.
npm WARN deprecated glob@7.2.3: Glob versions prior to v9 are no longer supported
npm WARN deprecated glob@7.1.6: Glob versions prior to v9 are no longer supported
npm WARN deprecated formidable@1.2.6: Please upgrade to latest, formidable@v2 or formidable@v3! Check these notes: https://bit.ly/2ZEqIau
npm WARN deprecated superagent@5.3.1: Please upgrade to v9.0.0+ as we have fixed a public vulnerability with formidable dependency. Note that v9.0.0+ requires Node.js v14.18.0+. See https://github.com/ladjs/superagent/pull/1800 for insight. This project is supported and maintained by the team at Forward Email @ https://forwardemail.net
npm WARN deprecated sinon@7.5.0: 16.1.1
> v2_api@9.9.0 prepare
> npm run build
> v2_api@9.9.0 build
> babel src -d dist
Successfully compiled 137 files with Babel (2482ms).
added 333 packages, and audited 334 packages in 17s
42 packages are looking for funding
run `npm fund` for details
3 vulnerabilities (1 moderate, 2 high)
To address all issues (including breaking changes), run:
npm audit fix --force
Run `npm audit` for details.
> Task :solr:webapp:jsClientBuild
> v2_api@9.9.0 build
> babel src -d dist
Successfully compiled 137 files with Babel (2490ms).
> Task :solr:webapp:generateJsClientBundle
> Task :solr:webapp:finalizeJsBundleDir
> Task :solr:webapp:war
> Task :solr:server:assemblePackaging
> Task :solr:modules:analysis-extras:assemblePackaging
> Task :solr:modules:analytics:assemblePackaging
> Task :solr:modules:clustering:assemblePackaging
> Task :solr:modules:cross-dc:assemblePackaging
> Task :solr:modules:extraction:assemblePackaging
> Task :solr:modules:gcs-repository:assemblePackaging
> Task :solr:modules:hadoop-auth:assemblePackaging
> Task :solr:modules:hdfs:assemblePackaging
> Task :solr:modules:jaegertracer-configurator:assemblePackaging
> Task :solr:modules:jwt-auth:assemblePackaging
> Task :solr:modules:langid:assemblePackaging
> Task :solr:modules:llm:assemblePackaging
> Task :solr:modules:ltr:assemblePackaging
> Task :solr:modules:opentelemetry:assemblePackaging
> Task :solr:modules:s3-repository:assemblePackaging
> Task :solr:modules:scripting:assemblePackaging
> Task :solr:modules:sql:assemblePackaging
> Task :solr:packaging:fullDistTar
> Task :solr:packaging:slimDistTar
> Task :solr:distribution:computeChecksums
> Task :solr:distribution:prepareGitRev
> Task :solr:docker:createDockerfileOfficialFull
> Task :solr:docker:createDockerfileOfficialSlim
> Task :solr:distribution:assembleRelease
Deprecated Gradle features were used in this build, making it incompatible with Gradle 9.0.
You can use '--warning-mode all' to show the individual deprecation warnings and determine if they come from your own scripts or plugins.
For more on this, please refer to https://docs.gradle.org/8.10/userguide/command_line_interface.html#sec:command_line_warnings in the Gradle documentation.
BUILD SUCCESSFUL in 6m 56s
281 actionable tasks: 273 executed, 8 up-to-date
Publishing build scan...
https://develocity.apache.org/s/pgylya5i6l22i
Build step 'Invoke Gradle script' changed build result to SUCCESS
Run condition [Always] enabling perform for step [Execute shell]
[Solr-Smoketest-9.x] $ /bin/bash /tmp/jenkins1478912540767448120.sh
Installing Python script requirements
Defaulting to user installation because normal site-packages is not writeable
Collecting six~=1.16.0
Using cached six-1.16.0-py2.py3-none-any.whl (11 kB)
ERROR: Could not find a version that satisfies the requirement Jinja2~=3.1.1 (from versions: 2.0rc1, 2.0, 2.1, 2.1.1, 2.2, 2.2.1, 2.3, 2.3.1, 2.4, 2.4.1, 2.5, 2.5.1, 2.5.2, 2.5.3, 2.5.4, 2.5.5, 2.6, 2.7, 2.7.1, 2.7.2, 2.7.3, 2.8, 2.8.1, 2.9, 2.9.1, 2.9.2, 2.9.3, 2.9.4, 2.9.5, 2.9.6, 2.10, 2.10.1, 2.10.2, 2.10.3, 2.11.0, 2.11.1, 2.11.2, 2.11.3, 3.0.0a1, 3.0.0rc1, 3.0.0rc2, 3.0.0, 3.0.1, 3.0.2, 3.0.3)
ERROR: No matching distribution found for Jinja2~=3.1.1
Starting Smoke tester in folder /home/jenkins/jenkins-slave/workspace/Solr/Solr-Smoketest-9.x
Java 11 JAVA_HOME=/home/jenkins/tools/java/latest11
NOTE: output encoding is UTF-8
NOTE: Not running @Nightly or @BadApple tests. Please verify that recent Jenkins runs have passed.
Load release URL "file:///home/jenkins/jenkins-slave/workspace/Solr/Solr-Smoketest-9.x/solr/distribution/build/release"...
Get KEYS...
Downloading online KEYS file https://archive.apache.org/dist/solr/KEYS
Downloading https://archive.apache.org/dist/solr/KEYS
0.3 MB in 1.26 sec (0.2 MB/sec)
Test Solr...
test basics...
check changes HTML...
check OpenAPI specification...
download solr-9.9.0-slim.tgz...
Downloading file:///home/jenkins/jenkins-slave/workspace/Solr/Solr-Smoketest-9.x/solr/distribution/build/release/solr-9.9.0-slim.tgz
62.4 MB in 0.05 sec (1310.1 MB/sec)
verify sha512 digest
download solr-9.9.0-src.tgz...
Downloading file:///home/jenkins/jenkins-slave/workspace/Solr/Solr-Smoketest-9.x/solr/distribution/build/release/solr-9.9.0-src.tgz
86.3 MB in 0.06 sec (1372.9 MB/sec)
verify sha512 digest
download solr-9.9.0.tgz...
Downloading file:///home/jenkins/jenkins-slave/workspace/Solr/Solr-Smoketest-9.x/solr/distribution/build/release/solr-9.9.0.tgz
368.7 MB in 0.29 sec (1266.0 MB/sec)
verify sha512 digest
unpack solr-9.9.0.tgz...
solr-9.9.0.tgz
Checking LICENSE.txt
Checking NOTICE.txt
Checking README.txt
Checking CHANGES.txt
Checking bin
Checking modules
Checking cross-dc-manager
Checking docker
Checking prometheus-exporter
Checking docs
Checking example
Checking licenses
Checking server
Checking lib
verify JAR metadata/identity/no javax.* or java.* classes...
**WARNING**: skipping check of /home/jenkins/jenkins-slave/workspace/Solr/Solr-Smoketest-9.x/_tmp/smoke_1739520384/unpack/solr-9.9.0/server/solr-webapp/webapp/WEB-INF/lib/jakarta.ws.rs-api-3.1.0.jar: it has javax.* classes
**WARNING**: skipping check of /home/jenkins/jenkins-slave/workspace/Solr/Solr-Smoketest-9.x/_tmp/smoke_1739520384/unpack/solr-9.9.0/server/solr-webapp/webapp/WEB-INF/lib/jakarta.annotation-api-2.1.1.jar: it has javax.* classes
**WARNING**: skipping check of /home/jenkins/jenkins-slave/workspace/Solr/Solr-Smoketest-9.x/_tmp/smoke_1739520384/unpack/solr-9.9.0/server/solr-webapp/webapp/WEB-INF/lib/jakarta.validation-api-3.0.2.jar: it has javax.* classes
**WARNING**: skipping check of /home/jenkins/jenkins-slave/workspace/Solr/Solr-Smoketest-9.x/_tmp/smoke_1739520384/unpack/solr-9.9.0/server/solr-webapp/webapp/WEB-INF/lib/jakarta.inject-api-2.0.1.jar: it has javax.* classes
**WARNING**: skipping check of /home/jenkins/jenkins-slave/workspace/Solr/Solr-Smoketest-9.x/_tmp/smoke_1739520384/unpack/solr-9.9.0/server/lib/ext/jetty-servlet-api-4.0.6.jar: it has javax.* classes
**WARNING**: skipping check of /home/jenkins/jenkins-slave/workspace/Solr/Solr-Smoketest-9.x/_tmp/smoke_1739520384/unpack/solr-9.9.0/modules/extraction/lib/jakarta.activation-1.2.2.jar: it has javax.* classes
**WARNING**: skipping check of /home/jenkins/jenkins-slave/workspace/Solr/Solr-Smoketest-9.x/_tmp/smoke_1739520384/unpack/solr-9.9.0/modules/extraction/lib/jakarta.xml.bind-api-2.3.3.jar: it has javax.* classes
**WARNING**: skipping check of /home/jenkins/jenkins-slave/workspace/Solr/Solr-Smoketest-9.x/_tmp/smoke_1739520384/unpack/solr-9.9.0/modules/extraction/lib/jakarta.activation-api-1.2.2.jar: it has javax.* classes
**WARNING**: skipping check of /home/jenkins/jenkins-slave/workspace/Solr/Solr-Smoketest-9.x/_tmp/smoke_1739520384/unpack/solr-9.9.0/modules/extraction/lib/unit-api-1.0.jar: it has javax.* classes
copying unpacked distribution for Java 11 ...
test solr example w/ Java 11...
start Solr instance (log=/home/jenkins/jenkins-slave/workspace/Solr/Solr-Smoketest-9.x/_tmp/smoke_1739520384/unpack/solr-9.9.0-java11/solr-example.log)...
No process found for Solr node running on port 8983
Running techproducts example on port 8983 from /home/jenkins/jenkins-slave/workspace/Solr/Solr-Smoketest-9.x/_tmp/smoke_1739520384/unpack/solr-9.9.0-java11
*** [WARN] *** Your open file limit is currently 60000.
It should be set to 65000 to avoid operational disruption.
If you no longer wish to see this warning, set SOLR_ULIMIT_CHECKS to false in your profile or solr.in.sh
*** [WARN] *** Your Max Processes Limit is currently 30000.
It should be set to 65000 to avoid operational disruption.
If you no longer wish to see this warning, set SOLR_ULIMIT_CHECKS to false in your profile or solr.in.sh
Starting up Solr on port 8983 using command:
"bin/solr" start -p 8983 --solr-home "server/solr" --server-dir "/home/jenkins/jenkins-slave/workspace/Solr/Solr-Smoketest-9.x/_tmp/smoke_1739520384/unpack/solr-9.9.0-java11/server" -Dsolr.modules=clustering,extraction,langid,ltr,scripting -Dsolr.ltr.enabled=true -Dsolr.clustering.enabled=true
*** [WARN] *** Your open file limit is currently 60000.
It should be set to 65000 to avoid operational disruption.
If you no longer wish to see this warning, set SOLR_ULIMIT_CHECKS to false in your profile or solr.in.sh
*** [WARN] *** Your Max Processes Limit is currently 30000.
It should be set to 65000 to avoid operational disruption.
If you no longer wish to see this warning, set SOLR_ULIMIT_CHECKS to false in your profile or solr.in.sh
Solr will start in SolrCloud mode by default in version 10, and you will have to provide --user-managed if you want to stay on the user-managed (aka. standalone) mode.
Waiting up to 180 seconds to see Solr running on port 8983 [|] [/] [-] [\] [|] [/] [-] [\] [|]
Started Solr server on port 8983 (pid=29446). Happy searching!
WARNING: URLs provided to this tool needn't include Solr's context-root (e.g. "/solr"). Such URLs are deprecated and support for them will be removed in a future release. Correcting from [http://localhost:8983/solr/] to [http://localhost:8983/].
Created new core 'techproducts'
Indexing tech product example docs from /home/jenkins/jenkins-slave/workspace/Solr/Solr-Smoketest-9.x/_tmp/smoke_1739520384/unpack/solr-9.9.0-java11/example/exampledocs
WARNING: URLs provided to this tool needn't include Solr's context-root (e.g. "/solr"). Such URLs are deprecated and support for them will be removed in a future release. Correcting from [http://localhost:8983/solr] to [http://localhost:8983/].
Posting files to [base] url http://localhost:8983/solr/techproducts/update using content-type application/xml...
Entering recursive mode, max depth=1, delay=0s
Indexing directory /home/jenkins/jenkins-slave/workspace/Solr/Solr-Smoketest-9.x/_tmp/smoke_1739520384/unpack/solr-9.9.0-java11/example/exampledocs (13 files, depth=0)
POSTing file mp500.xml to [base]
POSTing file ipod_video.xml to [base]
POSTing file monitor2.xml to [base]
POSTing file gb18030-example.xml to [base]
POSTing file vidcard.xml to [base]
POSTing file money.xml to [base]
POSTing file hd.xml to [base]
POSTing file ipod_other.xml to [base]
POSTing file sd500.xml to [base]
POSTing file solr.xml to [base]
POSTing file monitor.xml to [base]
POSTing file manufacturers.xml to [base]
POSTing file mem.xml to [base]
13 files indexed.
COMMITting Solr index changes to http://localhost:8983/solr/techproducts/update...
WARNING: URLs provided to this tool needn't include Solr's context-root (e.g. "/solr"). Such URLs are deprecated and support for them will be removed in a future release. Correcting from [http://localhost:8983/solr] to [http://localhost:8983/].
Time spent: 0:00:00.971
run query...
stop server using: bin/solr stop -p 8983
Sending stop command to Solr running on port 8983 ... waiting up to 180 seconds to allow Jetty process 29446 to stop gracefully.
[|] [/] [-] [\] unpack solr-9.9.0-slim.tgz...
solr-9.9.0-slim.tgz
Checking LICENSE.txt
Checking NOTICE.txt
Checking README.txt
Checking CHANGES.txt
Checking bin
Checking docker
Checking docs
Checking example
Checking licenses
Checking server
Checking lib
verify JAR metadata/identity/no javax.* or java.* classes...
**WARNING**: skipping check of /home/jenkins/jenkins-slave/workspace/Solr/Solr-Smoketest-9.x/_tmp/smoke_1739520384/unpack/solr-9.9.0-slim/server/solr-webapp/webapp/WEB-INF/lib/jakarta.ws.rs-api-3.1.0.jar: it has javax.* classes
**WARNING**: skipping check of /home/jenkins/jenkins-slave/workspace/Solr/Solr-Smoketest-9.x/_tmp/smoke_1739520384/unpack/solr-9.9.0-slim/server/solr-webapp/webapp/WEB-INF/lib/jakarta.annotation-api-2.1.1.jar: it has javax.* classes
**WARNING**: skipping check of /home/jenkins/jenkins-slave/workspace/Solr/Solr-Smoketest-9.x/_tmp/smoke_1739520384/unpack/solr-9.9.0-slim/server/solr-webapp/webapp/WEB-INF/lib/jakarta.validation-api-3.0.2.jar: it has javax.* classes
**WARNING**: skipping check of /home/jenkins/jenkins-slave/workspace/Solr/Solr-Smoketest-9.x/_tmp/smoke_1739520384/unpack/solr-9.9.0-slim/server/solr-webapp/webapp/WEB-INF/lib/jakarta.inject-api-2.0.1.jar: it has javax.* classes
**WARNING**: skipping check of /home/jenkins/jenkins-slave/workspace/Solr/Solr-Smoketest-9.x/_tmp/smoke_1739520384/unpack/solr-9.9.0-slim/server/lib/ext/jetty-servlet-api-4.0.6.jar: it has javax.* classes
copying unpacked distribution for Java 11 ...
test solr example w/ Java 11...
start Solr instance (log=/home/jenkins/jenkins-slave/workspace/Solr/Solr-Smoketest-9.x/_tmp/smoke_1739520384/unpack/solr-9.9.0-slim-java11/solr-example.log)...
No process found for Solr node running on port 8983
Running films example on port 8983 from /home/jenkins/jenkins-slave/workspace/Solr/Solr-Smoketest-9.x/_tmp/smoke_1739520384/unpack/solr-9.9.0-slim-java11
*** [WARN] *** Your open file limit is currently 60000.
It should be set to 65000 to avoid operational disruption.
If you no longer wish to see this warning, set SOLR_ULIMIT_CHECKS to false in your profile or solr.in.sh
*** [WARN] *** Your Max Processes Limit is currently 30000.
It should be set to 65000 to avoid operational disruption.
If you no longer wish to see this warning, set SOLR_ULIMIT_CHECKS to false in your profile or solr.in.sh
Starting up Solr on port 8983 using command:
"bin/solr" start -p 8983 --solr-home "server/solr" --server-dir "/home/jenkins/jenkins-slave/workspace/Solr/Solr-Smoketest-9.x/_tmp/smoke_1739520384/unpack/solr-9.9.0-slim-java11/server"
*** [WARN] *** Your open file limit is currently 60000.
It should be set to 65000 to avoid operational disruption.
If you no longer wish to see this warning, set SOLR_ULIMIT_CHECKS to false in your profile or solr.in.sh
*** [WARN] *** Your Max Processes Limit is currently 30000.
It should be set to 65000 to avoid operational disruption.
If you no longer wish to see this warning, set SOLR_ULIMIT_CHECKS to false in your profile or solr.in.sh
Solr will start in SolrCloud mode by default in version 10, and you will have to provide --user-managed if you want to stay on the user-managed (aka. standalone) mode.
Waiting up to 180 seconds to see Solr running on port 8983 [|] [/] [-] [\] [|]
Started Solr server on port 8983 (pid=29999). Happy searching!
WARNING: URLs provided to this tool needn't include Solr's context-root (e.g. "/solr"). Such URLs are deprecated and support for them will be removed in a future release. Correcting from [http://localhost:8983/solr/] to [http://localhost:8983/].
Created new core 'films'
Adding dense vector field type to films schema
Adding name, genre, directed_by, initial_release_date, and film_vector fields to films schema
Adding paramsets "algo" and "algo_b" to films configuration for relevancy tuning
Indexing films example docs from /home/jenkins/jenkins-slave/workspace/Solr/Solr-Smoketest-9.x/_tmp/smoke_1739520384/unpack/solr-9.9.0-slim-java11/example/films/films.json
WARNING: URLs provided to this tool needn't include Solr's context-root (e.g. "/solr"). Such URLs are deprecated and support for them will be removed in a future release. Correcting from [http://localhost:8983/solr] to [http://localhost:8983/].
Posting files to [base] url http://localhost:8983/solr/films/update using content-type application/json...
POSTing file films.json to [base]
1 files indexed.
COMMITting Solr index changes to http://localhost:8983/solr/films/update...
WARNING: URLs provided to this tool needn't include Solr's context-root (e.g. "/solr"). Such URLs are deprecated and support for them will be removed in a future release. Correcting from [http://localhost:8983/solr] to [http://localhost:8983/].
Time spent: 0:00:01.284
Solr films example launched successfully. Direct your Web browser to http://localhost:8983 to visit the Solr Admin UI
run query...
stop server using: bin/solr stop -p 8983
Sending stop command to Solr running on port 8983 ... waiting up to 180 seconds to allow Jetty process 29999 to stop gracefully.
[|] [/] [-] [\] unpack solr-9.9.0-src.tgz...
solr-9.9.0-src.tgz
Checking LICENSE.txt
Checking NOTICE.txt
Checking README.md
Checking CONTRIBUTING.md
Checking CHANGES.txt
Checking README.adoc
Checking buildSrc
Checking dev-docs
Checking dev-tools
Checking gradle
Checking help
Checking solr
Checking build.gradle
Checking gradlew
Checking gradlew.bat
Checking settings.gradle
Checking versions.lock
Checking versions.props
Checking benchmark
Checking bin
Checking modules
Checking api
Checking core
Checking cross-dc-manager
Checking docker
Checking documentation
Checking example
Checking licenses
Checking packaging
Checking distribution
Checking prometheus-exporter
Checking server
Checking solr-ref-guide
Checking solrj
Checking solrj-streaming
Checking solrj-zookeeper
Checking test-framework
Checking webapp
Checking .gitignore
Checking .gitattributes
Checking build.gradle
make sure no JARs/WARs in src dist...
run "./gradlew --no-daemon check -p solr/documentation"
run tests w/ Java 11 and testArgs='-Dtests.nightly=false -Dtests.badapples=false '...
command "export JAVA_HOME="/home/jenkins/tools/java/latest11" PATH="/home/jenkins/tools/java/latest11/bin:$PATH" JAVACMD="/home/jenkins/tools/java/latest11/bin/java"; ./gradlew --no-daemon test -Dtests.nightly=false -Dtests.badapples=false " failed:
To honour the JVM settings for this build a single-use Daemon process will be forked. For more on this, please refer to https://docs.gradle.org/8.10/userguide/gradle_daemon.html#sec:disabling_the_daemon in the Gradle documentation.
Daemon will be stopped at the end of the build
> Task :buildSrc:compileJava UP-TO-DATE
> Task :buildSrc:compileGroovy NO-SOURCE
> Task :buildSrc:processResources NO-SOURCE
> Task :buildSrc:classes UP-TO-DATE
> Task :buildSrc:jar UP-TO-DATE
> Task :solr:api:processResources NO-SOURCE
> Task :solr:api:processTestResources
> Task :solr:core:processResources UP-TO-DATE
> Task :solr:solrj:processResources UP-TO-DATE
> Task :solr:solrj-streaming:processResources UP-TO-DATE
> Task :solr:solrj-zookeeper:processResources NO-SOURCE
> Task :solr:test-framework:processResources
> Task :gitStatus
> Task :checkJdkInternalsExportedToGradle
> Task :solr:benchmark:processResources
> Task :ensureJdkSupported
> Task :randomizationInfo
Running tests with randomization seed: tests.seed=AF9DEC95FE96F4E0
> Task :solr:benchmark:processTestResources
> Task :solr:api:compileJava UP-TO-DATE
> Task :solr:api:classes UP-TO-DATE
> Task :solr:api:jar UP-TO-DATE
> Task :solr:api:resolve UP-TO-DATE
> Task :solr:core:processTestResources
> Task :solr:modules:analysis-extras:processResources NO-SOURCE
> Task :solr:cross-dc-manager:processResources NO-SOURCE
> Task :solr:cross-dc-manager:processTestResources
> Task :solr:modules:cross-dc:processResources NO-SOURCE
> Task :solr:prometheus-exporter:processResources NO-SOURCE
> Task :solr:prometheus-exporter:processTestResources
> Task :solr:server:compileJava SKIPPED
> Task :solr:server:processResources NO-SOURCE
> Task :solr:server:classes UP-TO-DATE
> Task :solr:server:compileTestJava NO-SOURCE
> Task :solr:server:processTestResources NO-SOURCE
> Task :solr:server:testClasses UP-TO-DATE
> Task :solr:server:test NO-SOURCE
> Task :solr:server:wipeTaskTemp
> Task :solr:solr-ref-guide:compileJava NO-SOURCE
> Task :solr:solr-ref-guide:processResources NO-SOURCE
> Task :solr:solr-ref-guide:classes UP-TO-DATE
> Task :solr:solr-ref-guide:copySolrjTestResources
> Task :solr:solr-ref-guide:processTestResources NO-SOURCE
> Task :solr:solrj-streaming:processTestResources
> Task :solr:modules:sql:processResources
> Task :solr:solrj-zookeeper:processTestResources
> Task :solr:test-framework:processTestResources
> Task :solr:webapp:processResources NO-SOURCE
> Task :solr:webapp:processTestResources NO-SOURCE
> Task :solr:modules:analysis-extras:processTestResources
> Task :solr:modules:analytics:processResources NO-SOURCE
> Task :solr:modules:analytics:processTestResources
> Task :solr:modules:clustering:processResources NO-SOURCE
> Task :solr:modules:clustering:processTestResources
> Task :solr:modules:cross-dc:processTestResources
> Task :solr:modules:extraction:processResources
> Task :solr:modules:extraction:processTestResources
> Task :solr:modules:gcs-repository:processResources NO-SOURCE
> Task :solr:modules:gcs-repository:processTestResources
> Task :solr:modules:hadoop-auth:processResources NO-SOURCE
> Task :solr:solrj:openApiGenerate
Cleaned up output directory /home/jenkins/jenkins-slave/workspace/Solr/Solr-Smoketest-9.x/_tmp/smoke_1739520384/unpack/solr-9.9.0/solr/solrj/build/generated/ before code generation (cleanupOutput set to true).
> Task :solr:modules:hadoop-auth:copySolrCoreTestResources
> Task :solr:modules:hadoop-auth:processTestResources
> Task :solr:modules:hdfs:processResources NO-SOURCE
> Task :solr:modules:hdfs:copySolrCoreTestResources
> Task :solr:modules:hdfs:processTestResources
> Task :solr:modules:jaegertracer-configurator:processResources NO-SOURCE
> Task :solr:modules:jaegertracer-configurator:processTestResources
> Task :solr:modules:jwt-auth:processResources NO-SOURCE
> Task :solr:modules:jwt-auth:processTestResources
> Task :solr:modules:langid:processResources
> Task :solr:modules:langid:processTestResources
> Task :solr:modules:llm:processResources NO-SOURCE
> Task :solr:modules:llm:processTestResources
> Task :solr:modules:ltr:processResources NO-SOURCE
> Task :solr:modules:ltr:processTestResources
> Task :solr:modules:opentelemetry:processResources NO-SOURCE
> Task :solr:modules:opentelemetry:processTestResources
> Task :solr:modules:s3-repository:processResources NO-SOURCE
> Task :solr:modules:s3-repository:processTestResources
> Task :solr:modules:scripting:processResources NO-SOURCE
> Task :solr:modules:scripting:processTestResources
> Task :solr:modules:sql:copySolrCoreTestResources
> Task :solr:modules:sql:processTestResources
> Task :solr:solrj:openApiGenerate
Multiple schemas found in the OAS 'content' section, returning only the first one (application/json)
Multiple schemas found in the OAS 'content' section, returning only the first one (application/json)
Multiple schemas found in the OAS 'content' section, returning only the first one (application/vnd.apache.solr.raw)
Multiple schemas found in the OAS 'content' section, returning only the first one (application/vnd.apache.solr.raw)
################################################################################
# Thanks for using OpenAPI Generator. #
# Please consider donation to help us maintain this project 🙏 #
# https://opencollective.com/openapi_generator/donate #
################################################################################
Successfully generated code to /home/jenkins/jenkins-slave/workspace/Solr/Solr-Smoketest-9.x/_tmp/smoke_1739520384/unpack/solr-9.9.0/solr/solrj/build/generated/
> Task :spotlessInternalRegisterDependencies UP-TO-DATE
> Task :solr:solrj:compileJava
Note: Some input files use or override a deprecated API.
Note: Recompile with -Xlint:deprecation for details.
> Task :solr:solrj-streaming:compileJava UP-TO-DATE
> Task :solr:solrj-zookeeper:compileJava UP-TO-DATE
> Task :solr:core:compileJava UP-TO-DATE
> Task :solr:test-framework:compileJava UP-TO-DATE
> Task :solr:solrj:generatedSpotlessHelper
> Task :solr:solrj:generatedSpotless
> Task :solr:core:classes UP-TO-DATE
> Task :solr:core:jar UP-TO-DATE
> Task :solr:solrj:classes
> Task :solr:api:compileTestJava
> Task :solr:api:testClasses
> Task :solr:solrj-streaming:classes UP-TO-DATE
> Task :solr:solrj-streaming:jar UP-TO-DATE
> Task :solr:solrj-zookeeper:classes UP-TO-DATE
> Task :solr:solrj-zookeeper:jar UP-TO-DATE
> Task :solr:test-framework:classes
> Task :solr:solrj:jar
> Task :solr:test-framework:jar
> Task :solr:benchmark:compileJava
Note: /home/jenkins/jenkins-slave/workspace/Solr/Solr-Smoketest-9.x/_tmp/smoke_1739520384/unpack/solr-9.9.0/solr/benchmark/src/java/org/apache/solr/bench/search/StreamingSearch.java uses or overrides a deprecated API.
Note: Recompile with -Xlint:deprecation for details.
> Task :solr:benchmark:classes
> Task :solr:benchmark:compileTestJava
> Task :solr:benchmark:testClasses
> Task :solr:api:test
:solr:api:test (SUCCESS): 6 test(s)
> Task :solr:api:wipeTaskTemp
> Task :solr:benchmark:test
:solr:benchmark:test (SUCCESS): 10 test(s)
> Task :solr:benchmark:wipeTaskTemp
> Task :solr:modules:analysis-extras:compileJava
Note: /home/jenkins/jenkins-slave/workspace/Solr/Solr-Smoketest-9.x/_tmp/smoke_1739520384/unpack/solr-9.9.0/solr/modules/analysis-extras/src/java/org/apache/solr/schema/ICUCollationField.java uses or overrides a deprecated API.
Note: Recompile with -Xlint:deprecation for details.
> Task :solr:modules:analysis-extras:classes
> Task :solr:modules:analysis-extras:jar
> Task :solr:modules:cross-dc:compileJava UP-TO-DATE
> Task :solr:cross-dc-manager:compileJava
Note: /home/jenkins/jenkins-slave/workspace/Solr/Solr-Smoketest-9.x/_tmp/smoke_1739520384/unpack/solr-9.9.0/solr/cross-dc-manager/src/java/org/apache/solr/crossdc/manager/consumer/Util.java uses or overrides a deprecated API.
Note: Recompile with -Xlint:deprecation for details.
> Task :solr:cross-dc-manager:classes
> Task :solr:cross-dc-manager:compileTestJava
Note: /home/jenkins/jenkins-slave/workspace/Solr/Solr-Smoketest-9.x/_tmp/smoke_1739520384/unpack/solr-9.9.0/solr/cross-dc-manager/src/test/org/apache/solr/crossdc/manager/messageprocessor/TestMessageProcessor.java uses or overrides a deprecated API.
Note: Recompile with -Xlint:deprecation for details.
> Task :solr:cross-dc-manager:testClasses
> Task :solr:modules:cross-dc:classes UP-TO-DATE
> Task :solr:modules:cross-dc:jar
> Task :solr:core:compileTestJava
> Task :solr:cross-dc-manager:test
> Task :solr:core:compileTestJava
Note: Some input files use or override a deprecated API.
Note: Recompile with -Xlint:deprecation for details.
> Task :solr:core:testClasses
> Task :solr:core:test
WARNING: Test org.apache.solr.TestRandomFaceting wrote 14,338,729 bytes of output.
TestSchemaDesignerAPI > classMethod FAILED
java.util.concurrent.TimeoutException: Timed out waiting for all collections to be fully removed.
at __randomizedtesting.SeedInfo.seed([AF9DEC95FE96F4E0]:0)
at org.apache.solr.cloud.MiniSolrCloudCluster.deleteAllCollections(MiniSolrCloudCluster.java:691)
at org.apache.solr.handler.designer.TestSchemaDesignerAPI.tearDownCluster(TestSchemaDesignerAPI.java:81)
at java.base/jdk.internal.reflect.NativeMethodAccessorImpl.invoke0(Native Method)
at java.base/jdk.internal.reflect.NativeMethodAccessorImpl.invoke(NativeMethodAccessorImpl.java:62)
at java.base/jdk.internal.reflect.DelegatingMethodAccessorImpl.invoke(DelegatingMethodAccessorImpl.java:43)
at java.base/java.lang.reflect.Method.invoke(Method.java:566)
at com.carrotsearch.randomizedtesting.RandomizedRunner.invoke(RandomizedRunner.java:1758)
at com.carrotsearch.randomizedtesting.RandomizedRunner$7.evaluate(RandomizedRunner.java:909)
at com.carrotsearch.randomizedtesting.rules.StatementAdapter.evaluate(StatementAdapter.java:36)
at com.carrotsearch.randomizedtesting.rules.StatementAdapter.evaluate(StatementAdapter.java:36)
at org.apache.lucene.tests.util.AbstractBeforeAfterRule$1.evaluate(AbstractBeforeAfterRule.java:43)
at org.apache.lucene.tests.util.AbstractBeforeAfterRule$1.evaluate(AbstractBeforeAfterRule.java:43)
at com.carrotsearch.randomizedtesting.rules.SystemPropertiesRestoreRule$1.evaluate(SystemPropertiesRestoreRule.java:80)
at org.junit.rules.RunRules.evaluate(RunRules.java:20)
at org.apache.lucene.tests.util.AbstractBeforeAfterRule$1.evaluate(AbstractBeforeAfterRule.java:43)
at com.carrotsearch.randomizedtesting.rules.StatementAdapter.evaluate(StatementAdapter.java:36)
at org.apache.lucene.tests.util.TestRuleStoreClassName$1.evaluate(TestRuleStoreClassName.java:38)
at com.carrotsearch.randomizedtesting.rules.NoShadowingOrOverridesOnMethodsRule$1.evaluate(NoShadowingOrOverridesOnMethodsRule.java:40)
at com.carrotsearch.randomizedtesting.rules.NoShadowingOrOverridesOnMethodsRule$1.evaluate(NoShadowingOrOverridesOnMethodsRule.java:40)
at com.carrotsearch.randomizedtesting.rules.StatementAdapter.evaluate(StatementAdapter.java:36)
at com.carrotsearch.randomizedtesting.rules.StatementAdapter.evaluate(StatementAdapter.java:36)
at org.apache.lucene.tests.util.TestRuleAssertionsRequired$1.evaluate(TestRuleAssertionsRequired.java:53)
at org.apache.lucene.tests.util.AbstractBeforeAfterRule$1.evaluate(AbstractBeforeAfterRule.java:43)
at org.apache.lucene.tests.util.TestRuleMarkFailure$1.evaluate(TestRuleMarkFailure.java:44)
at org.apache.lucene.tests.util.TestRuleIgnoreAfterMaxFailures$1.evaluate(TestRuleIgnoreAfterMaxFailures.java:60)
at org.apache.lucene.tests.util.TestRuleIgnoreTestSuites$1.evaluate(TestRuleIgnoreTestSuites.java:47)
at org.junit.rules.RunRules.evaluate(RunRules.java:20)
at com.carrotsearch.randomizedtesting.rules.StatementAdapter.evaluate(StatementAdapter.java:36)
at com.carrotsearch.randomizedtesting.ThreadLeakControl$StatementRunner.run(ThreadLeakControl.java:390)
at com.carrotsearch.randomizedtesting.ThreadLeakControl.lambda$forkTimeoutingTask$0(ThreadLeakControl.java:850)
at java.base/java.lang.Thread.run(Thread.java:829)
org.apache.solr.handler.designer.TestSchemaDesignerAPI > test suite's output saved to /home/jenkins/jenkins-slave/workspace/Solr/Solr-Smoketest-9.x/_tmp/smoke_1739520384/unpack/solr-9.9.0/solr/core/build/test-results/test/outputs/OUTPUT-org.apache.solr.handler.designer.TestSchemaDesignerAPI.txt, copied below:
2> 1405533 INFO (SUITE-TestSchemaDesignerAPI-seed#[AF9DEC95FE96F4E0]-worker) [n: c: s: r: x: t:] o.a.s.SolrTestCase Setting 'solr.default.confdir' system property to test-framework derived value of '/home/jenkins/jenkins-slave/workspace/Solr/Solr-Smoketest-9.x/_tmp/smoke_1739520384/unpack/solr-9.9.0/solr/server/solr/configsets/_default/conf'
2> 1405533 INFO (SUITE-TestSchemaDesignerAPI-seed#[AF9DEC95FE96F4E0]-worker) [n: c: s: r: x: t:] o.a.s.SolrTestCaseJ4 SecureRandom sanity checks: test.solr.allowed.securerandom=null & java.security.egd=file:/dev/./urandom
2> 1405534 INFO (SUITE-TestSchemaDesignerAPI-seed#[AF9DEC95FE96F4E0]-worker) [n: c: s: r: x: t:] o.a.s.u.ErrorLogMuter Closing ErrorLogMuter-regex-553 after mutting 0 log messages
2> 1405534 INFO (SUITE-TestSchemaDesignerAPI-seed#[AF9DEC95FE96F4E0]-worker) [n: c: s: r: x: t:] o.a.s.u.ErrorLogMuter Creating ErrorLogMuter-regex-554 for ERROR logs matching regex: ignore_exception
2> 1405534 INFO (SUITE-TestSchemaDesignerAPI-seed#[AF9DEC95FE96F4E0]-worker) [n: c: s: r: x: t:] o.a.s.SolrTestCaseJ4 Created dataDir: /home/jenkins/jenkins-slave/workspace/Solr/Solr-Smoketest-9.x/_tmp/smoke_1739520384/unpack/solr-9.9.0/solr/core/build/tmp/tests-tmp/org.apache.solr.handler.designer.TestSchemaDesignerAPI_AF9DEC95FE96F4E0-001/data-dir-237-001
2> 1405534 WARN (SUITE-TestSchemaDesignerAPI-seed#[AF9DEC95FE96F4E0]-worker) [n: c: s: r: x: t:] o.a.s.SolrTestCaseJ4 startTrackingSearchers: numOpens=7 numCloses=7
2> 1405534 INFO (SUITE-TestSchemaDesignerAPI-seed#[AF9DEC95FE96F4E0]-worker) [n: c: s: r: x: t:] o.a.s.SolrTestCaseJ4 Using PointFields (NUMERIC_POINTS_SYSPROP=true) w/NUMERIC_DOCVALUES_SYSPROP=true
2> 1405535 INFO (SUITE-TestSchemaDesignerAPI-seed#[AF9DEC95FE96F4E0]-worker) [n: c: s: r: x: t:] o.a.s.SolrTestCaseJ4 Randomized ssl (false) and clientAuth (true) via: @org.apache.solr.util.RandomizeSSL(reason="", ssl=0.0/0.0, value=0.0/0.0, clientAuth=0.0/0.0)
2> 1405535 INFO (SUITE-TestSchemaDesignerAPI-seed#[AF9DEC95FE96F4E0]-worker) [n: c: s: r: x: t:] o.a.s.u.t.SimplePropagator Always-on trace id generation enabled.
2> 1405535 INFO (SUITE-TestSchemaDesignerAPI-seed#[AF9DEC95FE96F4E0]-worker) [n: c: s: r: x: t:] o.a.s.c.MiniSolrCloudCluster Starting cluster of 1 servers in /home/jenkins/jenkins-slave/workspace/Solr/Solr-Smoketest-9.x/_tmp/smoke_1739520384/unpack/solr-9.9.0/solr/core/build/tmp/tests-tmp/org.apache.solr.handler.designer.TestSchemaDesignerAPI_AF9DEC95FE96F4E0-001/tempDir-001
2> 1405535 INFO (SUITE-TestSchemaDesignerAPI-seed#[AF9DEC95FE96F4E0]-worker) [n: c: s: r: x: t:] o.a.s.c.ZkTestServer STARTING ZK TEST SERVER
2> 1405536 INFO (ZkTestServer Run Thread) [n: c: s: r: x: t:] o.a.s.c.ZkTestServer client port: /127.0.0.1:0
2> 1405536 INFO (ZkTestServer Run Thread) [n: c: s: r: x: t:] o.a.s.c.ZkTestServer Starting server
2> 1405537 WARN (ZkTestServer Run Thread) [n: c: s: r: x: t:] o.a.z.s.ServerCnxnFactory maxCnxns is not configured, using default value 0.
2> 1405636 INFO (SUITE-TestSchemaDesignerAPI-seed#[AF9DEC95FE96F4E0]-worker) [n: c: s: r: x: t:] o.a.s.c.ZkTestServer start zk server on port: 33285
2> 1405636 WARN (SUITE-TestSchemaDesignerAPI-seed#[AF9DEC95FE96F4E0]-worker) [n: c: s: r: x: t:] o.a.s.c.c.SolrZkClient Using default ZkCredentialsInjector. ZkCredentialsInjector is not secure, it creates an empty list of credentials which leads to 'OPEN_ACL_UNSAFE' ACLs to Zookeeper nodes
2> 1405637 INFO (SUITE-TestSchemaDesignerAPI-seed#[AF9DEC95FE96F4E0]-worker) [n: c: s: r: x: t:] o.a.s.c.c.ConnectionManager Waiting up to 30000ms for client to connect to ZooKeeper
2> 1405639 INFO (zkCallback-22474-thread-1) [n: c: s: r: x: t:] o.a.s.c.c.ConnectionManager zkClient has connected
2> 1405639 INFO (SUITE-TestSchemaDesignerAPI-seed#[AF9DEC95FE96F4E0]-worker) [n: c: s: r: x: t:] o.a.s.c.c.ConnectionManager Client is connected to ZooKeeper
2> 1405639 WARN (SUITE-TestSchemaDesignerAPI-seed#[AF9DEC95FE96F4E0]-worker) [n: c: s: r: x: t:] o.a.s.c.c.SolrZkClient Using default ZkACLProvider. DefaultZkACLProvider is not secure, it creates 'OPEN_ACL_UNSAFE' ACLs to Zookeeper nodes
2> 1405640 WARN (SUITE-TestSchemaDesignerAPI-seed#[AF9DEC95FE96F4E0]-worker) [n: c: s: r: x: t:] o.a.s.c.c.SolrZkClient Using default ZkCredentialsInjector. ZkCredentialsInjector is not secure, it creates an empty list of credentials which leads to 'OPEN_ACL_UNSAFE' ACLs to Zookeeper nodes
2> 1405643 INFO (SUITE-TestSchemaDesignerAPI-seed#[AF9DEC95FE96F4E0]-worker) [n: c: s: r: x: t:] o.a.s.c.c.ConnectionManager Waiting up to 30000ms for client to connect to ZooKeeper
2> 1405647 INFO (zkCallback-22476-thread-1) [n: c: s: r: x: t:] o.a.s.c.c.ConnectionManager zkClient has connected
2> 1405647 INFO (SUITE-TestSchemaDesignerAPI-seed#[AF9DEC95FE96F4E0]-worker) [n: c: s: r: x: t:] o.a.s.c.c.ConnectionManager Client is connected to ZooKeeper
2> 1405647 WARN (SUITE-TestSchemaDesignerAPI-seed#[AF9DEC95FE96F4E0]-worker) [n: c: s: r: x: t:] o.a.s.c.c.SolrZkClient Using default ZkACLProvider. DefaultZkACLProvider is not secure, it creates 'OPEN_ACL_UNSAFE' ACLs to Zookeeper nodes
2> 1405647 WARN (SUITE-TestSchemaDesignerAPI-seed#[AF9DEC95FE96F4E0]-worker) [n: c: s: r: x: t:] o.a.s.c.c.SolrZkClient Using default ZkCredentialsInjector. ZkCredentialsInjector is not secure, it creates an empty list of credentials which leads to 'OPEN_ACL_UNSAFE' ACLs to Zookeeper nodes
2> 1405649 INFO (SUITE-TestSchemaDesignerAPI-seed#[AF9DEC95FE96F4E0]-worker) [n: c: s: r: x: t:] o.a.s.c.c.ConnectionManager Waiting up to 15000ms for client to connect to ZooKeeper
2> 1405651 INFO (zkCallback-22478-thread-1) [n: c: s: r: x: t:] o.a.s.c.c.ConnectionManager zkClient has connected
2> 1405651 INFO (SUITE-TestSchemaDesignerAPI-seed#[AF9DEC95FE96F4E0]-worker) [n: c: s: r: x: t:] o.a.s.c.c.ConnectionManager Client is connected to ZooKeeper
2> 1405651 WARN (SUITE-TestSchemaDesignerAPI-seed#[AF9DEC95FE96F4E0]-worker) [n: c: s: r: x: t:] o.a.s.c.c.SolrZkClient Using default ZkACLProvider. DefaultZkACLProvider is not secure, it creates 'OPEN_ACL_UNSAFE' ACLs to Zookeeper nodes
2> 1405754 INFO (jetty-launcher-22480-thread-1) [n: c: s: r: x: t:] o.a.s.e.JettySolrRunner Start Jetty (configured port=0, binding port=0)
2> 1405754 INFO (jetty-launcher-22480-thread-1) [n: c: s: r: x: t:] o.a.s.e.JettySolrRunner Trying to start Jetty on port 0 try number 2 ...
2> 1405754 INFO (jetty-launcher-22480-thread-1) [n: c: s: r: x: t:] o.e.j.s.Server jetty-10.0.22; built: 2024-06-27T16:03:51.502Z; git: 5c8471e852d377fd726ad9b1692c35ffc5febb09; jvm 11.0.16.1+1
2> 1405754 INFO (jetty-launcher-22480-thread-1) [n: c: s: r: x: t:] o.e.j.s.s.DefaultSessionIdManager Session workerName=node0
2> 1405755 INFO (jetty-launcher-22480-thread-1) [n: c: s: r: x: t:] o.a.s.e.JettySolrRunner Jetty properties: {hostContext=/solr, hostPort=34227, zkHost=127.0.0.1:33285/solr}
2> 1405755 ERROR (jetty-launcher-22480-thread-1) [n: c: s: r: x: t:] o.a.s.u.StartupLoggingUtils Missing Java Option solr.log.dir. Logging may be missing or incomplete.
2> 1405755 INFO (jetty-launcher-22480-thread-1) [n: c: s: r: x: t:] o.a.s.s.CoreContainerProvider Using logger factory org.apache.logging.slf4j.Log4jLoggerFactory
2> 1405755 INFO (jetty-launcher-22480-thread-1) [n: c: s: r: x: t:] o.a.s.s.CoreContainerProvider ___ _ Welcome to Apache Solr™ version 9.9.0
2> 1405755 INFO (jetty-launcher-22480-thread-1) [n: c: s: r: x: t:] o.a.s.s.CoreContainerProvider / __| ___| |_ _ Starting in cloud mode on port null
2> 1405755 INFO (jetty-launcher-22480-thread-1) [n: c: s: r: x: t:] o.a.s.s.CoreContainerProvider \__ \/ _ \ | '_| Install dir: /home/jenkins/jenkins-slave/workspace/Solr/Solr-Smoketest-9.x/_tmp/smoke_1739520384/unpack/solr-9.9.0/solr
2> 1405755 INFO (jetty-launcher-22480-thread-1) [n: c: s: r: x: t:] o.a.s.s.CoreContainerProvider |___/\___/_|_| Start time: 2025-02-14T08:40:10.497735Z
2> 1405755 INFO (jetty-launcher-22480-thread-1) [n: c: s: r: x: t:] o.a.s.s.CoreContainerProvider Solr Home: /home/jenkins/jenkins-slave/workspace/Solr/Solr-Smoketest-9.x/_tmp/smoke_1739520384/unpack/solr-9.9.0/solr/core/build/tmp/tests-tmp/org.apache.solr.handler.designer.TestSchemaDesignerAPI_AF9DEC95FE96F4E0-001/tempDir-001/node1 (source: servlet config: solr.solr.home)
2> 1405755 WARN (jetty-launcher-22480-thread-1) [n: c: s: r: x: t:] o.a.s.c.c.SolrZkClient Using default ZkCredentialsInjector. ZkCredentialsInjector is not secure, it creates an empty list of credentials which leads to 'OPEN_ACL_UNSAFE' ACLs to Zookeeper nodes
2> 1405759 INFO (jetty-launcher-22480-thread-1) [n: c: s: r: x: t:] o.a.s.c.c.ConnectionManager Waiting up to 30000ms for client to connect to ZooKeeper
2> 1405761 INFO (zkCallback-22481-thread-1) [n: c: s: r: x: t:] o.a.s.c.c.ConnectionManager zkClient has connected
2> 1405761 INFO (jetty-launcher-22480-thread-1) [n: c: s: r: x: t:] o.a.s.c.c.ConnectionManager Client is connected to ZooKeeper
2> 1405762 WARN (jetty-launcher-22480-thread-1) [n: c: s: r: x: t:] o.a.s.c.c.SolrZkClient Using default ZkACLProvider. DefaultZkACLProvider is not secure, it creates 'OPEN_ACL_UNSAFE' ACLs to Zookeeper nodes
2> 1405762 INFO (jetty-launcher-22480-thread-1) [n: c: s: r: x: t:] o.a.s.c.NodeConfig solr.xml found in ZooKeeper. Loading...
2> 1405763 INFO (jetty-launcher-22480-thread-1) [n: c: s: r: x: t:] o.a.s.c.SolrXmlConfig Metrics collection is disabled.
2> 1405875 INFO (jetty-launcher-22480-thread-1) [n: c: s: r: x: t:] o.a.s.c.ZkContainer Zookeeper client=127.0.0.1:33285/solr
2> 1405875 INFO (jetty-launcher-22480-thread-1) [n: c: s: r: x: t:] o.a.s.c.DistributedClusterStateUpdater Creating DistributedClusterStateUpdater with useDistributedStateUpdate=true. Solr will be using distributed cluster state updates.
2> 1405878 INFO (jetty-launcher-22480-thread-1) [n:127.0.0.1:34227_solr c: s: r: x: t:] o.a.s.c.c.ConnectionManager Waiting up to 15000ms for client to connect to ZooKeeper
2> 1405879 INFO (zkCallback-22494-thread-1) [n: c: s: r: x: t:] o.a.s.c.c.ConnectionManager zkClient has connected
2> 1405879 INFO (jetty-launcher-22480-thread-1) [n:127.0.0.1:34227_solr c: s: r: x: t:] o.a.s.c.c.ConnectionManager Client is connected to ZooKeeper
2> 1405892 WARN (jetty-launcher-22480-thread-1) [n:127.0.0.1:34227_solr c: s: r: x: t:] o.a.s.c.ZkController Contents of zookeeper /security.json are world-readable; consider setting up ACLs as described in https://solr.apache.org/guide/solr/latest/deployment-guide/zookeeper-access-control.html
2> 1405895 INFO (jetty-launcher-22480-thread-1) [n:127.0.0.1:34227_solr c: s: r: x: t:] o.a.s.c.DistributedClusterStateUpdater Creating DistributedClusterStateUpdater with useDistributedStateUpdate=true. Solr will be using distributed cluster state updates.
2> 1405896 INFO (jetty-launcher-22480-thread-1) [n:127.0.0.1:34227_solr c: s: r: x: t:] o.a.s.c.OverseerElectionContext I am going to be the leader 127.0.0.1:34227_solr
2> 1405897 INFO (jetty-launcher-22480-thread-1) [n:127.0.0.1:34227_solr c: s: r: x: t:] o.a.s.c.Overseer Overseer (id=72283997827694596-127.0.0.1:34227_solr-n_0000000000) starting
2> 1405903 INFO (jetty-launcher-22480-thread-1) [n:127.0.0.1:34227_solr c: s: r: x: t:] o.a.s.c.ZkController Register node as live in ZooKeeper:/live_nodes/127.0.0.1:34227_solr
2> 1405903 INFO (OverseerStateUpdate-72283997827694596-127.0.0.1:34227_solr-n_0000000000) [n:127.0.0.1:34227_solr c: s: r: x: t:] o.a.s.c.Overseer Starting to work on the main queue : 127.0.0.1:34227_solr
2> 1405904 INFO (zkCallback-22494-thread-1) [n: c: s: r: x: t:] o.a.s.c.c.ZkStateReader Updated live nodes from ZooKeeper... (0) -> (1)
2> 1405905 WARN (jetty-launcher-22480-thread-1) [n:127.0.0.1:34227_solr c: s: r: x: t:] o.a.s.c.CoreContainer Not all security plugins configured! authentication=disabled authorization=disabled. Solr is only as secure as you make it. Consider configuring authentication/authorization before exposing Solr to users internal or external. See https://s.apache.org/solrsecurity for more info
2> 1405946 INFO (jetty-launcher-22480-thread-1) [n:127.0.0.1:34227_solr c: s: r: x: t:] o.a.s.c.CorePropertiesLocator Found 0 core definitions underneath /home/jenkins/jenkins-slave/workspace/Solr/Solr-Smoketest-9.x/_tmp/smoke_1739520384/unpack/solr-9.9.0/solr/core/build/tmp/tests-tmp/org.apache.solr.handler.designer.TestSchemaDesignerAPI_AF9DEC95FE96F4E0-001/tempDir-001/node1
2> 1405975 INFO (jetty-launcher-22480-thread-1) [n:127.0.0.1:34227_solr c: s: r: x: t:] o.a.s.j.SolrRequestAuthorizer Creating a new SolrRequestAuthorizer
2> 1405987 INFO (jetty-launcher-22480-thread-1) [n:127.0.0.1:34227_solr c: s: r: x: t:] o.e.j.s.h.ContextHandler Started o.e.j.s.ServletContextHandler@3366928c{/solr,file:///home/jenkins/jenkins-slave/workspace/Solr/Solr-Smoketest-9.x/_tmp/smoke_1739520384/unpack/solr-9.9.0/solr/core/build/tmp/tests-cwd/,AVAILABLE}
2> 1405987 INFO (jetty-launcher-22480-thread-1) [n:127.0.0.1:34227_solr c: s: r: x: t:] o.e.j.s.AbstractConnector Started ServerConnector@16baa652{HTTP/1.1, (http/1.1, h2c)}{127.0.0.1:34227}
2> 1405987 INFO (jetty-launcher-22480-thread-1) [n:127.0.0.1:34227_solr c: s: r: x: t:] o.e.j.s.Server Started Server@1bd9914d{STARTING}[10.0.22,sto=0] @1406014ms
2> 1405988 INFO (SUITE-TestSchemaDesignerAPI-seed#[AF9DEC95FE96F4E0]-worker) [n: c: s: r: x: t:] o.a.s.c.MiniSolrCloudCluster waitForAllNodes: numServers=1
2> 1405988 INFO (SUITE-TestSchemaDesignerAPI-seed#[AF9DEC95FE96F4E0]-worker) [n: c: s: r: x: t:] o.a.s.c.MiniSolrCloudCluster waitForNode: 127.0.0.1:34227_solr
2> 1405988 WARN (SUITE-TestSchemaDesignerAPI-seed#[AF9DEC95FE96F4E0]-worker) [n: c: s: r: x: t:] o.a.s.c.c.SolrZkClient Using default ZkCredentialsInjector. ZkCredentialsInjector is not secure, it creates an empty list of credentials which leads to 'OPEN_ACL_UNSAFE' ACLs to Zookeeper nodes
2> 1405989 INFO (SUITE-TestSchemaDesignerAPI-seed#[AF9DEC95FE96F4E0]-worker) [n: c: s: r: x: t:] o.a.s.c.c.ConnectionManager Waiting up to 15000ms for client to connect to ZooKeeper
2> 1405990 INFO (zkCallback-22506-thread-1) [n: c: s: r: x: t:] o.a.s.c.c.ConnectionManager zkClient has connected
2> 1405990 INFO (SUITE-TestSchemaDesignerAPI-seed#[AF9DEC95FE96F4E0]-worker) [n: c: s: r: x: t:] o.a.s.c.c.ConnectionManager Client is connected to ZooKeeper
2> 1405990 WARN (SUITE-TestSchemaDesignerAPI-seed#[AF9DEC95FE96F4E0]-worker) [n: c: s: r: x: t:] o.a.s.c.c.SolrZkClient Using default ZkACLProvider. DefaultZkACLProvider is not secure, it creates 'OPEN_ACL_UNSAFE' ACLs to Zookeeper nodes
2> 1405990 INFO (SUITE-TestSchemaDesignerAPI-seed#[AF9DEC95FE96F4E0]-worker) [n: c: s: r: x: t:] o.a.s.c.c.ZkStateReader Updated live nodes from ZooKeeper... (0) -> (1)
2> 1405991 INFO (SUITE-TestSchemaDesignerAPI-seed#[AF9DEC95FE96F4E0]-worker) [n: c: s: r: x: t:] o.a.s.c.s.i.ZkClientClusterStateProvider Cluster at 127.0.0.1:33285/solr ready
2> 1405991 WARN (SUITE-TestSchemaDesignerAPI-seed#[AF9DEC95FE96F4E0]-worker) [n: c: s: r: x: t:] o.a.s.c.c.SolrZkClient Using default ZkCredentialsInjector. ZkCredentialsInjector is not secure, it creates an empty list of credentials which leads to 'OPEN_ACL_UNSAFE' ACLs to Zookeeper nodes
2> 1405995 INFO (SUITE-TestSchemaDesignerAPI-seed#[AF9DEC95FE96F4E0]-worker) [n: c: s: r: x: t:] o.a.s.c.c.ConnectionManager Waiting up to 45000ms for client to connect to ZooKeeper
2> 1405999 INFO (zkCallback-22509-thread-1) [n: c: s: r: x: t:] o.a.s.c.c.ConnectionManager zkClient has connected
2> 1405999 INFO (SUITE-TestSchemaDesignerAPI-seed#[AF9DEC95FE96F4E0]-worker) [n: c: s: r: x: t:] o.a.s.c.c.ConnectionManager Client is connected to ZooKeeper
2> 1405999 WARN (SUITE-TestSchemaDesignerAPI-seed#[AF9DEC95FE96F4E0]-worker) [n: c: s: r: x: t:] o.a.s.c.c.SolrZkClient Using default ZkACLProvider. DefaultZkACLProvider is not secure, it creates 'OPEN_ACL_UNSAFE' ACLs to Zookeeper nodes
2> 1406149 INFO (OverseerThreadFactory-22500-thread-1) [n: c:.system s: r: x: t:] o.a.s.c.a.c.CreateCollectionCmd Create collection .system
2> 1406153 INFO (OverseerThreadFactory-22500-thread-1) [n: c:.system s: r: x: t:] o.a.s.c.o.SliceMutator createReplica() {
2> "core":".system_shard1_replica_n1",
2> "node_name":"127.0.0.1:34227_solr",
2> "base_url":"http://127.0.0.1:34227/solr",
2> "collection":".system",
2> "shard":"shard1",
2> "state":"down",
2> "type":"NRT",
2> "operation":"ADDREPLICA",
2> "waitForFinalState":"false"}
2> 1406157 INFO (qtp410868525-33667-null-23318) [n:127.0.0.1:34227_solr c: s: r: x:.system_shard1_replica_n1 t:null-23318] o.a.s.h.a.CoreAdminOperation core create command qt=/admin/cores&collection.configName=.system&newCollection=true&collection=.system&version=2&replicaType=NRT&coreNodeName=core_node2&name=.system_shard1_replica_n1&action=CREATE&numShards=1&shard=shard1&wt=javabin
2> 1406163 INFO (qtp410868525-33667-null-23318) [n:127.0.0.1:34227_solr c:.system s:shard1 r:core_node2 x:.system_shard1_replica_n1 t:null-23318] o.a.s.c.SolrConfig Using Lucene MatchVersion: 9.12.1
2> 1406164 INFO (qtp410868525-33667-null-23318) [n:127.0.0.1:34227_solr c:.system s:shard1 r:core_node2 x:.system_shard1_replica_n1 t:null-23318] o.a.s.s.ManagedIndexSchemaFactory The schema is configured as managed, but managed schema resource managed-schema.xml not found - loading non-managed schema schema.xml instead
2> 1406165 INFO (qtp410868525-33667-null-23318) [n:127.0.0.1:34227_solr c:.system s:shard1 r:core_node2 x:.system_shard1_replica_n1 t:null-23318] o.a.s.s.IndexSchema Schema name=_system collection or core
2> 1406165 INFO (qtp410868525-33667-null-23318) [n:127.0.0.1:34227_solr c:.system s:shard1 r:core_node2 x:.system_shard1_replica_n1 t:null-23318] o.a.s.s.IndexSchema Loaded schema _system collection or core/1.7 with uniqueid field id
2> 1406167 INFO (qtp410868525-33667-null-23318) [n:127.0.0.1:34227_solr c:.system s:shard1 r:core_node2 x:.system_shard1_replica_n1 t:null-23318] o.a.s.s.ManagedIndexSchema Created and persisted managed schema znode at /configs/.system/managed-schema.xml
2> 1406169 INFO (qtp410868525-33667-null-23318) [n:127.0.0.1:34227_solr c:.system s:shard1 r:core_node2 x:.system_shard1_replica_n1 t:null-23318] o.a.s.s.ManagedIndexSchemaFactory After upgrading to managed schema in ZooKeeper, renamed the non-managed schema /configs/.system/schema.xml to /configs/.system/schema.xml.bak
2> 1406169 INFO (qtp410868525-33667-null-23318) [n:127.0.0.1:34227_solr c:.system s:shard1 r:core_node2 x:.system_shard1_replica_n1 t:null-23318] o.a.s.c.CoreContainer Creating SolrCore '.system_shard1_replica_n1' using configuration from configset .system, trusted=true
2> 1406170 INFO (qtp410868525-33667-null-23318) [n:127.0.0.1:34227_solr c:.system s:shard1 r:core_node2 x:.system_shard1_replica_n1 t:null-23318] o.a.s.c.SolrCore Opening new SolrCore at [/home/jenkins/jenkins-slave/workspace/Solr/Solr-Smoketest-9.x/_tmp/smoke_1739520384/unpack/solr-9.9.0/solr/core/build/tmp/tests-tmp/org.apache.solr.handler.designer.TestSchemaDesignerAPI_AF9DEC95FE96F4E0-001/tempDir-001/node1/.system_shard1_replica_n1], dataDir=[/home/jenkins/jenkins-slave/workspace/Solr/Solr-Smoketest-9.x/_tmp/smoke_1739520384/unpack/solr-9.9.0/solr/core/build/tmp/tests-tmp/org.apache.solr.handler.designer.TestSchemaDesignerAPI_AF9DEC95FE96F4E0-001/tempDir-001/node1/.system_shard1_replica_n1/data/]
2> 1406213 INFO (qtp410868525-33667-null-23318) [n:127.0.0.1:34227_solr c:.system s:shard1 r:core_node2 x:.system_shard1_replica_n1 t:null-23318] o.a.s.j.SolrRequestAuthorizer Creating a new SolrRequestAuthorizer
2> 1406215 INFO (qtp410868525-33667-null-23318) [n:127.0.0.1:34227_solr c:.system s:shard1 r:core_node2 x:.system_shard1_replica_n1 t:null-23318] o.a.s.u.UpdateHandler Using UpdateLog implementation: org.apache.solr.update.UpdateLog
2> 1406215 INFO (qtp410868525-33667-null-23318) [n:127.0.0.1:34227_solr c:.system s:shard1 r:core_node2 x:.system_shard1_replica_n1 t:null-23318] o.a.s.u.UpdateLog Initializing UpdateLog: dataDir= defaultSyncLevel=FLUSH numRecordsToKeep=100 maxNumLogsToKeep=10
2> 1406215 INFO (qtp410868525-33667-null-23318) [n:127.0.0.1:34227_solr c:.system s:shard1 r:core_node2 x:.system_shard1_replica_n1 t:null-23318] o.a.s.u.CommitTracker Hard AutoCommit: if 1 uncommitted docs;
2> 1406216 INFO (qtp410868525-33667-null-23318) [n:127.0.0.1:34227_solr c:.system s:shard1 r:core_node2 x:.system_shard1_replica_n1 t:null-23318] o.a.s.u.CommitTracker Soft AutoCommit: disabled
2> 1406217 INFO (qtp410868525-33667-null-23318) [n:127.0.0.1:34227_solr c:.system s:shard1 r:core_node2 x:.system_shard1_replica_n1 t:null-23318] o.a.s.r.ManagedResourceStorage Configured ZooKeeperStorageIO with znodeBase: /configs/.system
2> 1406218 INFO (qtp410868525-33667-null-23318) [n:127.0.0.1:34227_solr c:.system s:shard1 r:core_node2 x:.system_shard1_replica_n1 t:null-23318] o.a.s.r.ManagedResourceStorage Loaded null at path _rest_managed.json using ZooKeeperStorageIO:path=/configs/.system
2> 1406218 INFO (qtp410868525-33667-null-23318) [n:127.0.0.1:34227_solr c:.system s:shard1 r:core_node2 x:.system_shard1_replica_n1 t:null-23318] o.a.s.s.ZkIndexSchemaReader Creating ZooKeeper watch for the managed schema at /configs/.system/managed-schema.xml
2> 1406219 INFO (qtp410868525-33667-null-23318) [n:127.0.0.1:34227_solr c:.system s:shard1 r:core_node2 x:.system_shard1_replica_n1 t:null-23318] o.a.s.s.ZkIndexSchemaReader Current schema version 0 is already the latest
2> 1406219 INFO (qtp410868525-33667-null-23318) [n:127.0.0.1:34227_solr c:.system s:shard1 r:core_node2 x:.system_shard1_replica_n1 t:null-23318] o.a.s.h.ReplicationHandler Commits will be reserved for 10000 ms
2> 1406220 INFO (searcherExecutor-22512-thread-1-processing-.system_shard1_replica_n1 null-23318 core_node2 127.0.0.1:34227_solr .system shard1) [n:127.0.0.1:34227_solr c:.system s:shard1 r:core_node2 x:.system_shard1_replica_n1 t:null-23318] o.a.s.c.SolrCore Registered new searcher autowarm time: 0 ms
2> 1406222 INFO (qtp410868525-33667-null-23318) [n:127.0.0.1:34227_solr c:.system s:shard1 r:core_node2 x:.system_shard1_replica_n1 t:null-23318] o.a.s.c.ZkShardTerms Successful update of terms at /collections/.system/terms/shard1 to Terms{values={core_node2=0}, version=0} for registerTerm
2> 1406222 INFO (qtp410868525-33667-null-23318) [n:127.0.0.1:34227_solr c:.system s:shard1 r:core_node2 x:.system_shard1_replica_n1 t:null-23318] o.a.s.c.ShardLeaderElectionContextBase make sure parent is created /collections/.system/leaders/shard1
2> 1406224 INFO (qtp410868525-33667-null-23318) [n:127.0.0.1:34227_solr c:.system s:shard1 r:core_node2 x:.system_shard1_replica_n1 t:null-23318] o.a.s.c.ShardLeaderElectionContext Enough replicas found to continue.
2> 1406225 INFO (qtp410868525-33667-null-23318) [n:127.0.0.1:34227_solr c:.system s:shard1 r:core_node2 x:.system_shard1_replica_n1 t:null-23318] o.a.s.c.ShardLeaderElectionContext I may be the new leader - try and sync
2> 1406225 INFO (qtp410868525-33667-null-23318) [n:127.0.0.1:34227_solr c:.system s:shard1 r:core_node2 x:.system_shard1_replica_n1 t:null-23318] o.a.s.c.SyncStrategy Sync replicas to http://127.0.0.1:34227/solr/.system_shard1_replica_n1/
2> 1406225 INFO (qtp410868525-33667-null-23318) [n:127.0.0.1:34227_solr c:.system s:shard1 r:core_node2 x:.system_shard1_replica_n1 t:null-23318] o.a.s.c.SyncStrategy Sync Success - now sync replicas to me
2> 1406225 INFO (qtp410868525-33667-null-23318) [n:127.0.0.1:34227_solr c:.system s:shard1 r:core_node2 x:.system_shard1_replica_n1 t:null-23318] o.a.s.c.SyncStrategy http://127.0.0.1:34227/solr/.system_shard1_replica_n1/ has no replicas
2> 1406225 INFO (qtp410868525-33667-null-23318) [n:127.0.0.1:34227_solr c:.system s:shard1 r:core_node2 x:.system_shard1_replica_n1 t:null-23318] o.a.s.c.ShardLeaderElectionContextBase Creating leader registration node /collections/.system/leaders/shard1/leader after winning as /collections/.system/leader_elect/shard1/election/72283997827694596-core_node2-n_0000000000
2> 1406227 INFO (qtp410868525-33667-null-23318) [n:127.0.0.1:34227_solr c:.system s:shard1 r:core_node2 x:.system_shard1_replica_n1 t:null-23318] o.a.s.c.ShardLeaderElectionContext I am the new leader: http://127.0.0.1:34227/solr/.system_shard1_replica_n1/ shard1
2> 1406227 INFO (qtp410868525-33667-null-23318) [n:127.0.0.1:34227_solr c:.system s:shard1 r:core_node2 x:.system_shard1_replica_n1 t:null-23318] o.a.s.c.ZkController I am the leader, no recovery necessary
2> 1406230 INFO (qtp410868525-33667-null-23318) [n:127.0.0.1:34227_solr c: s: r: x: t:null-23318] o.a.s.s.HttpSolrCall [admin] webapp=null path=/admin/cores params={qt=/admin/cores&coreNodeName=core_node2&collection.configName=.system&newCollection=true&name=.system_shard1_replica_n1&action=CREATE&numShards=1&collection=.system&shard=shard1&wt=javabin&version=2&replicaType=NRT} status=0 QTime=73
2> 1406231 INFO (qtp410868525-33664-null-23317) [n:127.0.0.1:34227_solr c:.system s: r: x: t:null-23317] o.a.s.h.a.CollectionsHandler Wait for new collection to be active for at most 45 seconds. Check all shard replicas
2> 1406232 INFO (qtp410868525-33664-null-23317) [n:127.0.0.1:34227_solr c:.system s: r: x: t:null-23317] o.a.s.s.HttpSolrCall [admin] webapp=null path=/admin/collections params={pullReplicas=0&name=.system&nrtReplicas=1&action=CREATE&numShards=1&tlogReplicas=0&wt=javabin&version=2} status=0 QTime=88
2> 1406232 INFO (SUITE-TestSchemaDesignerAPI-seed#[AF9DEC95FE96F4E0]-worker) [n: c: s: r: x: t:] o.a.s.c.MiniSolrCloudCluster waitForActiveCollection: .system
2> 1406245 INFO (TEST-TestSchemaDesignerAPI.testBasicUserWorkflow-seed#[AF9DEC95FE96F4E0]) [n: c: s: r: x: t:] o.a.s.SolrTestCaseJ4 ###Starting testBasicUserWorkflow
2> 1406337 INFO (TEST-TestSchemaDesignerAPI.testBasicUserWorkflow-seed#[AF9DEC95FE96F4E0]) [n: c: s: r: x: t:] o.a.s.c.SolrConfig Using Lucene MatchVersion: 9.12.0
2> 1406340 INFO (TEST-TestSchemaDesignerAPI.testBasicUserWorkflow-seed#[AF9DEC95FE96F4E0]) [n: c: s: r: x: t:] o.a.s.s.IndexSchema Schema name=default-config
2> 1406377 INFO (TEST-TestSchemaDesignerAPI.testBasicUserWorkflow-seed#[AF9DEC95FE96F4E0]) [n: c: s: r: x: t:] o.a.s.s.IndexSchema Loaded schema default-config/1.7 with uniqueid field id
2> 1406423 INFO (TEST-TestSchemaDesignerAPI.testBasicUserWorkflow-seed#[AF9DEC95FE96F4E0]) [n: c: s: r: x: t:] o.a.s.s.ManagedIndexSchema Persisted managed schema version 1 at /configs/._designer_testJson/managed-schema.xml
2> 1406428 INFO (OverseerThreadFactory-22500-thread-2) [n: c:._designer_testJson s: r: x: t:] o.a.s.c.a.c.CreateCollectionCmd Create collection ._designer_testJson
2> 1406428 INFO (OverseerCollectionConfigSetProcessor-72283997827694596-127.0.0.1:34227_solr-n_0000000000) [n: c: s: r: x: t:] o.a.s.c.OverseerTaskQueue Response ZK path: /overseer/collection-queue-work/qnr-0000000000 doesn't exist. Requestor may have disconnected from ZooKeeper
2> 1406433 INFO (OverseerThreadFactory-22500-thread-2) [n: c:._designer_testJson s: r: x: t:] o.a.s.c.o.SliceMutator createReplica() {
2> "core":"._designer_testJson_shard1_replica_n1",
2> "node_name":"127.0.0.1:34227_solr",
2> "base_url":"http://127.0.0.1:34227/solr",
2> "collection":"._designer_testJson",
2> "shard":"shard1",
2> "state":"down",
2> "type":"NRT",
2> "operation":"ADDREPLICA",
2> "waitForFinalState":"false"}
2> 1406435 INFO (qtp410868525-33666-null-23320) [n:127.0.0.1:34227_solr c: s: r: x:._designer_testJson_shard1_replica_n1 t:null-23320] o.a.s.h.a.CoreAdminOperation core create command qt=/admin/cores&collection.configName=._designer_testJson&newCollection=true&collection=._designer_testJson&version=2&replicaType=NRT&coreNodeName=core_node2&name=._designer_testJson_shard1_replica_n1&action=CREATE&numShards=1&shard=shard1&wt=javabin
2> 1406440 INFO (qtp410868525-33666-null-23320) [n:127.0.0.1:34227_solr c:._designer_testJson s:shard1 r:core_node2 x:._designer_testJson_shard1_replica_n1 t:null-23320] o.a.s.c.SolrConfig Using Lucene MatchVersion: 9.12.0
2> 1406444 INFO (qtp410868525-33666-null-23320) [n:127.0.0.1:34227_solr c:._designer_testJson s:shard1 r:core_node2 x:._designer_testJson_shard1_replica_n1 t:null-23320] o.a.s.s.IndexSchema Schema name=default-config
2> 1406483 INFO (qtp410868525-33666-null-23320) [n:127.0.0.1:34227_solr c:._designer_testJson s:shard1 r:core_node2 x:._designer_testJson_shard1_replica_n1 t:null-23320] o.a.s.s.IndexSchema Loaded schema default-config/1.7 with uniqueid field id
2> 1406483 INFO (qtp410868525-33666-null-23320) [n:127.0.0.1:34227_solr c:._designer_testJson s:shard1 r:core_node2 x:._designer_testJson_shard1_replica_n1 t:null-23320] o.a.s.c.CoreContainer Creating SolrCore '._designer_testJson_shard1_replica_n1' using configuration from configset ._designer_testJson, trusted=true
2> 1406484 INFO (qtp410868525-33666-null-23320) [n:127.0.0.1:34227_solr c:._designer_testJson s:shard1 r:core_node2 x:._designer_testJson_shard1_replica_n1 t:null-23320] o.a.s.c.SolrCore Opening new SolrCore at [/home/jenkins/jenkins-slave/workspace/Solr/Solr-Smoketest-9.x/_tmp/smoke_1739520384/unpack/solr-9.9.0/solr/core/build/tmp/tests-tmp/org.apache.solr.handler.designer.TestSchemaDesignerAPI_AF9DEC95FE96F4E0-001/tempDir-001/node1/._designer_testJson_shard1_replica_n1], dataDir=[/home/jenkins/jenkins-slave/workspace/Solr/Solr-Smoketest-9.x/_tmp/smoke_1739520384/unpack/solr-9.9.0/solr/core/build/tmp/tests-tmp/org.apache.solr.handler.designer.TestSchemaDesignerAPI_AF9DEC95FE96F4E0-001/tempDir-001/node1/._designer_testJson_shard1_replica_n1/data/]
2> 1406521 INFO (qtp410868525-33666-null-23320) [n:127.0.0.1:34227_solr c:._designer_testJson s:shard1 r:core_node2 x:._designer_testJson_shard1_replica_n1 t:null-23320] o.a.s.j.SolrRequestAuthorizer
[...truncated too long message...]
Test, CollectionStateZnodeTest, ConcurrentCreateRoutedAliasTest, ConnectionManagerTest, CreateCollectionWithPropertiesTest, DeleteInactiveReplicaTest, DeleteNodeTest, DeleteShardTest, DistribCursorPagingTest, DistribJoinFromCollectionTest, DistributedQueueTest, DocValuesNotIndexedTest, ForceLeaderWithTlogReplicasTest, HttpPartitionOnCommitTest, HttpPartitionWithTlogReplicasTest, LeaderElectionIntegrationTest, LeaderFailoverAfterPartitionTest, LeaderTragicEventTest, MigrateReplicasTest, MissingSegmentRecoveryTest, MultiSolrCloudTestCaseTest, NestedShardedAtomicUpdateTest, NodeRolesTest, OverriddenZkACLAndCredentialsProvidersTest, OverseerModifyCollectionTest, OverseerSolrResponseTest, OverseerTaskQueueTest, PackageManagerCLITest, PeerSyncReplicationTest, RecoveryStrategyStressTest, RecoveryZkTestWithAuth, RemoteQueryErrorTest, RestartWhileUpdatingTest, RouteFieldTest, ShardRoutingCustomTest, ShardTermsTest, SolrCloudExampleTest, SplitShardTest, SyncSliceTest, TestAuthenticationFramework, TestCloudDeleteByQuery, TestCloudPhrasesIdentificationComponent, TestCloudPseudoReturnFields, TestCloudRecovery2, TestClusterProperties, TestConfigSetsAPIExclusivity, TestConfigSetsAPIZkFailure, TestDistribDocBasedVersion, TestDownShardTolerantSearch, TestExactSharedStatsCacheCloud, TestExclusionRuleCollectionAccess, TestLRUStatsCacheCloud, TestLeaderElectionWithEmptyReplica, TestLocalStatsCacheCloud, TestMiniSolrCloudClusterSSL, TestPrepRecovery, TestPullReplicaErrorHandling, TestQueryingOnDownCollection, TestRandomFlRTGCloud, TestRebalanceLeaders, TestSSLRandomization, TestShardsInfoResponse, TestSizeLimitedDistributedMap, TestStressCloudBlindAtomicUpdates, TestStressLiveNodes, TestTlogReplica, TestTolerantUpdateProcessorRandomCloud, TlogReplayBufferedWhileIndexingTest, UnloadDistributedZkTest, ZkCLITest, ZkDistributedLockTest, ZkNodePropsTest, ZkSolrClientTest, BackupRestoreApiErrorConditionsTest, CollectionReloadTest, CollectionsAPIAsyncDistributedZkTest, ConcurrentDeleteAndCreateCollectionTest, LocalFSCloudIncrementalBackupTest, PurgeGraphTest, SimpleCollectionCreateDeleteTest, TestCollectionAPI, TestLocalFSCloudBackupRestore, TestRequestStatusCollectionAPI, ZkCollectionPropsCachingTest, ZkStateWriterTest, CollectionsRepairEventListenerTest, CollectionMetricsBuilderTest, PlacementPluginIntegrationTest, AffinityPlacementFactoryTest, SimplePlacementFactoryTest, TestObjectReleaseTracker, BlobRepositoryCloudTest, ByteBuffersDirectoryFactoryTest, CachingDirectoryFactoryTest, CoreSorterTest, DirectoryFactoryTest, PluginBagTest, QueryResultKeyTest, RAMDirectoryFactoryTest, ResourceLoaderTest, SolrCoreCheckLockOnStartupTest, TestBackupRepositoryFactory, TestCodecSupport, TestConfig, TestConfigSetImmutable, TestConfigSetService, TestConfigWithLibDisabled, TestCoreDiscovery, TestCustomStream, TestHttpSolrClientProvider, TestInfoStreamLogging, TestJmxIntegration, TestMergePolicyConfig, TestNRTOpen, TestQuerySenderNoQuery, TestSchemaCodecFactoryDefaults, TestSolrConfigHandler, TestSolrDeletionPolicy2, TestSolrXml, TestXIncludeConfig, BackupIdTest, LocalFileSystemRepositoryTest, TestSol
2> rCoreSnapshots, BinaryUpdateRequestHandlerTest, DocumentAnalysisRequestHandlerTest, JsonLoaderTest, PingRequestHandlerTest, RequestHandlerMetricsTest, SearchHandlerTest, TestCSVLoader, TestContainerPlugin, TestHttpRequestId, TestReplicationHandler, TestReplicationHandlerDiskOverFlow, TestRequestId, TestSampleDocumentsLoader, TestSolrConfigHandlerCloud, TestStressIncrementalBackup, TestSystemCollAutoCreate, V2ApiIntegrationTest, V2StandaloneTest, XmlUpdateRequestHandlerTest, CoreAdminCreateDiscoverTest, CoreAdminHandlerTest, CoreAdminRequestStatusTest, DaemonStreamApiTest, IndexSizeEstimatorTest, LoggingHandlerTest, MBeansHandlerTest, PropertiesRequestHandlerTest, SecurityConfHandlerTest, ShowFileRequestHandlerTest, SplitHandlerTest, SystemInfoHandlerTest, TestCollectionAPIs, ThreadDumpHandlerTest, V2ConfigAPIMappingTest, V2SecurityAPIMappingTest, ZookeeperStatusHandlerFailureTest, AddReplicaPropertyAPITest, BalanceShardUniqueAPITest, CoreReplicationAPITest, CreateAliasAPITest, CreateCollectionSnapshotAPITest, CreateShardAPITest, DeleteCollectionAPITest, DeleteCollectionSnapshotAPITest, DeleteReplicaAPITest, DeleteShardAPITest, GetNodeCommandStatusTest, GetSchemaFieldsAPITest, MergeIndexesTest, NodeLoggingAPITest, ReloadCoreAPITest, RestoreCollectionAPITest, SyncShardAPITest, V2CollectionAPIMappingTest, V2CoreAPIMappingTest, V2SchemaAPIMappingTest, V2ApiUtilsTest, CloudReplicaSourceTest, DebugComponentTest, DistributedExpandComponentTest, DistributedFacetPivotLargeTest, DistributedFacetPivotSmallAdvancedTest, DistributedFacetPivotWhiteBoxTest, DistributedQueryComponentCustomSortTest, DistributedQueryElevationComponentTest, DistributedSuggestComponentTest, FacetPivot2CollectionsTest, InfixSuggestersTest, PhrasesIdentificationComponentTest, QueryElevationComponentTest, ResponseLogComponentTest, SearchHandlerTest, ShardsAllowListTest, StatsComponentTest, SuggestComponentTest, TermVectorComponentTest, TestDistributedStatsComponentCardinality, TestPivotHelperCode, TestTrackingShardHandlerFactory, ListConfigSetsAPITest, TestSchemaDesignerAPI]
2> NOTE: reproduce with: gradlew test --tests TestSchemaDesignerAPI -Dtests.seed=AF9DEC95FE96F4E0 -Dtests.locale=rn-BI -Dtests.timezone=Africa/El_Aaiun -Dtests.asserts=true -Dtests.file.encoding=UTF-8
WARNING: Test org.apache.solr.schema.DocValuesTest wrote 10,894,617 bytes of output.
WARNING: Test org.apache.solr.schema.TestCloudSchemaless wrote 13,383,572 bytes of output.
WARNING: Test org.apache.solr.search.TestRandomCollapseQParserPlugin wrote 11,765,658 bytes of output.
> Task :solr:cross-dc-manager:test
:solr:cross-dc-manager:test (SUCCESS): 37 test(s), 7 skipped
> Task :solr:cross-dc-manager:wipeTaskTemp
> Task :solr:prometheus-exporter:compileJava
Note: Some input files use or override a deprecated API.
Note: Recompile with -Xlint:deprecation for details.
> Task :solr:prometheus-exporter:classes
> Task :solr:prometheus-exporter:compileTestJava
Note: Some input files use or override a deprecated API.
Note: Recompile with -Xlint:deprecation for details.
> Task :solr:prometheus-exporter:testClasses
> Task :solr:prometheus-exporter:test
:solr:prometheus-exporter:test (SUCCESS): 23 test(s)
> Task :solr:prometheus-exporter:wipeTaskTemp
> Task :solr:solr-ref-guide:compileTestJava
Note: Some input files use or override a deprecated API.
Note: Recompile with -Xlint:deprecation for details.
> Task :solr:solr-ref-guide:testClasses
> Task :solr:solr-ref-guide:test
:solr:solr-ref-guide:test (SUCCESS): 32 test(s)
> Task :solr:solr-ref-guide:wipeTaskTemp
> Task :solr:solrj:compileTestJava
Note: Some input files use or override a deprecated API.
Note: Recompile with -Xlint:deprecation for details.
> Task :solr:solrj:processTestResources
> Task :solr:solrj:testClasses
> Task :solr:solrj:test
> Task :solr:core:test
:solr:core:test (FAILURE): 5194 test(s), 1 failure(s), 204 skipped
5194 tests completed, 1 failed, 204 skipped
> Task :solr:solrj:test
:solr:solrj:test (SUCCESS): 1269 test(s), 40 skipped
> Task :solr:core:test FAILED
> Task :solr:core:wipeTaskTemp
> Task :solr:solrj:wipeTaskTemp
ERROR: The following test(s) have failed:
- org.apache.solr.handler.designer.TestSchemaDesignerAPI (:solr:core)
Test history: https://develocity.apache.org/scans/tests?search.rootProjectNames=solr-root&tests.container=org.apache.solr.handler.designer.TestSchemaDesignerAPI
Test output: /home/jenkins/jenkins-slave/workspace/Solr/Solr-Smoketest-9.x/_tmp/smoke_1739520384/unpack/solr-9.9.0/solr/core/build/test-results/test/outputs/OUTPUT-org.apache.solr.handler.designer.TestSchemaDesignerAPI.txt
Reproduce with: ./gradlew :solr:core:test --tests "org.apache.solr.handler.designer.TestSchemaDesignerAPI" "-Ptests.jvmargs=-XX:TieredStopAtLevel=1 -XX:+UseParallelGC -XX:ActiveProcessorCount=1 -XX:ReservedCodeCacheSize=120m" -Ptests.seed=AF9DEC95FE96F4E0 -Ptests.badapples=false -Ptests.file.encoding=ISO-8859-1
FAILURE: Build failed with an exception.
* What went wrong:
Execution failed for task ':solr:core:test'.
> There were failing tests. See the results at: file:///home/jenkins/jenkins-slave/workspace/Solr/Solr-Smoketest-9.x/_tmp/smoke_1739520384/unpack/solr-9.9.0/solr/core/build/test-results/test/
BUILD FAILED in 45m 32s
90 actionable tasks: 73 executed, 17 up-to-date
Publishing build scan...
https://develocity.apache.org/s/mvavtejjhack4
Traceback (most recent call last):
File "dev-tools/scripts/smokeTestRelease.py", line 1198, in <module>
main()
File "dev-tools/scripts/smokeTestRelease.py", line 1125, in main
downloadOnly=c.download_only)
File "dev-tools/scripts/smokeTestRelease.py", line 1186, in smokeTest
unpackAndVerify(java, tmpDir, 'solr-%s-src.tgz' % version, gitRevision, version, testArgs)
File "dev-tools/scripts/smokeTestRelease.py", line 575, in unpackAndVerify
verifyUnpacked(java, artifact, unpackPath, gitRevision, version, testArgs)
File "dev-tools/scripts/smokeTestRelease.py", line 666, in verifyUnpacked
java.run_java11('./gradlew --no-daemon test %s' % testArgs, '%s/test.log' % unpackPath)
File "dev-tools/scripts/smokeTestRelease.py", line 1034, in run_java
run('%s; %s' % (cmd_prefix, cmd), logfile)
File "dev-tools/scripts/smokeTestRelease.py", line 505, in run
raise RuntimeError('command "%s" failed; see log file %s' % (command, logPath))
RuntimeError: command "export JAVA_HOME="/home/jenkins/tools/java/latest11" PATH="/home/jenkins/tools/java/latest11/bin:$PATH" JAVACMD="/home/jenkins/tools/java/latest11/bin/java"; ./gradlew --no-daemon test -Dtests.nightly=false -Dtests.badapples=false " failed; see log file /home/jenkins/jenkins-slave/workspace/Solr/Solr-Smoketest-9.x/_tmp/smoke_1739520384/unpack/solr-9.9.0/test.log
Build step 'Run with timeout' marked build as failure
Email was triggered for: Failure - Any
Sending email for trigger: Failure - Any