You are viewing a plain text version of this content. The canonical link for it is here.
Posted to builds@lucene.apache.org by Policeman Jenkins Server via builds <bu...@lucene.apache.org> on 2026/01/04 22:58:02 UTC
[JENKINS-EA] Lucene-main-Linux (64bit/hotspot/jdk-26-ea+27) - Build # 61603 - Unstable!
Build: https://jenkins.thetaphi.de/job/Lucene-main-Linux/61603/
Java: 64bit/hotspot/jdk-26-ea+27 -XX:+UseCompressedOops -XX:+UseG1GC
1 tests failed.
FAILED: org.apache.lucene.codecs.blocktreeords.TestOrdsBlockTree.testDocsAndFreqsAndPositionsAndPayloads
Error Message:
com.carrotsearch.randomizedtesting.UncaughtExceptionError: Captured an uncaught exception in thread: Thread[id=82, name=Thread-31, state=RUNNABLE, group=TGRP-TestOrdsBlockTree]
Stack Trace:
com.carrotsearch.randomizedtesting.UncaughtExceptionError: Captured an uncaught exception in thread: Thread[id=82, name=Thread-31, state=RUNNABLE, group=TGRP-TestOrdsBlockTree]
at __randomizedtesting.SeedInfo.seed([D74CB5FF576171C:BBD4CAE9CD95D08A]:0)
Caused by: java.lang.RuntimeException: org.apache.lucene.util.automaton.TooComplexToDeterminizeException: Determinizing automaton with 40 states and 101 transitions would require more than 10000 effort.
at __randomizedtesting.SeedInfo.seed([D74CB5FF576171C]:0)
at org.apache.lucene.tests.index.RandomPostingsTester$TestThread.run(RandomPostingsTester.java:1509)
Caused by: org.apache.lucene.util.automaton.TooComplexToDeterminizeException: Determinizing automaton with 40 states and 101 transitions would require more than 10000 effort.
at app//org.apache.lucene.util.automaton.Operations.determinize(Operations.java:727)
at app//org.apache.lucene.tests.index.RandomPostingsTester.testTermsOneThread(RandomPostingsTester.java:1709)
at app//org.apache.lucene.tests.index.RandomPostingsTester$TestThread.run(RandomPostingsTester.java:1506)