You are viewing a plain text version of this content. The canonical link for it is here.
Posted to builds@solr.apache.org by Apache Jenkins Server <je...@builds.apache.org> on 2023/08/22 11:38:47 UTC
[JENKINS] Solr » Solr-Check-9.x - Build # 5234 - Still Failing!
Build: https://ci-builds.apache.org/job/Solr/job/Solr-Check-9.x/5234/
1 tests failed.
FAILED: org.apache.solr.cloud.TestLeaderElectionZkExpiry.classMethod
Error Message:
com.carrotsearch.randomizedtesting.ThreadLeakError: 1 thread leaked from SUITE scope at org.apache.solr.cloud.TestLeaderElectionZkExpiry:
1) Thread[id=321, name=OverseerExitThread, state=TIMED_WAITING, group=Overseer state updater.]
at java.base@11.0.16/java.lang.Thread.sleep(Native Method)
at app//org.apache.solr.common.cloud.ZkCmdExecutor.retryDelay(ZkCmdExecutor.java:101)
at app//org.apache.solr.common.cloud.ZkCmdExecutor.retryOperation(ZkCmdExecutor.java:80)
at app//org.apache.solr.common.cloud.SolrZkClient.getChildren(SolrZkClient.java:400)
at app//org.apache.solr.cloud.LeaderElector.joinElection(LeaderElector.java:273)
at app//org.apache.solr.cloud.LeaderElector.retryElection(LeaderElector.java:392)
at app//org.apache.solr.cloud.LeaderElector.checkIfIamLeader(LeaderElector.java:134)
at app//org.apache.solr.cloud.LeaderElector.joinElection(LeaderElector.java:311)
at app//org.apache.solr.cloud.LeaderElector.retryElection(LeaderElector.java:392)
at app//org.apache.solr.cloud.ZkController.rejoinOverseerElection(ZkController.java:2396)
at app//org.apache.solr.cloud.Overseer$ClusterStateUpdater.checkIfIamStillLeader(Overseer.java:511)
at app//org.apache.solr.cloud.Overseer$ClusterStateUpdater$$Lambda$1461/0x00000008408b2840.run(Unknown Source)
at java.base@11.0.16/java.lang.Thread.run(Thread.java:829)
Stack Trace:
com.carrotsearch.randomizedtesting.ThreadLeakError: 1 thread leaked from SUITE scope at org.apache.solr.cloud.TestLeaderElectionZkExpiry:
1) Thread[id=321, name=OverseerExitThread, state=TIMED_WAITING, group=Overseer state updater.]
at java.base@11.0.16/java.lang.Thread.sleep(Native Method)
at app//org.apache.solr.common.cloud.ZkCmdExecutor.retryDelay(ZkCmdExecutor.java:101)
at app//org.apache.solr.common.cloud.ZkCmdExecutor.retryOperation(ZkCmdExecutor.java:80)
at app//org.apache.solr.common.cloud.SolrZkClient.getChildren(SolrZkClient.java:400)
at app//org.apache.solr.cloud.LeaderElector.joinElection(LeaderElector.java:273)
at app//org.apache.solr.cloud.LeaderElector.retryElection(LeaderElector.java:392)
at app//org.apache.solr.cloud.LeaderElector.checkIfIamLeader(LeaderElector.java:134)
at app//org.apache.solr.cloud.LeaderElector.joinElection(LeaderElector.java:311)
at app//org.apache.solr.cloud.LeaderElector.retryElection(LeaderElector.java:392)
at app//org.apache.solr.cloud.ZkController.rejoinOverseerElection(ZkController.java:2396)
at app//org.apache.solr.cloud.Overseer$ClusterStateUpdater.checkIfIamStillLeader(Overseer.java:511)
at app//org.apache.solr.cloud.Overseer$ClusterStateUpdater$$Lambda$1461/0x00000008408b2840.run(Unknown Source)
at java.base@11.0.16/java.lang.Thread.run(Thread.java:829)
at __randomizedtesting.SeedInfo.seed([233BAEF9C43DB517]:0)
Build Log:
[...truncated 2075 lines...]
ERROR: The following test(s) have failed:
- org.apache.solr.cloud.TestLeaderElectionZkExpiry.classMethod (:solr:core)
Test output: /tmp/src/solr/solr/core/build/test-results/test/outputs/OUTPUT-org.apache.solr.cloud.TestLeaderElectionZkExpiry.txt
Reproduce with: gradlew :solr:core:test --tests "org.apache.solr.cloud.TestLeaderElectionZkExpiry.classMethod" -Ptests.jvms=96 "-Ptests.jvmargs=-XX:TieredStopAtLevel=1 -XX:+UseParallelGC -XX:ActiveProcessorCount=1 -XX:ReservedCodeCacheSize=120m" -Ptests.seed=233BAEF9C43DB517 -Ptests.file.encoding=US-ASCII
FAILURE: Build failed with an exception.
* What went wrong:
Execution failed for task ':solr:core:test'.
> There were failing tests. See the results at: file:///tmp/src/solr/solr/core/build/test-results/test/
* Try:
> Run with --stacktrace option to get the stack trace.
> Run with --info or --debug option to get more log output.
> Run with --scan to get full insights.
* Get more help at https://help.gradle.org
BUILD FAILED in 20m 5s
654 actionable tasks: 637 executed, 17 up-to-date
[0m[?12l[?25h
------------------------------------------------------------------------
Build Failed: returned 1
Total time: 20m44.5s
------------------------------------------------------------------------
+ status=1
+ ./crave pull '**/build/**/test/TEST-*.xml' '**/*.events' 'heapdumps/**' '**/hs_err_pid*'
Error: rsync: [sender] change_dir "/tmp/src/solr/heapdumps" failed: No such file or directory (2)
rsync error: some files/attrs were not transferred (see previous errors) (code 23) at main.c(1684) [Receiver=3.1.3]
rsync: [Receiver] write error: Broken pipe (32)
+ exit 1
Build step 'Execute shell' marked build as failure
Archiving artifacts
Recording test results
[Checks API] No suitable checks publisher found.
Email was triggered for: Failure - Any
Sending email for trigger: Failure - Any