You are viewing a plain text version of this content. The canonical link for it is here.
Posted to woden-dev@ws.apache.org by Jeremy Hughes <hu...@apache.org> on 2007/04/12 22:43:48 UTC
Fwd: [Woden][continuum] BUILD FAILURE
The Woden build on the continuum machine is failing. The first time was here:
http://ws.zones.apache.org:10000/continuum/servlet/continuum/target/ProjectBuild.vm?view=ProjectBuild&buildId=1797&id=36
Any ideas?
Jeremy
---------- Forwarded message ----------
From: davidillsley (Continuum) <da...@apache.org>
Date: 12-Apr-0007 18:40
Subject: [Woden][continuum] BUILD FAILURE
To: hughesj@apache.org
Online report :
http://ws.zones.apache.org:10000/continuum/servlet/continuum/target/ProjectBuild.vm/view/ProjectBuild/id/36/buildId/1803
Build statistics:
State: Failed
Previous State: Failed
Started at: Thu, 12 Apr 2007 17:30:31 +0000
Finished at: Thu, 12 Apr 2007 17:40:30 +0000
Total time: 9m 59s
Build Trigger: Schedule
Exit code: 1
Building machine hostname: ws.zones.apache.org
Operating system : SunOS(unknown)
Java version : 1.5.0_09(Sun Microsystems Inc.)
Changes
lmandel Updated Lawrence's key.
/incubator/woden/trunk/java/KEYS
****************************************************************************
Output:
****************************************************************************
Snipped Output:
all classes are up to date
[INFO] [resources:testResources]
[INFO] Using default encoding to copy filtered resources.
[INFO] [compiler:testCompile]
[INFO] Nothing to compile - all classes are up to date
[INFO] [surefire:test]
[INFO] Surefire report directory:
/export/home/illsleyd/continuum/continuum-1.0.3/apps/continuum/working-directory/36/target/surefire-reports
-------------------------------------------------------
T E S T S
-------------------------------------------------------
Running org.apache.woden.wsdl20.xml.InterfaceFaultElementTest
Tests run: 2, Failures: 0, Errors: 0, Skipped: 0, Time elapsed: 0.044 sec
Running org.apache.woden.resolver.SimpleURIResolverTest
Tests run: 4, Failures: 0, Errors: 0, Skipped: 0, Time elapsed: 49.618 sec
Running org.apache.woden.wsdl20.xml.OMServiceElementTest
Tests run: 6, Failures: 0, Errors: 0, Skipped: 0, Time elapsed: 0.202 sec
Running org.apache.woden.wsdl20.ElementDeclarationTest
Tests run: 4, Failures: 0, Errors: 0, Skipped: 0, Time elapsed: 0.008 sec
Running org.apache.woden.wsdl20.xml.ChildElementCreationTest
Tests run: 9, Failures: 0, Errors: 0, Skipped: 0, Time elapsed: 0.081 sec
Running org.apache.woden.wsdl20.extensions.http.HTTPBindingOperationExtensionsTest
Tests run: 8, Failures: 0, Errors: 0, Skipped: 0, Time elapsed: 12.857 sec
Running org.apache.woden.wsdl20.xml.BindingOperationElementTest
Tests run: 4, Failures: 0, Errors: 0, Skipped: 0, Time elapsed: 0.018 sec
Running org.apache.woden.wsdl20.extensions.soap.SOAPBindingFaultReferenceExtensionsTest
Tests run: 2, Failures: 0, Errors: 0, Skipped: 0, Time elapsed: 3.202 sec
Running org.apache.woden.OMWSDLFactoryTest
Tests run: 2, Failures: 0, Errors: 0, Skipped: 0, Time elapsed: 0.01 sec
Running org.apache.woden.wsdl20.TypeDefinitionTest
Tests run: 4, Failures: 0, Errors: 0, Skipped: 0, Time elapsed: 0.01 sec
Running org.apache.woden.wsdl20.InterfaceTest
Tests run: 7, Failures: 0, Errors: 0, Skipped: 0, Time elapsed: 0.027 sec
Running org.apache.woden.wsdl20.extensions.soap.SOAPBindingExtensionsTest
Tests run: 5, Failures: 0, Errors: 0, Skipped: 0, Time elapsed: 7.297 sec
Running org.apache.woden.OMXMLElementTest
Tests run: 3, Failures: 0, Errors: 0, Skipped: 0, Time elapsed: 0.028 sec
Running org.apache.woden.wsdl20.extensions.soap.SOAPBindingFaultExtensionsTest
Tests run: 8, Failures: 0, Errors: 0, Skipped: 0, Time elapsed: 11.882 sec
Running org.apache.woden.xml.IntOrTokenAttrTest
Tests run: 5, Failures: 0, Errors: 0, Skipped: 0, Time elapsed: 0.024 sec
Running org.apache.woden.wsdl20.extensions.soap.SOAPBindingMessageReferenceExtensionsTest
Tests run: 4, Failures: 0, Errors: 0, Skipped: 0, Time elapsed: 5.406 sec
Running org.apache.woden.internal.wsdl20.validation.WSDLDocumentValidatorTest
Tests run: 10, Failures: 0, Errors: 0, Skipped: 0, Time elapsed: 0.037 sec
Running org.apache.woden.wsdl20.BindingOperationTest
Tests run: 4, Failures: 0, Errors: 0, Skipped: 0, Time elapsed: 0.104 sec
Running org.apache.woden.wsdl20.extensions.http.HTTPLocationTemplateTest
Tests run: 5, Failures: 0, Errors: 0, Skipped: 0, Time elapsed: 0.006 sec
Running org.apache.woden.wsdl20.InterfaceOperationTest
Tests run: 6, Failures: 0, Errors: 0, Skipped: 0, Time elapsed: 0.008 sec
Running org.apache.woden.wsdl20.xml.BindingFaultElementTest
Tests run: 2, Failures: 0, Errors: 0, Skipped: 0, Time elapsed: 0.005 sec
Running org.apache.woden.schema.SchemaTest
Tests run: 3, Failures: 0, Errors: 0, Skipped: 0, Time elapsed: 0.008 sec
Running org.apache.woden.internal.wsdl20.validation.WSDLComponentValidatorTest
Tests run: 23, Failures: 0, Errors: 0, Skipped: 0, Time elapsed: 0.024 sec
Running org.apache.woden.tests.TestErrorHandler
Tests run: 0, Failures: 0, Errors: 0, Skipped: 0, Time elapsed: 0.004 sec
Running org.apache.woden.wsdl20.BindingMessageReferenceTest
Tests run: 2, Failures: 0, Errors: 0, Skipped: 0, Time elapsed: 0.005 sec
Running org.apache.woden.wsdl20.DescriptionTest
Tests run: 11, Failures: 0, Errors: 0, Skipped: 0, Time elapsed: 0.01 sec
Running org.apache.woden.wsdl20.extensions.http.HTTPBindingMessageReferenceExtensionsTest
Tests run: 2, Failures: 0, Errors: 0, Skipped: 0, Time elapsed: 2.721 sec
Running org.apache.woden.wsdl20.extensions.soap.SOAPBindingOperationExtensionsTest
Tests run: 4, Failures: 0, Errors: 0, Skipped: 0, Time elapsed: 5.397 sec
Running org.apache.woden.wsdl20.InterfaceMessageReferenceTest
Tests run: 4, Failures: 0, Errors: 0, Skipped: 0, Time elapsed: 0.006 sec
Running org.apache.woden.ant.ObjectIdTableTest
Tests run: 1, Failures: 0, Errors: 0, Skipped: 0, Time elapsed: 0.006 sec
Running org.apache.woden.wsdl20.xml.NameAttributeTest
Tests run: 1, Failures: 0, Errors: 0, Skipped: 0, Time elapsed: 0.004 sec
Running org.apache.woden.internal.ReaderFeaturesTest
Tests run: 4, Failures: 0, Errors: 0, Skipped: 0, Time elapsed: 0.006 sec
Running org.apache.woden.wsdl20.extensions.http.HTTPEndpointExtensionsTest
Tests run: 2, Failures: 0, Errors: 0, Skipped: 0, Time elapsed: 2.698 sec
Running org.apache.woden.wsdl20.xml.EndpointElementTest
Tests run: 8, Failures: 0, Errors: 0, Skipped: 0, Time elapsed: 12.91 sec
Running org.apache.woden.wsdl20.BindingFaultReferenceTest
Tests run: 2, Failures: 0, Errors: 0, Skipped: 0, Time elapsed: 0.006 sec
Running org.apache.woden.wsdl20.EndpointTest
Tests run: 5, Failures: 0, Errors: 0, Skipped: 0, Time elapsed: 0.013 sec
Running org.apache.woden.tests.W3CTestSuiteTest
Tests run: 44, Failures: 44, Errors: 0, Skipped: 0, Time elapsed:
8.292 sec <<< FAILURE!
Running org.apache.woden.WSDLReaderTest
Tests run: 4, Failures: 0, Errors: 0, Skipped: 0, Time elapsed: 5.324 sec
Running org.apache.woden.wsdl20.xml.IncludeElementTest
Tests run: 2, Failures: 0, Errors: 0, Skipped: 0, Time elapsed: 0.014 sec
Running org.apache.woden.wsdl20.xml.BindingFaultReferenceElementTest
Tests run: 3, Failures: 0, Errors: 0, Skipped: 0, Time elapsed: 0.016 sec
Running org.apache.woden.wsdl20.extensions.http.HTTPBindingExtensionsTest
Tests run: 5, Failures: 0, Errors: 0, Skipped: 0, Time elapsed: 7.63 sec
Running org.apache.woden.resolver.OMSimpleURIResolverTest
Tests run: 4, Failures: 0, Errors: 0, Skipped: 0, Time elapsed: 0.263 sec
Running org.apache.woden.wsdl20.xml.InterfaceOperationElementTest
Tests run: 5, Failures: 0, Errors: 0, Skipped: 0, Time elapsed: 0.128 sec
Running org.apache.woden.wsdl20.BindingFaultTest
Tests run: 2, Failures: 0, Errors: 0, Skipped: 0, Time elapsed: 0.12 sec
Running org.apache.woden.wsdl20.xml.InterfaceFaultReferenceElementTest
Tests run: 4, Failures: 0, Errors: 0, Skipped: 0, Time elapsed: 0.124 sec
Running org.apache.woden.wsdl20.extensions.http.HTTPBindingFaultExtensionsTest
Tests run: 4, Failures: 0, Errors: 0, Skipped: 0, Time elapsed: 6.359 sec
Running org.apache.woden.WSDLFactoryTest
Tests run: 2, Failures: 0, Errors: 0, Skipped: 0, Time elapsed: 0.015 sec
Running org.apache.woden.wsdl20.InterfaceFaultTest
Tests run: 3, Failures: 0, Errors: 0, Skipped: 0, Time elapsed: 0.016 sec
Running org.apache.woden.wsdl20.xml.BindingMessageReferenceElementTest
Tests run: 2, Failures: 0, Errors: 0, Skipped: 0, Time elapsed: 0.014 sec
Running org.apache.woden.wsdl20.xml.InterfaceMessageReferenceElementTest
Tests run: 5, Failures: 0, Errors: 0, Skipped: 0, Time elapsed: 0.017 sec
Running org.apache.woden.OMWSDLReaderTest
Tests run: 2, Failures: 0, Errors: 0, Skipped: 0, Time elapsed: 0.025 sec
Running org.apache.woden.wsdl20.xml.TypesElementTest
Tests run: 5, Failures: 0, Errors: 0, Skipped: 0, Time elapsed: 0.017 sec
Running org.apache.woden.xml.TokenAttrTest
Tests run: 3, Failures: 0, Errors: 0, Skipped: 0, Time elapsed: 0.032 sec
Running org.apache.woden.wsdl20.xml.DescriptiontElementTest
Tests run: 14, Failures: 0, Errors: 0, Skipped: 0, Time elapsed: 0.033 sec
Running org.apache.woden.wsdl20.ServiceTest
Tests run: 4, Failures: 0, Errors: 0, Skipped: 0, Time elapsed: 0.081 sec
Running org.apache.woden.wsdl20.xml.ImportElementTest
Tests run: 4, Failures: 0, Errors: 0, Skipped: 0, Time elapsed: 0.016 sec
Running org.apache.woden.wsdl20.xml.ServiceElementTest
Tests run: 6, Failures: 0, Errors: 0, Skipped: 0, Time elapsed: 8.25 sec
Running org.apache.woden.tests.OMW3CTestSuiteTest
Tests run: 44, Failures: 44, Errors: 0, Skipped: 0, Time elapsed:
8.113 sec <<< FAILURE!
Running org.apache.woden.wsdl20.extensions.http.HTTPLocationTest
Tests run: 16, Failures: 0, Errors: 0, Skipped: 0, Time elapsed: 0.035 sec
Running org.apache.woden.types.NCNameTest
Tests run: 3, Failures: 0, Errors: 0, Skipped: 0, Time elapsed: 0.099 sec
Running org.apache.woden.wsdl20.xml.OMEndpointElementTest
Tests run: 8, Failures: 0, Errors: 0, Skipped: 0, Time elapsed: 0.114 sec
Running org.apache.woden.DOMXMLElementTest
Tests run: 3, Failures: 0, Errors: 0, Skipped: 0, Time elapsed: 0.033 sec
Running org.apache.woden.wsdl20.InterfaceFaultReferenceTest
Tests run: 4, Failures: 0, Errors: 0, Skipped: 0, Time elapsed: 0.024 sec
Running org.apache.woden.wsdl20.xml.BindingElementTest
Tests run: 6, Failures: 0, Errors: 0, Skipped: 0, Time elapsed: 0.028 sec
Running org.apache.woden.wsdl20.xml.InterfaceElementTest
Tests run: 6, Failures: 0, Errors: 0, Skipped: 0, Time elapsed: 0.028 sec
Running org.apache.woden.wsdl20.BindingTest
Tests run: 6, Failures: 0, Errors: 0, Skipped: 0, Time elapsed: 0.029 sec
Results :
Tests run: 399, Failures: 88, Errors: 0, Skipped: 0
[INFO] ------------------------------------------------------------------------
[ERROR] BUILD FAILURE
[INFO] ------------------------------------------------------------------------
[INFO] There are test failures.
[INFO] ------------------------------------------------------------------------
[INFO] For more information, run Maven with the -e switch
[INFO] ------------------------------------------------------------------------
[INFO] Total time: 9 minutes 54 seconds
[INFO] Finished at: Thu Apr 12 17:40:29 GMT+00:00 2007
[INFO] Final Memory: 40M/423M
[INFO] ------------------------------------------------------------------------
****************************************************************************
---------------------------------------------------------------------
To unsubscribe, e-mail: woden-dev-unsubscribe@ws.apache.org
For additional commands, e-mail: woden-dev-help@ws.apache.org