You are viewing a plain text version of this content. The canonical link for it is here.
Posted to dev@geronimo.apache.org by ga...@apache.org on 2009/08/21 16:41:26 UTC
[BUILD] branches/2.2: Failed for Revision: 806517
Geronimo Revision: 806517 built with tests included
See the full build-0800.log file at http://people.apache.org/builds/geronimo/server/binaries/2.2/20090821/build-0800.log
Download the binaries from http://people.apache.org/builds/geronimo/server/binaries/2.2/20090821
[INFO] BUILD SUCCESSFUL
[INFO] ------------------------------------------------------------------------
[INFO] Total time: 44 minutes 10 seconds
[INFO] Finished at: Fri Aug 21 08:50:33 EDT 2009
[INFO] Final Memory: 403M/1007M
[INFO] ------------------------------------------------------------------------
TESTSUITE RESULTS (Failures only)
=================================
Assembly: tomcat
=================================
See full test results and logs at http://people.apache.org/builds/geronimo/server/binaries/2.2/20090821/logs-0800-tomcat/
[INFO] Using assembly artifact: org.apache.geronimo.assemblies:geronimo-tomcat6-javaee5:zip:bin:2.2-SNAPSHOT:provided
[INFO] Using geronimoHome: /home/geronimo/geronimo/2.2/testsuite/target/geronimo-tomcat6-javaee5-2.2-SNAPSHOT
[INFO] Installing assembly...
[INFO] Expanding: /home/geronimo/.m2/repository/org/apache/geronimo/assemblies/geronimo-tomcat6-javaee5/2.2-SNAPSHOT/geronimo-tomcat6-javaee5-2.2-SNAPSHOT-bin.zip into /home/geronimo/geronimo/2.2/testsuite/target
[INFO] Starting Geronimo server...
[INFO] Selected option set: default
[INFO] Redirecting output to: /home/geronimo/geronimo/2.2/testsuite/target/geronimo-logs/org.apache.geronimo.mavenplugins.geronimo.server.StartServerMojo.log
[INFO] Waiting for Geronimo server...
[INFO] Geronimo server started in 0:00:54.736
[INFO] [shitty:install {execution: default}]
[INFO] Installing /home/geronimo/geronimo/2.2/testsuite/pom.xml to /home/geronimo/.m2/repository/org/apache/geronimo/testsuite/testsuite/testing/testsuite-testing.pom
[INFO] [shitty:test {execution: default}]
[INFO] Starting 36 test builds
[INFO]
[INFO] -------------------------------------------------------------------------------
[INFO]
[INFO] commands-testsuite/deploy RUNNING
[INFO] commands-testsuite/deploy SUCCESS (0:01:22.890)
[INFO] commands-testsuite/gshell RUNNING
[INFO] commands-testsuite/gshell SUCCESS (0:00:39.208)
[INFO] commands-testsuite/jaxws RUNNING
[INFO] commands-testsuite/jaxws SUCCESS (0:00:47.402)
[INFO] commands-testsuite/shutdown RUNNING
[INFO] commands-testsuite/shutdown SUCCESS (0:00:23.761)
[INFO] concurrent-testsuite/concurrent-basic RUNNING
[INFO] concurrent-testsuite/concurrent-basic SUCCESS (0:06:48.925)
[INFO] console-testsuite/advanced RUNNING
[INFO] console-testsuite/advanced SUCCESS (0:01:38.992)
[INFO] console-testsuite/basic RUNNING
[INFO] console-testsuite/basic SUCCESS (0:02:08.946)
[INFO] corba-testsuite/corba-helloworld RUNNING
[INFO] corba-testsuite/corba-helloworld SUCCESS (0:01:00.051)
[INFO] corba-testsuite/corba-marshal RUNNING
[INFO] corba-testsuite/corba-marshal SUCCESS (0:01:15.485)
[INFO] corba-testsuite/corba-mytime RUNNING
[INFO] corba-testsuite/corba-mytime SUCCESS (0:00:53.863)
[INFO] deployment-testsuite/deployment-tests RUNNING
[INFO] deployment-testsuite/deployment-tests SUCCESS (0:00:37.961)
[INFO] deployment-testsuite/jca-cms-tests RUNNING
[INFO] deployment-testsuite/jca-cms-tests SUCCESS (0:00:39.100)
[INFO] deployment-testsuite/manifestcp-tests RUNNING
[INFO] deployment-testsuite/manifestcp-tests SUCCESS (0:00:39.693)
[INFO] enterprise-testsuite/ejb-tests RUNNING
[INFO] enterprise-testsuite/ejb-tests SUCCESS (0:02:03.145)
[INFO] enterprise-testsuite/jms-tests RUNNING
[INFO] enterprise-testsuite/jms-tests FAILURE (0:01:21.295) Java returned: 1
[INFO] enterprise-testsuite/jpa-tests RUNNING
[INFO] enterprise-testsuite/jpa-tests SUCCESS (0:00:58.665)
[INFO] enterprise-testsuite/sec-client-tests RUNNING
[INFO] enterprise-testsuite/sec-client-tests SUCCESS (0:00:35.663)
[INFO] enterprise-testsuite/sec-tests RUNNING
[INFO] enterprise-testsuite/sec-tests SUCCESS (0:01:00.570)
[INFO] security-testsuite/test-security RUNNING
[INFO] security-testsuite/test-security FAILURE (0:00:53.048) Java returned: 1
[INFO] web-testsuite/test-2.1-jsps RUNNING
[INFO] web-testsuite/test-2.1-jsps SUCCESS (0:00:36.426)
[INFO] web-testsuite/test-2.5-servlets RUNNING
[INFO] web-testsuite/test-2.5-servlets SUCCESS (0:00:35.716)
[INFO] web-testsuite/test-myfaces RUNNING
[INFO] web-testsuite/test-myfaces SUCCESS (0:00:37.864)
[INFO] web-testsuite/test-tomcat RUNNING
[INFO] web-testsuite/test-tomcat SUCCESS (0:00:27.310)
[INFO] web-testsuite/test-web-forward RUNNING
[INFO] web-testsuite/test-web-forward SUCCESS (0:00:44.402)
[INFO] web-testsuite/test-web-references RUNNING
[INFO] web-testsuite/test-web-references SUCCESS (0:00:49.305)
[INFO] webservices-testsuite/jaxb-tests RUNNING
[INFO] webservices-testsuite/jaxb-tests SUCCESS (0:01:10.002)
[INFO] webservices-testsuite/jaxr-tests RUNNING
[INFO] webservices-testsuite/jaxr-tests SUCCESS (0:01:07.807)
[INFO] webservices-testsuite/jaxrpc-jaxws-tests RUNNING
[INFO] webservices-testsuite/jaxrpc-jaxws-tests SUCCESS (0:00:40.148)
[INFO] webservices-testsuite/jaxrpc-tests RUNNING
[INFO] webservices-testsuite/jaxrpc-tests SUCCESS (0:00:58.038)
[INFO] webservices-testsuite/jaxws-catalog-tests RUNNING
[INFO] webservices-testsuite/jaxws-catalog-tests SUCCESS (0:01:08.374)
[INFO] webservices-testsuite/jaxws-mtom-tests RUNNING
[INFO] webservices-testsuite/jaxws-mtom-tests SUCCESS (0:00:54.597)
[INFO] webservices-testsuite/jaxws-provider-tests RUNNING
[INFO] webservices-testsuite/jaxws-provider-tests SUCCESS (0:00:50.437)
[INFO] webservices-testsuite/jaxws-tests RUNNING
[INFO] webservices-testsuite/jaxws-tests SUCCESS (0:02:16.016)
[INFO] webservices-testsuite/jaxws-wsa-tests RUNNING
[INFO] webservices-testsuite/jaxws-wsa-tests SUCCESS (0:00:56.736)
[INFO] webservices-testsuite/saaj-tests RUNNING
[INFO] webservices-testsuite/saaj-tests SUCCESS (0:00:45.563)
[INFO] webservices-testsuite/stax-tests RUNNING
[INFO] webservices-testsuite/stax-tests SUCCESS (0:01:09.651)
[INFO]
[INFO] -------------------------------------------------------------------------------
[INFO] Test Summary (0:41:37.281)
[INFO] Passed: 34
[INFO] Failed: 2
[INFO] -------------------------------------------------------------------------------
[INFO]
[INFO] The following tests failed:
[INFO] * enterprise-testsuite/jms-tests - /home/geronimo/geronimo/2.2/testsuite/enterprise-testsuite/jms-tests/build.log
[INFO] * security-testsuite/test-security - /home/geronimo/geronimo/2.2/testsuite/security-testsuite/test-security/build.log
[INFO]
[INFO] ------------------------------------------------------------------------
[ERROR] BUILD ERROR
Assembly: jetty
=================================
See full test results and logs at http://people.apache.org/builds/geronimo/server/binaries/2.2/20090821/logs-0800-jetty/
[INFO] Using assembly artifact: org.apache.geronimo.assemblies:geronimo-jetty7-javaee5:zip:bin:2.2-SNAPSHOT:provided
[INFO] Using geronimoHome: /home/geronimo/geronimo/2.2/testsuite/target/geronimo-jetty7-javaee5-2.2-SNAPSHOT
[INFO] Installing assembly...
[INFO] Expanding: /home/geronimo/.m2/repository/org/apache/geronimo/assemblies/geronimo-jetty7-javaee5/2.2-SNAPSHOT/geronimo-jetty7-javaee5-2.2-SNAPSHOT-bin.zip into /home/geronimo/geronimo/2.2/testsuite/target
[INFO] Starting Geronimo server...
[INFO] Selected option set: default
[INFO] Redirecting output to: /home/geronimo/geronimo/2.2/testsuite/target/geronimo-logs/org.apache.geronimo.mavenplugins.geronimo.server.StartServerMojo.log
[INFO] Waiting for Geronimo server...
[INFO] Geronimo server started in 0:00:52.672
[INFO] [shitty:install {execution: default}]
[INFO] Installing /home/geronimo/geronimo/2.2/testsuite/pom.xml to /home/geronimo/.m2/repository/org/apache/geronimo/testsuite/testsuite/testing/testsuite-testing.pom
[INFO] [shitty:test {execution: default}]
[INFO] Starting 36 test builds
[INFO]
[INFO] -------------------------------------------------------------------------------
[INFO]
[INFO] commands-testsuite/deploy RUNNING
[INFO] commands-testsuite/deploy SUCCESS (0:01:21.286)
[INFO] commands-testsuite/gshell RUNNING
[INFO] commands-testsuite/gshell SUCCESS (0:00:39.315)
[INFO] commands-testsuite/jaxws RUNNING
[INFO] commands-testsuite/jaxws SUCCESS (0:00:45.527)
[INFO] commands-testsuite/shutdown RUNNING
[INFO] commands-testsuite/shutdown SUCCESS (0:00:23.885)
[INFO] concurrent-testsuite/concurrent-basic RUNNING
[INFO] concurrent-testsuite/concurrent-basic SUCCESS (0:06:34.179)
[INFO] console-testsuite/advanced RUNNING
[INFO] console-testsuite/advanced SUCCESS (0:01:39.225)
[INFO] console-testsuite/basic RUNNING
[INFO] console-testsuite/basic FAILURE (0:01:14.016) Java returned: 1
[INFO] corba-testsuite/corba-helloworld RUNNING
[INFO] corba-testsuite/corba-helloworld SUCCESS (0:00:58.759)
[INFO] corba-testsuite/corba-marshal RUNNING
[INFO] corba-testsuite/corba-marshal SUCCESS (0:01:07.586)
[INFO] corba-testsuite/corba-mytime RUNNING
[INFO] corba-testsuite/corba-mytime SUCCESS (0:00:52.874)
[INFO] deployment-testsuite/deployment-tests RUNNING
[INFO] deployment-testsuite/deployment-tests SUCCESS (0:00:38.023)
[INFO] deployment-testsuite/jca-cms-tests RUNNING
[INFO] deployment-testsuite/jca-cms-tests SUCCESS (0:00:34.142)
[INFO] deployment-testsuite/manifestcp-tests RUNNING
[INFO] deployment-testsuite/manifestcp-tests SUCCESS (0:00:40.408)
[INFO] enterprise-testsuite/ejb-tests RUNNING
[INFO] enterprise-testsuite/ejb-tests SUCCESS (0:00:54.213)
[INFO] enterprise-testsuite/jms-tests RUNNING
[INFO] enterprise-testsuite/jms-tests FAILURE (0:01:18.416) Java returned: 1
[INFO] enterprise-testsuite/jpa-tests RUNNING
[INFO] enterprise-testsuite/jpa-tests SUCCESS (0:00:50.463)
[INFO] enterprise-testsuite/sec-client-tests RUNNING
[INFO] enterprise-testsuite/sec-client-tests SUCCESS (0:00:35.123)
[INFO] enterprise-testsuite/sec-tests RUNNING
[INFO] enterprise-testsuite/sec-tests SUCCESS (0:00:57.825)
[INFO] security-testsuite/test-security RUNNING
[INFO] security-testsuite/test-security SUCCESS (0:00:58.977)
[INFO] web-testsuite/test-2.1-jsps RUNNING
[INFO] web-testsuite/test-2.1-jsps SUCCESS (0:00:37.427)
[INFO] web-testsuite/test-2.5-servlets RUNNING
[INFO] web-testsuite/test-2.5-servlets SUCCESS (0:00:36.384)
[INFO] web-testsuite/test-jetty RUNNING
[INFO] web-testsuite/test-jetty SUCCESS (0:00:28.160)
[INFO] web-testsuite/test-myfaces RUNNING
[INFO] web-testsuite/test-myfaces SUCCESS (0:00:39.025)
[INFO] web-testsuite/test-web-forward RUNNING
[INFO] web-testsuite/test-web-forward SUCCESS (0:00:42.052)
[INFO] web-testsuite/test-web-references RUNNING
[INFO] web-testsuite/test-web-references SUCCESS (0:00:48.066)
[INFO] webservices-testsuite/jaxb-tests RUNNING
[INFO] webservices-testsuite/jaxb-tests SUCCESS (0:01:11.285)
[INFO] webservices-testsuite/jaxr-tests RUNNING
[INFO] webservices-testsuite/jaxr-tests SUCCESS (0:01:13.631)
[INFO] webservices-testsuite/jaxrpc-jaxws-tests RUNNING
[INFO] webservices-testsuite/jaxrpc-jaxws-tests SUCCESS (0:00:35.299)
[INFO] webservices-testsuite/jaxrpc-tests RUNNING
[INFO] webservices-testsuite/jaxrpc-tests SUCCESS (0:00:57.309)
[INFO] webservices-testsuite/jaxws-catalog-tests RUNNING
[INFO] webservices-testsuite/jaxws-catalog-tests SUCCESS (0:00:58.099)
[INFO] webservices-testsuite/jaxws-mtom-tests RUNNING
[INFO] webservices-testsuite/jaxws-mtom-tests SUCCESS (0:00:49.135)
[INFO] webservices-testsuite/jaxws-provider-tests RUNNING
[INFO] webservices-testsuite/jaxws-provider-tests SUCCESS (0:00:54.402)
[INFO] webservices-testsuite/jaxws-tests RUNNING
[INFO] webservices-testsuite/jaxws-tests SUCCESS (0:02:08.934)
[INFO] webservices-testsuite/jaxws-wsa-tests RUNNING
[INFO] webservices-testsuite/jaxws-wsa-tests SUCCESS (0:00:53.131)
[INFO] webservices-testsuite/saaj-tests RUNNING
[INFO] webservices-testsuite/saaj-tests SUCCESS (0:00:45.831)
[INFO] webservices-testsuite/stax-tests RUNNING
[INFO] webservices-testsuite/stax-tests SUCCESS (0:01:11.105)
[INFO]
[INFO] -------------------------------------------------------------------------------
[INFO] Test Summary (0:38:33.956)
[INFO] Passed: 34
[INFO] Failed: 2
[INFO] -------------------------------------------------------------------------------
[INFO]
[INFO] The following tests failed:
[INFO] * console-testsuite/basic - /home/geronimo/geronimo/2.2/testsuite/console-testsuite/basic/build.log
[INFO] * enterprise-testsuite/jms-tests - /home/geronimo/geronimo/2.2/testsuite/enterprise-testsuite/jms-tests/build.log
[INFO]
[INFO] ------------------------------------------------------------------------
[ERROR] BUILD ERROR
Samples: branches/2.2
=================================
Log: http://people.apache.org/builds/geronimo/server/binaries/2.2/20090821/samples-0800.log
Build status: OK