You are viewing a plain text version of this content. The canonical link for it is here.
Posted to dev@poi.apache.org by Apache Jenkins Server <je...@builds.apache.org> on 2025/03/30 17:06:24 UTC

Build failed in Jenkins: POI » POI-DSL-Windows-1.22 #84

See <https://ci-builds.apache.org/job/POI/job/POI-DSL-Windows-1.22/84/display/redirect?page=changes>

Changes:

[PJ Fanning] [bug-69628] in ZipArchiveFakeEntry, use min of IOUtils and ZipArchiveFakeEntry entry size limits

[PJ Fanning] [bug-69628] add test case

[PJ Fanning] [bug-69628] add test case

[PJ Fanning] [bug-69628] make IOUtils more tolerant of len < 0

[PJ Fanning] [bug-69628] make ZipArchiveFakeEntry.setMaxEntrySize publicly accessible

[PJ Fanning] bytebuddy 1.17.4

[PJ Fanning] [bug-69628] make ZipArchiveFakeEntry.setMaxEntrySize publicly accessible


------------------------------------------
Started by an SCM change
Running as SYSTEM
[EnvInject] - Loading node environment variables.
[EnvInject] - Preparing an environment for the build.
[EnvInject] - Keeping Jenkins system variables.
[EnvInject] - Keeping Jenkins build variables.
[EnvInject] - Injecting as environment variables the properties content 
FORREST_HOME=f:\jenkins\tools\forrest\latest
LANG=en_US.UTF-8
CI_BUILD=TRUE

[EnvInject] - Variables injected successfully.
[EnvInject] - Injecting contributions.
Building remotely on jenkins-win-azr-3 (Windows-Docker Windows) in workspace <https://ci-builds.apache.org/job/POI/job/POI-DSL-Windows-1.22/ws/>
[WS-CLEANUP] Deleting project workspace...
[WS-CLEANUP] Done
Updating https://svn.apache.org/repos/asf/poi/trunk at revision '2025-03-30T17:03:18.471 +0000'
U         poi\src\main\java\org\apache\poi\util\IOUtils.java
U         poi\src\test\java\org\apache\poi\util\TestIOUtils.java
U         poi-ooxml\src\main\java\org\apache\poi\openxml4j\util\ZipArchiveFakeEntry.java
U         poi-ooxml\src\test\java\org\apache\poi\xwpf\usermodel\TestXWPFBugs.java
AU        test-data\document\bug69628.docx
U         build.xml
U         poi-ooxml-lite-agent\build.gradle

<-- Got one external: forrest.properties, svn url: https://svn.apache.org/repos/asf/poi/site/forrest.properties -->
Fetching 'https://svn.apache.org/repos/asf/poi/site/forrest.properties' at -1 into 'F:\jenkins\jenkins-home\712657a4\workspace\POI\POI-DSL-Windows-1.22\forrest.properties'
At revision 1924695


<-- Got one external: documentation, svn url: https://svn.apache.org/repos/asf/poi/site/src/documentation -->
Fetching 'https://svn.apache.org/repos/asf/poi/site/src/documentation' at -1 into 'F:\jenkins\jenkins-home\712657a4\workspace\POI\POI-DSL-Windows-1.22\src\documentation'
At revision 1924695

At revision 1924695

No changes for https://svn.apache.org/repos/asf/poi/site/forrest.properties since the previous build
No changes for https://svn.apache.org/repos/asf/poi/site/src/documentation since the previous build
[POI-DSL-Windows-1.22] $ cmd /c call C:\Users\jenkins\AppData\Local\Temp\jenkins14823507270484443848.bat
    X   forrest.properties
X       src\documentation

Performing status on external item at 'src\documentation':
svn: E155010: The node 'F:\jenkins\jenkins-home\712657a4\workspace\POI\POI-DSL-Windows-1.22\poi*\src\*' was not found.
Skipped 'poi\src\main\java9\module-info.class'
Skipped 'poi\src\test\java9\module-info.class'
Skipped 'poi-examples\src\main\java9\module-info.class'
Skipped 'poi-excelant\src\main\java9\module-info.class'
Skipped 'poi-excelant\src\test\java9\module-info.class'
Skipped 'poi-integration\src\test\java9\module-info.class'
Skipped 'poi-ooxml\src\main\java9\module-info.class'
Skipped 'poi-ooxml\src\test\java9\module-info.class'
Skipped 'poi-ooxml-full\src\main\java9\module-info.class'
Skipped 'poi-ooxml-lite\src\main\java9\module-info.class'
Skipped 'poi-ooxml-lite-agent\src\main\java9\module-info.class'
Skipped 'poi-scratchpad\src\main\java9\module-info.class'
Skipped 'poi-scratchpad\src\test\java9\module-info.class'
Java-Home: /home/jenkins/tools/java/latest22
 Volume in drive F is Data
 Volume Serial Number is 7E6F-D4C9

 Directory of f:\home\jenkins\tools\java

File Not Found
The system cannot find the path specified.
[Gradle] - Launching build.
[POI-DSL-Windows-1.22] $ cmd.exe /C "<https://ci-builds.apache.org/job/POI/job/POI-DSL-Windows-1.22/ws/gradlew.bat> -PjdkVersion=22 --refresh-dependencies clean jenkins && exit %%ERRORLEVEL%%"
 
ERROR: JAVA_HOME is set to an invalid directory: /home/jenkins/tools/java/latest22 
 
Please set the JAVA_HOME variable in your environment to match the 
location of your Java installation. 
Build step 'Invoke Gradle script' changed build result to FAILURE
Build step 'Invoke Gradle script' marked build as failure
[SpotBugs] Skipping execution of recorder since overall result is 'FAILURE'
Archiving artifacts
Recording test results
ERROR: Step ‘Publish JUnit test result report’ failed: No test report files were found. Configuration error?

---------------------------------------------------------------------
To unsubscribe, e-mail: dev-unsubscribe@poi.apache.org
For additional commands, e-mail: dev-help@poi.apache.org


Build failed in Jenkins: POI » POI-DSL-Windows-1.22 #86

Posted by Apache Jenkins Server <je...@builds.apache.org>.
See <https://ci-builds.apache.org/job/POI/job/POI-DSL-Windows-1.22/86/display/redirect?page=changes>

Changes:

[PJ Fanning] build issues due to commons-io 2.19.0

[PJ Fanning] commons-io 2.19.0

[PJ Fanning] commons-io 2.19.0

[PJ Fanning] use isEmpty

[PJ Fanning] use isEmpty

[PJ Fanning] [bug-69628] more changes to getMax methods

[PJ Fanning] [bug-69628] more changes to getMax methods

[PJ Fanning] [bug-69628] more changes to getMax methods

[PJ Fanning] [bug-69646] add tests

[PJ Fanning] tidy up

[PJ Fanning] tidy up

[PJ Fanning] [bug-69646] check for null _fd instance in dispose call

[PJ Fanning] [bug-69646] check for null _fd instance in dispose call

[Dominik Stadler] Exclude two more files when running tests with "no-scratchpad"


------------------------------------------
Started by an SCM change
Running as SYSTEM
[EnvInject] - Loading node environment variables.
[EnvInject] - Preparing an environment for the build.
[EnvInject] - Keeping Jenkins system variables.
[EnvInject] - Keeping Jenkins build variables.
[EnvInject] - Injecting as environment variables the properties content 
FORREST_HOME=f:\jenkins\tools\forrest\latest
LANG=en_US.UTF-8
CI_BUILD=TRUE

[EnvInject] - Variables injected successfully.
[EnvInject] - Injecting contributions.
Building remotely on jenkins-win-azr-4 (Windows-Docker Windows) in workspace <https://ci-builds.apache.org/job/POI/job/POI-DSL-Windows-1.22/ws/>
[WS-CLEANUP] Deleting project workspace...
[WS-CLEANUP] Done
Updating https://svn.apache.org/repos/asf/poi/trunk at revision '2025-04-13T17:02:25.955 +0000'
U         poi\src\main\java\org\apache\poi\hssf\record\EscherAggregate.java
U         poi\src\main\java\org\apache\poi\hssf\usermodel\HSSFWorkbook.java
U         poi\src\main\java\org\apache\poi\hssf\usermodel\HSSFCell.java
U         poi\src\main\java\org\apache\poi\ss\formula\function\FunctionMetadataReader.java
U         poi\src\main\java\org\apache\poi\util\IOUtils.java
U         poi\src\test\java\org\apache\poi\hssf\model\TestDrawingAggregate.java
U         poi\src\test\java\org\apache\poi\hssf\model\TestEscherRecordFactory.java
U         poi\src\test\java\org\apache\poi\hssf\record\TestRecordFactory.java
U         poi\src\test\java\org\apache\poi\util\TestIOUtils.java
U         poi\src\test\java\org\apache\poi\ss\usermodel\BaseTestCell.java
U         poi\src\test\java\org\apache\poi\ss\usermodel\BaseTestConditionalFormatting.java
U         build.gradle
U         build.xml
U         poi-ooxml\src\main\java\org\apache\poi\xwpf\usermodel\XWPFRun.java
U         poi-ooxml\src\main\java\org\apache\poi\xwpf\usermodel\XWPFPictureData.java
U         poi-ooxml\src\main\java\org\apache\poi\xwpf\extractor\XWPFWordExtractor.java
U         poi-ooxml\src\main\java\org\apache\poi\xssf\usermodel\XSSFSheet.java
U         poi-ooxml\src\main\java\org\apache\poi\xssf\usermodel\XSSFPictureData.java
U         poi-ooxml\src\main\java\org\apache\poi\xssf\usermodel\XSSFCell.java
U         poi-ooxml\src\main\java\org\apache\poi\xssf\binary\XSSFBParser.java
U         poi-ooxml\src\main\java\org\apache\poi\xssf\streaming\SheetDataWriter.java
U         poi-ooxml\src\main\java\org\apache\poi\xssf\streaming\StreamingSheetWriter.java
U         poi-ooxml\src\main\java\org\apache\poi\xssf\streaming\SXSSFCell.java
U         poi-ooxml\src\main\java\org\apache\poi\openxml4j\util\ZipArchiveThresholdInputStream.java
U         poi-ooxml\src\main\java\org\apache\poi\openxml4j\util\ZipArchiveFakeEntry.java
U         poi-ooxml\src\main\java\org\apache\poi\openxml4j\opc\ZipPackage.java
U         poi-ooxml\src\main\java\org\apache\poi\openxml4j\opc\internal\marshallers\ZipPartMarshaller.java
U         poi-ooxml\src\main\java\org\apache\poi\openxml4j\opc\internal\unmarshallers\PackagePropertiesUnmarshaller.java
A         poi-ooxml\src\main\java\org\apache\poi\openxml4j\opc\OPCComplianceFlags.java
U         poi-ooxml\src\main\java\org\apache\poi\openxml4j\opc\OPCPackage.java
U         poi-ooxml\src\main\java\org\apache\poi\poifs\crypt\dsig\services\TimeStampSimpleHttpClient.java
U         poi-ooxml\src\main\java\org\apache\poi\xslf\usermodel\XSLFPictureData.java
U         poi-ooxml\src\test\java\org\apache\poi\xssf\streaming\TestSheetDataWriter.java
U         poi-ooxml\src\test\java\org\apache\poi\ooxml\TestPOIXMLDocument.java
U         poi-ooxml\src\test\java\org\apache\poi\xwpf\usermodel\TestXWPFBugs.java
U         poi-ooxml\src\test\java\org\apache\poi\openxml4j\opc\compliance\TestOPCComplianceCoreProperties.java
U         poi-scratchpad\src\main\java\org\apache\poi\hdgf\streams\PointerContainingStream.java
U         poi-integration\src\test\java\org\apache\poi\stress\TestAllFiles.java
U         osgi\pom.xml
U         doap_POI.rdf
U         poi-ooxml-lite-agent\build.gradle
AU        test-data\document\bug69628.docx

<-- Got one external: forrest.properties, svn url: https://svn.apache.org/repos/asf/poi/site/forrest.properties -->
Fetching 'https://svn.apache.org/repos/asf/poi/site/forrest.properties' at -1 into 'F:\jenkins\jenkins-home\712657a4\workspace\POI\POI-DSL-Windows-1.22\forrest.properties'
At revision 1925067


<-- Got one external: documentation, svn url: https://svn.apache.org/repos/asf/poi/site/src/documentation -->
Fetching 'https://svn.apache.org/repos/asf/poi/site/src/documentation' at -1 into 'F:\jenkins\jenkins-home\712657a4\workspace\POI\POI-DSL-Windows-1.22\src\documentation'
U         src\documentation\content\xdocs\changes.xml
U         src\documentation\content\xdocs\components\index.xml
U         src\documentation\content\xdocs\components\hmef\index.xml
U         src\documentation\content\xdocs\components\poi-jvm-languages.xml
U         src\documentation\content\xdocs\components\slideshow\ppt-wmf-emf-renderer.xml
U         src\documentation\content\xdocs\download.xml
U         src\documentation\content\xdocs\index.xml
At revision 1925067

At revision 1925067

No changes for https://svn.apache.org/repos/asf/poi/site/forrest.properties since the previous build
[POI-DSL-Windows-1.22] $ cmd /c call C:\Users\jenkins\AppData\Local\Temp\jenkins15492594341687256116.bat
    X   forrest.properties
X       src\documentation

Performing status on external item at 'src\documentation':
svn: E155010: The node 'F:\jenkins\jenkins-home\712657a4\workspace\POI\POI-DSL-Windows-1.22\poi*\src\*' was not found.
Skipped 'poi\src\main\java9\module-info.class'
Skipped 'poi\src\test\java9\module-info.class'
Skipped 'poi-examples\src\main\java9\module-info.class'
Skipped 'poi-excelant\src\main\java9\module-info.class'
Skipped 'poi-excelant\src\test\java9\module-info.class'
Skipped 'poi-integration\src\test\java9\module-info.class'
Skipped 'poi-ooxml\src\main\java9\module-info.class'
Skipped 'poi-ooxml\src\test\java9\module-info.class'
Skipped 'poi-ooxml-full\src\main\java9\module-info.class'
Skipped 'poi-ooxml-lite\src\main\java9\module-info.class'
Skipped 'poi-ooxml-lite-agent\src\main\java9\module-info.class'
Skipped 'poi-scratchpad\src\main\java9\module-info.class'
Skipped 'poi-scratchpad\src\test\java9\module-info.class'
Java-Home: /home/jenkins/tools/java/latest22
 Volume in drive F is Data
 Volume Serial Number is 4C8D-EC73

 Directory of f:\home\jenkins\tools\java

File Not Found
The system cannot find the path specified.
[Gradle] - Launching build.
[POI-DSL-Windows-1.22] $ cmd.exe /C "<https://ci-builds.apache.org/job/POI/job/POI-DSL-Windows-1.22/ws/gradlew.bat> -PjdkVersion=22 --refresh-dependencies clean jenkins && exit %%ERRORLEVEL%%"
 
ERROR: JAVA_HOME is set to an invalid directory: /home/jenkins/tools/java/latest22 
 
Please set the JAVA_HOME variable in your environment to match the 
location of your Java installation. 
Build step 'Invoke Gradle script' changed build result to FAILURE
Build step 'Invoke Gradle script' marked build as failure
[SpotBugs] Skipping execution of recorder since overall result is 'FAILURE'
Archiving artifacts
Recording test results
ERROR: Step ‘Publish JUnit test result report’ failed: No test report files were found. Configuration error?

---------------------------------------------------------------------
To unsubscribe, e-mail: dev-unsubscribe@poi.apache.org
For additional commands, e-mail: dev-help@poi.apache.org


Build failed in Jenkins: POI » POI-DSL-Windows-1.22 #85

Posted by Apache Jenkins Server <je...@builds.apache.org>.
See <https://ci-builds.apache.org/job/POI/job/POI-DSL-Windows-1.22/85/display/redirect?page=changes>

Changes:

[PJ Fanning] snapshot

[PJ Fanning] poi 5.4.1

[PJ Fanning] poi 5.4.1

[PJ Fanning] forbiddenapis 3.9

[Dominik Stadler] Add some more changelog-entries for 5.4.1

[PJ Fanning] prep 5.4.1

[PJ Fanning] graphics2d 3.0.3

[PJ Fanning] bytebuddy 1.17.5

[PJ Fanning] graphics2d 3.0.3


------------------------------------------
Started by an SCM change
Running as SYSTEM
[EnvInject] - Loading node environment variables.
[EnvInject] - Preparing an environment for the build.
[EnvInject] - Keeping Jenkins system variables.
[EnvInject] - Keeping Jenkins build variables.
[EnvInject] - Injecting as environment variables the properties content 
FORREST_HOME=f:\jenkins\tools\forrest\latest
LANG=en_US.UTF-8
CI_BUILD=TRUE

[EnvInject] - Variables injected successfully.
[EnvInject] - Injecting contributions.
Building remotely on jenkins-win-azr-11 (Windows-Docker Windows) in workspace <https://ci-builds.apache.org/job/POI/job/POI-DSL-Windows-1.22/ws/>
[WS-CLEANUP] Deleting project workspace...
[WS-CLEANUP] Done
Updating https://svn.apache.org/repos/asf/poi/trunk at revision '2025-04-06T17:02:36.559 +0000'
U         build.gradle
U         build.xml
U         osgi\pom.xml
U         doap_POI.rdf
U         poi-ooxml-lite-agent\build.gradle
U         poi\src\main\java\org\apache\poi\util\IOUtils.java
U         poi\src\main\java\org\apache\poi\hssf\usermodel\HSSFCell.java
U         poi\src\main\java\org\apache\poi\sl\usermodel\AutoNumberingScheme.java
U         poi\src\main\java\org\apache\poi\ss\usermodel\DateUtil.java
U         poi\src\main\java\org\apache\poi\ss\util\CellUtil.java
U         poi\src\main\java\org\apache\poi\ss\util\SheetUtil.java
U         poi\src\test\java\org\apache\poi\util\TestIOUtils.java
U         poi\src\test\java\org\apache\poi\ss\usermodel\BaseTestCell.java
U         poi\src\test\java\org\apache\poi\ss\usermodel\BaseTestConditionalFormatting.java
U         poi\src\test\java\org\apache\poi\ss\usermodel\BaseTestFormulaEvaluator.java
U         poi\src\test\java\org\apache\poi\ss\usermodel\TestDateUtil.java
U         poi\src\test\java\org\apache\poi\ss\formula\functions\TestEDate.java
U         poi\src\test\java\org\apache\poi\ss\formula\functions\TestEOMonth.java
U         poi\src\test\java\org\apache\poi\ss\util\BaseTestCellUtilCopy.java
U         poi\build.gradle
U         poi-ooxml\src\main\java\org\apache\poi\openxml4j\util\ZipArchiveFakeEntry.java
U         poi-ooxml\src\main\java\org\apache\poi\openxml4j\opc\ZipPackage.java
U         poi-ooxml\src\main\java\org\apache\poi\openxml4j\opc\internal\marshallers\ZipPartMarshaller.java
U         poi-ooxml\src\main\java\org\apache\poi\openxml4j\opc\internal\unmarshallers\PackagePropertiesUnmarshaller.java
A         poi-ooxml\src\main\java\org\apache\poi\openxml4j\opc\OPCComplianceFlags.java
U         poi-ooxml\src\main\java\org\apache\poi\openxml4j\opc\OPCPackage.java
U         poi-ooxml\src\main\java\org\apache\poi\xssf\usermodel\XSSFCell.java
U         poi-ooxml\src\main\java\org\apache\poi\xssf\usermodel\XSSFSheet.java
U         poi-ooxml\src\main\java\org\apache\poi\xssf\streaming\SXSSFCell.java
U         poi-ooxml\src\main\java\org\apache\poi\xssf\streaming\OpcOutputStream.java
U         poi-ooxml\src\main\java\org\apache\poi\xssf\streaming\Zip64Impl.java
U         poi-ooxml\src\main\java\org\apache\poi\xwpf\usermodel\XWPFRun.java
U         poi-ooxml\src\main\java\org\apache\poi\xslf\usermodel\XSLFGraphicFrame.java
U         poi-ooxml\src\main\java\org\apache\poi\xslf\usermodel\XSLFShape.java
U         poi-ooxml\src\main\java\org\apache\poi\poifs\crypt\dsig\SignatureInfo.java
U         poi-ooxml\src\test\java\org\apache\poi\xwpf\usermodel\TestXWPFBugs.java
U         poi-ooxml\src\test\java\org\apache\poi\xwpf\usermodel\TestXWPFRun.java
U         poi-ooxml\src\test\java\org\apache\poi\ooxml\TestPOIXMLDocument.java
U         poi-ooxml\src\test\java\org\apache\poi\openxml4j\opc\compliance\TestOPCComplianceCoreProperties.java
U         poi-ooxml\src\test\java\org\apache\poi\xssf\usermodel\TestXSSFSheet.java
U         poi-ooxml\src\test\java\org\apache\poi\xssf\usermodel\TestXSSFBugs.java
U         poi-ooxml\build.gradle
AU        test-data\document\bug69628.docx
A         test-data\diagram\clusterfuzz-testcase-minimized-POIHDGFFuzzer-6478389109981184.vsd
U         test-data\spreadsheet\stress.xls
A         test-data\slideshow\clusterfuzz-testcase-minimized-POIXSLFFuzzer-5611274456596480.pptx
U         poi-scratchpad\src\main\java\org\apache\poi\hwpf\sprm\ParagraphSprmUncompressor.java
U         poi-scratchpad\src\main\java\org\apache\poi\hdgf\streams\PointerContainingStream.java
U         poi-scratchpad\build.gradle
U         gradle\wrapper\gradle-wrapper.properties
U         poi-excelant\build.gradle
U         poi-integration\build.gradle
U         poi-examples\build.gradle
U         poi-examples\src\main\groovy\build.gradle
U         poi-ooxml-full\build.gradle
U         poi-ooxml-lite\build.gradle
U         wrapper.gradle

<-- Got one external: forrest.properties, svn url: https://svn.apache.org/repos/asf/poi/site/forrest.properties -->
Fetching 'https://svn.apache.org/repos/asf/poi/site/forrest.properties' at -1 into 'F:\jenkins\jenkins-home\712657a4\workspace\POI\POI-DSL-Windows-1.22\forrest.properties'
At revision 1924881


<-- Got one external: documentation, svn url: https://svn.apache.org/repos/asf/poi/site/src/documentation -->
Fetching 'https://svn.apache.org/repos/asf/poi/site/src/documentation' at -1 into 'F:\jenkins\jenkins-home\712657a4\workspace\POI\POI-DSL-Windows-1.22\src\documentation'
U         src\documentation\content\xdocs\changes.xml
U         src\documentation\content\xdocs\components\hmef\index.xml
U         src\documentation\content\xdocs\components\poi-jvm-languages.xml
U         src\documentation\content\xdocs\components\slideshow\ppt-wmf-emf-renderer.xml
U         src\documentation\content\xdocs\components\index.xml
U         src\documentation\content\xdocs\download.xml
U         src\documentation\content\xdocs\index.xml
U         src\documentation\content\xdocs\devel\plan\vision10.xml
U         src\documentation\content\xdocs\encryption.xml
At revision 1924881

At revision 1924881

No changes for https://svn.apache.org/repos/asf/poi/site/forrest.properties since the previous build
[POI-DSL-Windows-1.22] $ cmd /c call C:\Users\jenkins\AppData\Local\Temp\jenkins17162530436598347120.bat
    X   forrest.properties
X       src\documentation

Performing status on external item at 'src\documentation':
svn: E155010: The node 'F:\jenkins\jenkins-home\712657a4\workspace\POI\POI-DSL-Windows-1.22\poi*\src\*' was not found.
Skipped 'poi\src\main\java9\module-info.class'
Skipped 'poi\src\test\java9\module-info.class'
Skipped 'poi-examples\src\main\java9\module-info.class'
Skipped 'poi-excelant\src\main\java9\module-info.class'
Skipped 'poi-excelant\src\test\java9\module-info.class'
Skipped 'poi-integration\src\test\java9\module-info.class'
Skipped 'poi-ooxml\src\main\java9\module-info.class'
Skipped 'poi-ooxml\src\test\java9\module-info.class'
Skipped 'poi-ooxml-full\src\main\java9\module-info.class'
Skipped 'poi-ooxml-lite\src\main\java9\module-info.class'
Skipped 'poi-ooxml-lite-agent\src\main\java9\module-info.class'
Skipped 'poi-scratchpad\src\main\java9\module-info.class'
Skipped 'poi-scratchpad\src\test\java9\module-info.class'
Java-Home: /home/jenkins/tools/java/latest22
 Volume in drive F is Data
 Volume Serial Number is BE2C-B98F

 Directory of f:\home\jenkins\tools\java

File Not Found
The system cannot find the path specified.
[Gradle] - Launching build.
[POI-DSL-Windows-1.22] $ cmd.exe /C "<https://ci-builds.apache.org/job/POI/job/POI-DSL-Windows-1.22/ws/gradlew.bat> -PjdkVersion=22 --refresh-dependencies clean jenkins && exit %%ERRORLEVEL%%"
 
ERROR: JAVA_HOME is set to an invalid directory: /home/jenkins/tools/java/latest22 
 
Please set the JAVA_HOME variable in your environment to match the 
location of your Java installation. 
Build step 'Invoke Gradle script' changed build result to FAILURE
Build step 'Invoke Gradle script' marked build as failure
[SpotBugs] Skipping execution of recorder since overall result is 'FAILURE'
Archiving artifacts
Recording test results
ERROR: Step ‘Publish JUnit test result report’ failed: No test report files were found. Configuration error?

---------------------------------------------------------------------
To unsubscribe, e-mail: dev-unsubscribe@poi.apache.org
For additional commands, e-mail: dev-help@poi.apache.org