You are viewing a plain text version of this content. The canonical link for it is here.
Posted to builds@beam.apache.org by Apache Jenkins Server <je...@builds.apache.org> on 2023/07/07 13:30:32 UTC
Build failed in Jenkins: beam_PostCommit_Java_DataflowV2 #3255
See <https://ci-beam.apache.org/job/beam_PostCommit_Java_DataflowV2/3255/display/redirect>
Changes:
------------------------------------------
[...truncated 67.27 KB...]
go: downloading github.com/golang/protobuf v1.5.3
go: downloading google.golang.org/grpc v1.55.0
go: downloading google.golang.org/protobuf v1.30.0
go: downloading golang.org/x/sys v0.8.0
go: downloading google.golang.org/genproto v0.0.0-20230410155749-daa745c078e1
go: downloading golang.org/x/net v0.10.0
go: downloading golang.org/x/text v0.9.0
go: added github.com/apache/beam/sdks/v2 v2.48.2
go: added github.com/golang/protobuf v1.5.3
go: added golang.org/x/net v0.10.0
go: added golang.org/x/sys v0.8.0
go: added golang.org/x/text v0.9.0
go: added google.golang.org/genproto v0.0.0-20230410155749-daa745c078e1
go: added google.golang.org/grpc v1.55.0
go: added google.golang.org/protobuf v1.30.0
+ go-licenses save github.com/apache/beam/sdks/v2/java/container --save_path=/output/licenses
W0707 09:58:51.425281 36 library.go:101] "golang.org/x/sys/unix" contains non-Go code that can't be inspected for further dependencies:
/go/pkg/mod/golang.org/x/sys@v0.8.0/unix/asm_linux_amd64.s
+ go-licenses csv github.com/apache/beam/sdks/v2/java/container
+ tee /output/licenses/list.csv
W0707 09:58:56.511928 80 library.go:101] "golang.org/x/sys/unix" contains non-Go code that can't be inspected for further dependencies:
/go/pkg/mod/golang.org/x/sys@v0.8.0/unix/asm_linux_amd64.s
github.com/apache/beam/sdks/v2/go,https://github.com/apache/beam/blob/sdks/v2.48.2/sdks/go/README.md,Apache-2.0
github.com/apache/beam/sdks/v2/java/container,https://github.com/apache/beam/blob/sdks/v2.48.2/sdks/LICENSE,Apache-2.0
github.com/golang/protobuf,https://github.com/golang/protobuf/blob/v1.5.3/LICENSE,BSD-3-Clause
golang.org/x/net,https://cs.opensource.google/go/x/net/+/v0.10.0:LICENSE,BSD-3-Clause
golang.org/x/sys/unix,https://cs.opensource.google/go/x/sys/+/v0.8.0:LICENSE,BSD-3-Clause
golang.org/x/text,https://cs.opensource.google/go/x/text/+/v0.9.0:LICENSE,BSD-3-Clause
google.golang.org/genproto/googleapis/rpc/status,https://github.com/googleapis/go-genproto/blob/daa745c078e1/LICENSE,Apache-2.0
google.golang.org/grpc,https://github.com/grpc/grpc-go/blob/v1.55.0/LICENSE,Apache-2.0
google.golang.org/protobuf,https://github.com/protocolbuffers/protobuf-go/blob/v1.30.0/LICENSE,BSD-3-Clause
+ chmod -R a+w /output/licenses
> Task :release:go-licenses:java:createLicenses
> Task :sdks:java:container:java8:copyGolangLicenses
> Task :sdks:java:container:java8:dockerPrepare
> Task :sdks:java:container:java8:docker
#1 [internal] load build definition from Dockerfile
#1 transferring dockerfile: 2.58kB done
#1 DONE 0.0s
#2 [internal] load .dockerignore
#2 transferring context: 2B done
#2 DONE 0.0s
#3 [internal] load metadata for docker.io/library/eclipse-temurin:8
#3 DONE 0.7s
#4 [ 1/16] FROM docker.io/library/eclipse-temurin:8@sha256:c6377a17a374b7b073e306a2b2842a033435f2f39489b99267951d15226469f6
#4 resolve docker.io/library/eclipse-temurin:8@sha256:c6377a17a374b7b073e306a2b2842a033435f2f39489b99267951d15226469f6 0.0s done
#4 CACHED
#5 [internal] load build context
#5 transferring context: 47.00MB 0.4s done
#5 DONE 0.4s
#6 [ 2/16] ADD target/slf4j-api.jar /opt/apache/beam/jars/
#6 DONE 1.3s
#7 [ 3/16] ADD target/slf4j-jdk14.jar /opt/apache/beam/jars/
#7 DONE 0.1s
#8 [ 4/16] ADD target/jcl-over-slf4j.jar /opt/apache/beam/jars/
#8 DONE 0.1s
#9 [ 5/16] ADD target/log4j-over-slf4j.jar /opt/apache/beam/jars/
#9 DONE 0.1s
#10 [ 6/16] ADD target/log4j-to-slf4j.jar /opt/apache/beam/jars/
#10 DONE 0.1s
#11 [ 7/16] ADD target/beam-sdks-java-harness.jar /opt/apache/beam/jars/
#11 DONE 0.1s
#12 [ 8/16] COPY target/jamm.jar target/open-module-agent*.jar /opt/apache/beam/jars/
#12 DONE 0.1s
#13 [ 9/16] COPY target/linux_amd64/boot /opt/apache/beam/
#13 DONE 0.2s
#14 [10/16] COPY target/LICENSE /opt/apache/beam/
#14 DONE 0.1s
#15 [11/16] COPY target/NOTICE /opt/apache/beam/
#15 DONE 0.1s
#16 [12/16] ADD target/third_party_licenses /opt/apache/beam/third_party_licenses/
#16 DONE 0.3s
#17 [13/16] COPY target/LICENSE target/options/* /opt/apache/beam/options/
#17 DONE 0.2s
#18 [14/16] COPY target/go-licenses/* /opt/apache/beam/third_party_licenses/golang/
#18 DONE 0.1s
#19 [15/16] RUN if [ "true" = "false" ] ; then rm -rf /opt/apache/beam/third_party_licenses ; fi
#19 DONE 0.3s
#20 [16/16] COPY target/profiler/* /opt/google_cloud_profiler/
#20 DONE 0.1s
#21 exporting to image
#21 exporting layers
#21 exporting layers 0.2s done
#21 writing image sha256:a047e9af67ec044bf1c7b376db620a2af2723fc9dd98feb003147baa7423aab4 done
#21 naming to docker.io/apache/beam_java8_sdk:2.50.0.dev done
#21 DONE 0.2s
> Task :runners:google-cloud-dataflow-java:buildAndPushDockerJavaContainer
WARNING: `gcloud docker` will not be supported for Docker client versions above 18.03.
As an alternative, use `gcloud auth configure-docker` to configure `docker` to
use `gcloud` as a credential helper, then use `docker` as you would for non-GCR
registries, e.g. `docker pull gcr.io/project-id/my-image`. Add
`--verbosity=error` to silence this warning: `gcloud docker
--verbosity=error -- pull gcr.io/project-id/my-image`.
See: https://cloud.google.com/container-registry/docs/support/deprecation-notices#gcloud-docker
The push refers to repository [us.gcr.io/apache-beam-testing/java-postcommit-it/java]
c50a82391b0c: Preparing
5f70bf18a086: Preparing
a04bf1d3d05e: Preparing
2382b77f31cb: Preparing
f06a25fb9dc5: Preparing
eb58cbfd86e1: Preparing
f5db5edf1354: Preparing
654ade7dbfab: Preparing
c64774969e5c: Preparing
4033a4766cba: Preparing
cd54085e83dc: Preparing
ea9532757f67: Preparing
66cf33807e7c: Preparing
025c8c5ce058: Preparing
548c3f1a7a06: Preparing
640873e740b0: Preparing
e2b75d5a73b9: Preparing
2adff3136d40: Preparing
59c56aee1fb4: Preparing
eb58cbfd86e1: Waiting
f5db5edf1354: Waiting
654ade7dbfab: Waiting
c64774969e5c: Waiting
4033a4766cba: Waiting
cd54085e83dc: Waiting
ea9532757f67: Waiting
66cf33807e7c: Waiting
025c8c5ce058: Waiting
548c3f1a7a06: Waiting
640873e740b0: Waiting
e2b75d5a73b9: Waiting
2adff3136d40: Waiting
59c56aee1fb4: Waiting
5f70bf18a086: Layer already exists
a04bf1d3d05e: Pushed
eb58cbfd86e1: Pushed
2382b77f31cb: Pushed
f06a25fb9dc5: Pushed
c64774969e5c: Pushed
654ade7dbfab: Pushed
4033a4766cba: Pushed
cd54085e83dc: Pushed
ea9532757f67: Pushed
66cf33807e7c: Pushed
640873e740b0: Layer already exists
e2b75d5a73b9: Layer already exists
2adff3136d40: Layer already exists
59c56aee1fb4: Layer already exists
025c8c5ce058: Pushed
c50a82391b0c: Pushed
548c3f1a7a06: Pushed
f5db5edf1354: Pushed
20230707095740: digest: sha256:22990613b58a9ae407e6ed687fdad0ba75dd93d12ead6815a4ba1d3adc97265b size: 4296
> Task :runners:google-cloud-dataflow-java:coreSDKJavaRunnerV2IntegrationTest NO-SOURCE
> Task :runners:google-cloud-dataflow-java:examplesJavaRunnerV2IntegrationTest
***********************************************************
***********************************************************
**********************Set Up Pubsub************************
The Pub/Sub topic has been set up for this example: projects/apache-beam-testing/topics/testpipeline-jenkins-0707095929-19c54b94
The Pub/Sub subscription has been set up for this example: projects/apache-beam-testing/subscriptions/testpipeline-jenkins-0707095929-19c54b94
*************************Tear Down*************************
The Pub/Sub topic has been deleted: projects/apache-beam-testing/topics/testpipeline-jenkins-0707095929-19c54b94
The Pub/Sub subscription has been deleted: projects/apache-beam-testing/subscriptions/testpipeline-jenkins-0707095929-19c54b94
***********************************************************
***********************************************************
***********************************************************
***********************************************************
**********************Set Up Pubsub************************
The Pub/Sub topic has been set up for this example: projects/apache-beam-testing/topics/testpipeline-jenkins-0707095929-818c0806
The Pub/Sub subscription has been set up for this example: projects/apache-beam-testing/subscriptions/testpipeline-jenkins-0707095929-818c0806
*************************Tear Down*************************
The Pub/Sub topic has been deleted: projects/apache-beam-testing/topics/testpipeline-jenkins-0707095929-818c0806
The Pub/Sub subscription has been deleted: projects/apache-beam-testing/subscriptions/testpipeline-jenkins-0707095929-818c0806
***********************************************************
***********************************************************
> Task :runners:google-cloud-dataflow-java:googleCloudPlatformRunnerV2IntegrationTest
org.apache.beam.sdk.io.gcp.pubsub.PubsubReadIT > testReadPublicData FAILED
java.lang.AssertionError at PubsubReadIT.java:57
99 tests completed, 1 failed, 3 skipped
> Task :runners:google-cloud-dataflow-java:googleCloudPlatformRunnerV2IntegrationTest FAILED
> Task :runners:google-cloud-dataflow-java:cleanUpDockerJavaImages
Untagged: us.gcr.io/apache-beam-testing/java-postcommit-it/java:20230707095740
Untagged: us.gcr.io/apache-beam-testing/java-postcommit-it/java@sha256:22990613b58a9ae407e6ed687fdad0ba75dd93d12ead6815a4ba1d3adc97265b
Deleted: sha256:a047e9af67ec044bf1c7b376db620a2af2723fc9dd98feb003147baa7423aab4
WARNING: Successfully resolved tag to sha256, but it is recommended to use sha256 directly.
Tag: [us.gcr.io/apache-beam-testing/java-postcommit-it/java:20230707095740]
- referencing digest: [us.gcr.io/apache-beam-testing/java-postcommit-it/java@sha256:22990613b58a9ae407e6ed687fdad0ba75dd93d12ead6815a4ba1d3adc97265b]
Deleted [[us.gcr.io/apache-beam-testing/java-postcommit-it/java:20230707095740] (referencing [us.gcr.io/apache-beam-testing/java-postcommit-it/java@sha256:22990613b58a9ae407e6ed687fdad0ba75dd93d12ead6815a4ba1d3adc97265b])].
Removing untagged image us.gcr.io/apache-beam-testing/java-postcommit-it/java@sha256:22990613b58a9ae407e6ed687fdad0ba75dd93d12ead6815a4ba1d3adc97265b
FAILURE: Build failed with an exception.
* What went wrong:
Execution failed for task ':runners:google-cloud-dataflow-java:googleCloudPlatformRunnerV2IntegrationTest'.
> There were failing tests. See the report at: file://<https://ci-beam.apache.org/job/beam_PostCommit_Java_DataflowV2/ws/src/runners/google-cloud-dataflow-java/build/reports/tests/googleCloudPlatformRunnerV2IntegrationTest/index.html>
* Try:
> Run with --stacktrace option to get the stack trace.
> Run with --info or --debug option to get more log output.
* Get more help at https://help.gradle.org
Deprecated Gradle features were used in this build, making it incompatible with Gradle 8.0.
You can use '--warning-mode all' to show the individual deprecation warnings and determine if they come from your own scripts or plugins.
See https://docs.gradle.org/7.5.1/userguide/command_line_interface.html#sec:command_line_warnings
Execution optimizations have been disabled for 1 invalid unit(s) of work during this build to ensure correctness.
Please consult deprecation warnings for more details.
BUILD FAILED in 3h 33m 4s
156 actionable tasks: 98 executed, 54 from cache, 4 up-to-date
Publishing build scan...
https://ge.apache.org/s/5rbuee5iomive
Build step 'Invoke Gradle script' changed build result to FAILURE
Build step 'Invoke Gradle script' marked build as failure
---------------------------------------------------------------------
To unsubscribe, e-mail: builds-unsubscribe@beam.apache.org
For additional commands, e-mail: builds-help@beam.apache.org
Jenkins build is back to normal : beam_PostCommit_Java_DataflowV2 #3256
Posted by Apache Jenkins Server <je...@builds.apache.org>.
See <https://ci-beam.apache.org/job/beam_PostCommit_Java_DataflowV2/3256/display/redirect?page=changes>
---------------------------------------------------------------------
To unsubscribe, e-mail: builds-unsubscribe@beam.apache.org
For additional commands, e-mail: builds-help@beam.apache.org