You are viewing a plain text version of this content. The canonical link for it is here.
Posted to dev@aurora.apache.org by Apache Jenkins Server <je...@builds.apache.org> on 2016/03/23 01:17:28 UTC
Build failed in Jenkins: Aurora #1432
See <https://builds.apache.org/job/Aurora/1432/changes>
Changes:
[stephan] Descheduling a cron should not fail if the job is not scheduled.
------------------------------------------
[...truncated 4161 lines...]
from pants.bin.pants_exe import main
ImportError: No module named pants.bin.pants_exe
TestThermosExecutor.test_failing_runner_initialize
self = <test_thermos_executor.TestThermosExecutor object at 0x7feba058fbd0>
[1m def test_failing_runner_initialize(self):[0m
[1m proxy_driver = ProxyDriver()[0m
[1m [0m
[1m with temporary_dir() as td:[0m
[1m te = FastThermosExecutor([0m
[1m> runner_provider=make_provider(td),[0m
[1m sandbox_provider=FailingSandboxProvider())[0m
src/test/python/apache/aurora/executor/test_thermos_executor.py:480:
_ _ _ _ _ _ _ _ _ _ _ _ _ _ _ _ _ _ _ _ _ _ _ _ _
src/test/python/apache/aurora/executor/test_thermos_executor.py:193: in make_provider
[1m pex_location=thermos_runner_path(),[0m
_ _ _ _ _ _ _ _ _ _ _ _ _ _ _ _ _ _ _ _ _ _ _ _ _
build = True
[1m def thermos_runner_path(build=True):[0m
[1m if not build:[0m
[1m return getattr(thermos_runner_path, 'value', None)[0m
[1m [0m
[1m if not hasattr(thermos_runner_path, 'value'):[0m
[1m pex_dir = safe_mkdtemp()[0m
[1m> assert subprocess.call(["./pants", "--pants-distdir=%s" % pex_dir, "binary",[0m
[1m "src/main/python/apache/thermos/runner:thermos_runner"]) == 0[0m
[1m[31mE assert 1 == 0[0m
[1m[31mE + where 1 = <function call at 0x7febc80b8b18>(['./pants', '--pants-distdir=/tmp/user/10021/tmp7kn75z', 'binary', 'src/main/python/apache/thermos/runner:thermos_runner'])[0m
[1m[31mE + where <function call at 0x7febc80b8b18> = subprocess.call[0m
src/test/python/apache/aurora/executor/test_thermos_executor.py:185: AssertionError
-------------- Captured stderr call --------------
Traceback (most recent call last):
File "/home/jenkins/.cache/pants/setup/bootstrap-Linux-x86_64/0.0.75/bin/pants", line 7, in <module>
from pants.bin.pants_exe import main
ImportError: No module named pants.bin.pants_exe
TestThermosExecutor.test_failing_runner_initialize_unknown_exception
self = <test_thermos_executor.TestThermosExecutor object at 0x7feba37d6910>
[1m def test_failing_runner_initialize_unknown_exception(self):[0m
[1m proxy_driver = ProxyDriver()[0m
[1m [0m
[1m with temporary_dir() as td:[0m
[1m te = FastThermosExecutor([0m
[1m> runner_provider=make_provider(td),[0m
[1m sandbox_provider=FailingSandboxProvider(exception_type=Exception))[0m
src/test/python/apache/aurora/executor/test_thermos_executor.py:493:
_ _ _ _ _ _ _ _ _ _ _ _ _ _ _ _ _ _ _ _ _ _ _ _ _
src/test/python/apache/aurora/executor/test_thermos_executor.py:193: in make_provider
[1m pex_location=thermos_runner_path(),[0m
_ _ _ _ _ _ _ _ _ _ _ _ _ _ _ _ _ _ _ _ _ _ _ _ _
build = True
[1m def thermos_runner_path(build=True):[0m
[1m if not build:[0m
[1m return getattr(thermos_runner_path, 'value', None)[0m
[1m [0m
[1m if not hasattr(thermos_runner_path, 'value'):[0m
[1m pex_dir = safe_mkdtemp()[0m
[1m> assert subprocess.call(["./pants", "--pants-distdir=%s" % pex_dir, "binary",[0m
[1m "src/main/python/apache/thermos/runner:thermos_runner"]) == 0[0m
[1m[31mE assert 1 == 0[0m
[1m[31mE + where 1 = <function call at 0x7febc80b8b18>(['./pants', '--pants-distdir=/tmp/user/10021/tmpT3TXJJ', 'binary', 'src/main/python/apache/thermos/runner:thermos_runner'])[0m
[1m[31mE + where <function call at 0x7febc80b8b18> = subprocess.call[0m
src/test/python/apache/aurora/executor/test_thermos_executor.py:185: AssertionError
-------------- Captured stderr call --------------
Traceback (most recent call last):
File "/home/jenkins/.cache/pants/setup/bootstrap-Linux-x86_64/0.0.75/bin/pants", line 7, in <module>
from pants.bin.pants_exe import main
ImportError: No module named pants.bin.pants_exe
TestThermosExecutor.test_slow_runner_initialize _
self = <test_thermos_executor.TestThermosExecutor object at 0x7feba389c950>
[1m def test_slow_runner_initialize(self):[0m
[1m proxy_driver = ProxyDriver()[0m
[1m [0m
[1m task = make_task(HELLO_WORLD_MTI)[0m
[1m [0m
[1m with temporary_dir() as td:[0m
[1m te = FastThermosExecutor([0m
[1m> runner_provider=make_provider(td),[0m
[1m sandbox_provider=SlowSandboxProvider())[0m
src/test/python/apache/aurora/executor/test_thermos_executor.py:508:
_ _ _ _ _ _ _ _ _ _ _ _ _ _ _ _ _ _ _ _ _ _ _ _ _
src/test/python/apache/aurora/executor/test_thermos_executor.py:193: in make_provider
[1m pex_location=thermos_runner_path(),[0m
_ _ _ _ _ _ _ _ _ _ _ _ _ _ _ _ _ _ _ _ _ _ _ _ _
build = True
[1m def thermos_runner_path(build=True):[0m
[1m if not build:[0m
[1m return getattr(thermos_runner_path, 'value', None)[0m
[1m [0m
[1m if not hasattr(thermos_runner_path, 'value'):[0m
[1m pex_dir = safe_mkdtemp()[0m
[1m> assert subprocess.call(["./pants", "--pants-distdir=%s" % pex_dir, "binary",[0m
[1m "src/main/python/apache/thermos/runner:thermos_runner"]) == 0[0m
[1m[31mE assert 1 == 0[0m
[1m[31mE + where 1 = <function call at 0x7febc80b8b18>(['./pants', '--pants-distdir=/tmp/user/10021/tmpZhQHeg', 'binary', 'src/main/python/apache/thermos/runner:thermos_runner'])[0m
[1m[31mE + where <function call at 0x7febc80b8b18> = subprocess.call[0m
src/test/python/apache/aurora/executor/test_thermos_executor.py:185: AssertionError
-------------- Captured stderr call --------------
Traceback (most recent call last):
File "/home/jenkins/.cache/pants/setup/bootstrap-Linux-x86_64/0.0.75/bin/pants", line 7, in <module>
from pants.bin.pants_exe import main
ImportError: No module named pants.bin.pants_exe
TestThermosExecutor.test_killTask_during_runner_initialize
self = <test_thermos_executor.TestThermosExecutor object at 0x7feba389c290>
[1m def test_killTask_during_runner_initialize(self): # noqa[0m
[1m proxy_driver = ProxyDriver()[0m
[1m [0m
[1m task = make_task(HELLO_WORLD_MTI)[0m
[1m [0m
[1m with temporary_dir() as td:[0m
[1m te = FastThermosExecutor([0m
[1m> runner_provider=make_provider(td),[0m
[1m sandbox_provider=SlowSandboxProvider())[0m
src/test/python/apache/aurora/executor/test_thermos_executor.py:527:
_ _ _ _ _ _ _ _ _ _ _ _ _ _ _ _ _ _ _ _ _ _ _ _ _
src/test/python/apache/aurora/executor/test_thermos_executor.py:193: in make_provider
[1m pex_location=thermos_runner_path(),[0m
_ _ _ _ _ _ _ _ _ _ _ _ _ _ _ _ _ _ _ _ _ _ _ _ _
build = True
[1m def thermos_runner_path(build=True):[0m
[1m if not build:[0m
[1m return getattr(thermos_runner_path, 'value', None)[0m
[1m [0m
[1m if not hasattr(thermos_runner_path, 'value'):[0m
[1m pex_dir = safe_mkdtemp()[0m
[1m> assert subprocess.call(["./pants", "--pants-distdir=%s" % pex_dir, "binary",[0m
[1m "src/main/python/apache/thermos/runner:thermos_runner"]) == 0[0m
[1m[31mE assert 1 == 0[0m
[1m[31mE + where 1 = <function call at 0x7febc80b8b18>(['./pants', '--pants-distdir=/tmp/user/10021/tmpFHkx_D', 'binary', 'src/main/python/apache/thermos/runner:thermos_runner'])[0m
[1m[31mE + where <function call at 0x7febc80b8b18> = subprocess.call[0m
src/test/python/apache/aurora/executor/test_thermos_executor.py:185: AssertionError
-------------- Captured stderr call --------------
Traceback (most recent call last):
File "/home/jenkins/.cache/pants/setup/bootstrap-Linux-x86_64/0.0.75/bin/pants", line 7, in <module>
from pants.bin.pants_exe import main
ImportError: No module named pants.bin.pants_exe
TestThermosExecutor.test_launchTask_deserialization_fail
self = <test_thermos_executor.TestThermosExecutor object at 0x7feba3b81f10>
[1m def test_launchTask_deserialization_fail(self): # noqa[0m
[1m proxy_driver = ProxyDriver()[0m
[1m [0m
[1m role = getpass.getuser()[0m
[1m task_info = mesos_pb2.TaskInfo()[0m
[1m task_info.name = task_info.task_id.value = 'broken'[0m
[1m task_info.data = serialize([0m
[1m AssignedTask([0m
[1m task=TaskConfig([0m
[1m job=JobKey(role=role, environment='env', name='name'),[0m
[1m executorConfig=ExecutorConfig(name=AURORA_EXECUTOR_NAME, data='garbage'))))[0m
[1m [0m
[1m te = FastThermosExecutor([0m
[1m> runner_provider=make_provider(safe_mkdtemp()),[0m
[1m sandbox_provider=DefaultTestSandboxProvider())[0m
src/test/python/apache/aurora/executor/test_thermos_executor.py:565:
_ _ _ _ _ _ _ _ _ _ _ _ _ _ _ _ _ _ _ _ _ _ _ _ _
src/test/python/apache/aurora/executor/test_thermos_executor.py:193: in make_provider
[1m pex_location=thermos_runner_path(),[0m
_ _ _ _ _ _ _ _ _ _ _ _ _ _ _ _ _ _ _ _ _ _ _ _ _
build = True
[1m def thermos_runner_path(build=True):[0m
[1m if not build:[0m
[1m return getattr(thermos_runner_path, 'value', None)[0m
[1m [0m
[1m if not hasattr(thermos_runner_path, 'value'):[0m
[1m pex_dir = safe_mkdtemp()[0m
[1m> assert subprocess.call(["./pants", "--pants-distdir=%s" % pex_dir, "binary",[0m
[1m "src/main/python/apache/thermos/runner:thermos_runner"]) == 0[0m
[1m[31mE assert 1 == 0[0m
[1m[31mE + where 1 = <function call at 0x7febc80b8b18>(['./pants', '--pants-distdir=/tmp/user/10021/tmpwHUKJo', 'binary', 'src/main/python/apache/thermos/runner:thermos_runner'])[0m
[1m[31mE + where <function call at 0x7febc80b8b18> = subprocess.call[0m
src/test/python/apache/aurora/executor/test_thermos_executor.py:185: AssertionError
-------------- Captured stderr call --------------
Traceback (most recent call last):
File "/home/jenkins/.cache/pants/setup/bootstrap-Linux-x86_64/0.0.75/bin/pants", line 7, in <module>
from pants.bin.pants_exe import main
ImportError: No module named pants.bin.pants_exe
_____________ test_waiting_executor ______________
[1m def test_waiting_executor():[0m
[1m proxy_driver = ProxyDriver()[0m
[1m with temporary_dir() as checkpoint_root:[0m
[1m te = AuroraExecutor([0m
[1m> runner_provider=make_provider(checkpoint_root),[0m
[1m sandbox_provider=DefaultTestSandboxProvider())[0m
src/test/python/apache/aurora/executor/test_thermos_executor.py:580:
_ _ _ _ _ _ _ _ _ _ _ _ _ _ _ _ _ _ _ _ _ _ _ _ _
src/test/python/apache/aurora/executor/test_thermos_executor.py:193: in make_provider
[1m pex_location=thermos_runner_path(),[0m
_ _ _ _ _ _ _ _ _ _ _ _ _ _ _ _ _ _ _ _ _ _ _ _ _
build = True
[1m def thermos_runner_path(build=True):[0m
[1m if not build:[0m
[1m return getattr(thermos_runner_path, 'value', None)[0m
[1m [0m
[1m if not hasattr(thermos_runner_path, 'value'):[0m
[1m pex_dir = safe_mkdtemp()[0m
[1m> assert subprocess.call(["./pants", "--pants-distdir=%s" % pex_dir, "binary",[0m
[1m "src/main/python/apache/thermos/runner:thermos_runner"]) == 0[0m
[1m[31mE assert 1 == 0[0m
[1m[31mE + where 1 = <function call at 0x7febc80b8b18>(['./pants', '--pants-distdir=/tmp/user/10021/tmpqIbpFC', 'binary', 'src/main/python/apache/thermos/runner:thermos_runner'])[0m
[1m[31mE + where <function call at 0x7febc80b8b18> = subprocess.call[0m
src/test/python/apache/aurora/executor/test_thermos_executor.py:185: AssertionError
-------------- Captured stderr call --------------
Traceback (most recent call last):
File "/home/jenkins/.cache/pants/setup/bootstrap-Linux-x86_64/0.0.75/bin/pants", line 7, in <module>
from pants.bin.pants_exe import main
ImportError: No module named pants.bin.pants_exe
generated xml file: <https://builds.apache.org/job/Aurora/ws/dist/test-results/415337499eb72578eab327a6487c1f5c9452b3d6.xml>
[1m[31m 16 failed, 640 passed, 5 skipped, 1 warnings, 8 error in 186.63 seconds [0m
FAILURE
00:17:29 03:54 [complete][31m
FAILURE[0m
Build step 'Execute shell' marked build as failure
Recording test results
Jenkins build is back to normal : Aurora #1433
Posted by Apache Jenkins Server <je...@builds.apache.org>.
See <https://builds.apache.org/job/Aurora/1433/changes>