You are viewing a plain text version of this content. The canonical link for it is here.
Posted to notifications@maven.apache.org by Apache Jenkins Server <je...@builds.apache.org> on 2014/10/13 09:11:07 UTC
Build failed in Jenkins: maven-plugins-windows #750
See <https://builds.apache.org/job/maven-plugins-windows/750/changes>
Changes:
[khmarbaise] [MJAVADOC-417]
- Upgrade of plexus-archiver to 2.7
[khmarbaise] [MSOURCES-75]
- Upgrade of plexus-archiver to version 2.7
[khmarbaise] [MJAR-184]
- Upgrade of plexus-archiver to version 2.7
[khmarbaise] [MEAR-200]
- Upgrade to plexus-archiver 2.7
[khmarbaise] [MASSEMBLY-717]
- Patch of Tony Jewell applied to add an option includeProjectBuildFilters
[krosenvold] Updated ITs to run with POSIX tar instead of GNU, to avoid failing on systems with large uid/gid values
------------------------------------------
Started by an SCM change
Building remotely on windows2 (Windows) in workspace <https://builds.apache.org/job/maven-plugins-windows/ws/>
Updating http://svn.apache.org/repos/asf/maven/plugins/trunk at revision '2014-10-13T00:08:55.329 -0700'
U maven-source-plugin\pom.xml
U maven-javadoc-plugin\pom.xml
U maven-jar-plugin\pom.xml
U maven-ear-plugin\pom.xml
U maven-assembly-plugin\src\it\projects\mojo-configuration\massembly-301\pom.xml
U maven-assembly-plugin\src\it\projects\mojo-configuration\massembly-291\pom.xml
U maven-assembly-plugin\src\it\projects\descriptor-refs\project\multimodule-sources-copied\pom.xml
U maven-assembly-plugin\src\it\projects\descriptor-refs\project\sources-copied\pom.xml
U maven-assembly-plugin\src\it\projects\descriptor-refs\project\no-target-dir-multimodule\pom.xml
U maven-assembly-plugin\src\it\projects\descriptor-refs\project\no-target-dir\pom.xml
U maven-assembly-plugin\src\it\projects\descriptor-refs\src\no-target-dir\pom.xml
U maven-assembly-plugin\src\it\projects\descriptor-refs\src\src-dir-copied\pom.xml
U maven-assembly-plugin\src\it\projects\descriptor-refs\bin\jars-in-archive-root\pom.xml
U maven-assembly-plugin\src\it\projects\basic-features\formats\pom.xml
U maven-assembly-plugin\src\it\projects\basic-features\classpath-descriptor\pom.xml
U maven-assembly-plugin\src\test\java\org\apache\maven\plugin\assembly\testutils\ConfigSourceStub.java
U maven-assembly-plugin\src\test\java\org\apache\maven\plugin\assembly\format\FileFormatterTest.java
U maven-assembly-plugin\src\test\java\org\apache\maven\plugin\assembly\format\FileSetFormatterTest.java
U maven-assembly-plugin\src\main\java\org\apache\maven\plugin\assembly\AssemblerConfigurationSource.java
U maven-assembly-plugin\src\main\java\org\apache\maven\plugin\assembly\mojos\AbstractAssemblyMojo.java
U maven-assembly-plugin\src\main\java\org\apache\maven\plugin\assembly\format\FileFormatter.java
U maven-assembly-plugin\pom.xml
At revision 1631301
Parsing POMs
Downloaded artifact http://repository.apache.org/snapshots/org/apache/maven/maven-parent/25-SNAPSHOT/maven-metadata.xml
ERROR: Failed to parse POMs
java.io.IOException: remote file operation failed: <https://builds.apache.org/job/maven-plugins-windows/ws/> at hudson.remoting.Channel@36d58d41:windows2
at hudson.FilePath.act(FilePath.java:910)
at hudson.FilePath.act(FilePath.java:887)
at hudson.maven.MavenModuleSetBuild$MavenModuleSetBuildExecution.parsePoms(MavenModuleSetBuild.java:953)
at hudson.maven.MavenModuleSetBuild$MavenModuleSetBuildExecution.doRun(MavenModuleSetBuild.java:681)
at hudson.model.AbstractBuild$AbstractBuildExecution.run(AbstractBuild.java:585)
at hudson.model.Run.execute(Run.java:1676)
at hudson.maven.MavenModuleSetBuild.run(MavenModuleSetBuild.java:529)
at hudson.model.ResourceController.execute(ResourceController.java:88)
at hudson.model.Executor.run(Executor.java:231)
Caused by: hudson.remoting.ProxyException: hudson.maven.MavenModuleSetBuild$MavenExecutionException: org.apache.maven.project.ProjectBuildingException: Some problems were encountered while processing the POMs:
[FATAL] Non-parseable POM F:\jenkins\jenkins-slave\workspace\maven-plugins-windows\maven-assembly-plugin\pom.xml: end tag name </contributors> must match start tag name <contributor> from line 77 (position: TEXT seen ...<contributor>\r\n </contributors>... @78:18) @ line 78, column 18
at hudson.maven.MavenModuleSetBuild$PomParser.invoke(MavenModuleSetBuild.java:1357)
at hudson.maven.MavenModuleSetBuild$PomParser.invoke(MavenModuleSetBuild.java:1091)
at hudson.FilePath$FileCallableWrapper.call(FilePath.java:2462)
at hudson.remoting.UserRequest.perform(UserRequest.java:118)
at hudson.remoting.UserRequest.perform(UserRequest.java:48)
at hudson.remoting.Request$2.run(Request.java:328)
at hudson.remoting.InterceptingExecutorService$1.call(InterceptingExecutorService.java:72)
at java.util.concurrent.FutureTask.run(Unknown Source)
at java.util.concurrent.ThreadPoolExecutor.runWorker(Unknown Source)
at java.util.concurrent.ThreadPoolExecutor$Worker.run(Unknown Source)
at hudson.remoting.Engine$1$1.run(Engine.java:63)
at java.lang.Thread.run(Unknown Source)
Caused by: hudson.remoting.ProxyException: org.apache.maven.project.ProjectBuildingException: Some problems were encountered while processing the POMs:
[FATAL] Non-parseable POM F:\jenkins\jenkins-slave\workspace\maven-plugins-windows\maven-assembly-plugin\pom.xml: end tag name </contributors> must match start tag name <contributor> from line 77 (position: TEXT seen ...<contributor>\r\n </contributors>... @78:18) @ line 78, column 18
at org.apache.maven.project.DefaultProjectBuilder.build(DefaultProjectBuilder.java:364)
at hudson.maven.MavenEmbedder.buildProjects(MavenEmbedder.java:361)
at hudson.maven.MavenEmbedder.readProjects(MavenEmbedder.java:331)
at hudson.maven.MavenModuleSetBuild$PomParser.invoke(MavenModuleSetBuild.java:1294)
... 11 more
[WARNINGS] Skipping publisher since build result is FAILURE
Jenkins build is back to normal : maven-plugins-windows #751
Posted by Apache Jenkins Server <je...@builds.apache.org>.
See <https://builds.apache.org/job/maven-plugins-windows/751/changes>