You are viewing a plain text version of this content. The canonical link for it is here.
Posted to dev@lucene.apache.org by Policeman Jenkins Server <je...@thetaphi.de> on 2016/06/04 01:15:06 UTC

[JENKINS] Lucene-Solr-master-Windows (32bit/jdk1.8.0_92) - Build # 5890 - Still Failing!

Build: http://jenkins.thetaphi.de/job/Lucene-Solr-master-Windows/5890/
Java: 32bit/jdk1.8.0_92 -server -XX:+UseSerialGC

3 tests failed.
FAILED:  junit.framework.TestSuite.org.apache.solr.schema.TestManagedSchemaAPI

Error Message:
ObjectTracker found 8 object(s) that were not released!!! [MDCAwareThreadPoolExecutor, MockDirectoryWrapper, TransactionLog, TransactionLog, MockDirectoryWrapper, MockDirectoryWrapper, MockDirectoryWrapper, MDCAwareThreadPoolExecutor]

Stack Trace:
java.lang.AssertionError: ObjectTracker found 8 object(s) that were not released!!! [MDCAwareThreadPoolExecutor, MockDirectoryWrapper, TransactionLog, TransactionLog, MockDirectoryWrapper, MockDirectoryWrapper, MockDirectoryWrapper, MDCAwareThreadPoolExecutor]
	at __randomizedtesting.SeedInfo.seed([94CB460BC30867F]:0)
	at org.junit.Assert.fail(Assert.java:93)
	at org.junit.Assert.assertTrue(Assert.java:43)
	at org.junit.Assert.assertNull(Assert.java:551)
	at org.apache.solr.SolrTestCaseJ4.teardownTestCases(SolrTestCaseJ4.java:256)
	at sun.reflect.GeneratedMethodAccessor20.invoke(Unknown Source)
	at sun.reflect.DelegatingMethodAccessorImpl.invoke(DelegatingMethodAccessorImpl.java:43)
	at java.lang.reflect.Method.invoke(Method.java:498)
	at com.carrotsearch.randomizedtesting.RandomizedRunner.invoke(RandomizedRunner.java:1764)
	at com.carrotsearch.randomizedtesting.RandomizedRunner$7.evaluate(RandomizedRunner.java:834)
	at com.carrotsearch.randomizedtesting.rules.StatementAdapter.evaluate(StatementAdapter.java:36)
	at com.carrotsearch.randomizedtesting.rules.SystemPropertiesRestoreRule$1.evaluate(SystemPropertiesRestoreRule.java:57)
	at org.apache.lucene.util.AbstractBeforeAfterRule$1.evaluate(AbstractBeforeAfterRule.java:45)
	at com.carrotsearch.randomizedtesting.rules.StatementAdapter.evaluate(StatementAdapter.java:36)
	at org.apache.lucene.util.TestRuleStoreClassName$1.evaluate(TestRuleStoreClassName.java:41)
	at com.carrotsearch.randomizedtesting.rules.NoShadowingOrOverridesOnMethodsRule$1.evaluate(NoShadowingOrOverridesOnMethodsRule.java:40)
	at com.carrotsearch.randomizedtesting.rules.NoShadowingOrOverridesOnMethodsRule$1.evaluate(NoShadowingOrOverridesOnMethodsRule.java:40)
	at com.carrotsearch.randomizedtesting.rules.StatementAdapter.evaluate(StatementAdapter.java:36)
	at com.carrotsearch.randomizedtesting.rules.StatementAdapter.evaluate(StatementAdapter.java:36)
	at com.carrotsearch.randomizedtesting.rules.StatementAdapter.evaluate(StatementAdapter.java:36)
	at org.apache.lucene.util.TestRuleAssertionsRequired$1.evaluate(TestRuleAssertionsRequired.java:53)
	at org.apache.lucene.util.TestRuleMarkFailure$1.evaluate(TestRuleMarkFailure.java:47)
	at org.apache.lucene.util.TestRuleIgnoreAfterMaxFailures$1.evaluate(TestRuleIgnoreAfterMaxFailures.java:64)
	at org.apache.lucene.util.TestRuleIgnoreTestSuites$1.evaluate(TestRuleIgnoreTestSuites.java:54)
	at com.carrotsearch.randomizedtesting.rules.StatementAdapter.evaluate(StatementAdapter.java:36)
	at com.carrotsearch.randomizedtesting.ThreadLeakControl$StatementRunner.run(ThreadLeakControl.java:367)
	at java.lang.Thread.run(Thread.java:745)


FAILED:  junit.framework.TestSuite.org.apache.solr.schema.TestManagedSchemaAPI

Error Message:
Could not remove the following files (in the order of attempts):    C:\Users\jenkins\workspace\Lucene-Solr-master-Windows\solr\build\solr-core\test\J0\temp\solr.schema.TestManagedSchemaAPI_94CB460BC30867F-001\tempDir-001\node1\testschemaapi_shard1_replica1\data\tlog\tlog.0000000000000000000: java.nio.file.FileSystemException: C:\Users\jenkins\workspace\Lucene-Solr-master-Windows\solr\build\solr-core\test\J0\temp\solr.schema.TestManagedSchemaAPI_94CB460BC30867F-001\tempDir-001\node1\testschemaapi_shard1_replica1\data\tlog\tlog.0000000000000000000: The process cannot access the file because it is being used by another process.     C:\Users\jenkins\workspace\Lucene-Solr-master-Windows\solr\build\solr-core\test\J0\temp\solr.schema.TestManagedSchemaAPI_94CB460BC30867F-001\tempDir-001\node1\testschemaapi_shard1_replica1\data\tlog: java.nio.file.DirectoryNotEmptyException: C:\Users\jenkins\workspace\Lucene-Solr-master-Windows\solr\build\solr-core\test\J0\temp\solr.schema.TestManagedSchemaAPI_94CB460BC30867F-001\tempDir-001\node1\testschemaapi_shard1_replica1\data\tlog    C:\Users\jenkins\workspace\Lucene-Solr-master-Windows\solr\build\solr-core\test\J0\temp\solr.schema.TestManagedSchemaAPI_94CB460BC30867F-001\tempDir-001\node1\testschemaapi_shard1_replica1\data: java.nio.file.DirectoryNotEmptyException: C:\Users\jenkins\workspace\Lucene-Solr-master-Windows\solr\build\solr-core\test\J0\temp\solr.schema.TestManagedSchemaAPI_94CB460BC30867F-001\tempDir-001\node1\testschemaapi_shard1_replica1\data    C:\Users\jenkins\workspace\Lucene-Solr-master-Windows\solr\build\solr-core\test\J0\temp\solr.schema.TestManagedSchemaAPI_94CB460BC30867F-001\tempDir-001\node1\testschemaapi_shard1_replica1: java.nio.file.DirectoryNotEmptyException: C:\Users\jenkins\workspace\Lucene-Solr-master-Windows\solr\build\solr-core\test\J0\temp\solr.schema.TestManagedSchemaAPI_94CB460BC30867F-001\tempDir-001\node1\testschemaapi_shard1_replica1    C:\Users\jenkins\workspace\Lucene-Solr-master-Windows\solr\build\solr-core\test\J0\temp\solr.schema.TestManagedSchemaAPI_94CB460BC30867F-001\tempDir-001\node1: java.nio.file.DirectoryNotEmptyException: C:\Users\jenkins\workspace\Lucene-Solr-master-Windows\solr\build\solr-core\test\J0\temp\solr.schema.TestManagedSchemaAPI_94CB460BC30867F-001\tempDir-001\node1    C:\Users\jenkins\workspace\Lucene-Solr-master-Windows\solr\build\solr-core\test\J0\temp\solr.schema.TestManagedSchemaAPI_94CB460BC30867F-001\tempDir-001: java.nio.file.DirectoryNotEmptyException: C:\Users\jenkins\workspace\Lucene-Solr-master-Windows\solr\build\solr-core\test\J0\temp\solr.schema.TestManagedSchemaAPI_94CB460BC30867F-001\tempDir-001    C:\Users\jenkins\workspace\Lucene-Solr-master-Windows\solr\build\solr-core\test\J0\temp\solr.schema.TestManagedSchemaAPI_94CB460BC30867F-001: java.nio.file.DirectoryNotEmptyException: C:\Users\jenkins\workspace\Lucene-Solr-master-Windows\solr\build\solr-core\test\J0\temp\solr.schema.TestManagedSchemaAPI_94CB460BC30867F-001 

Stack Trace:
java.io.IOException: Could not remove the following files (in the order of attempts):
   C:\Users\jenkins\workspace\Lucene-Solr-master-Windows\solr\build\solr-core\test\J0\temp\solr.schema.TestManagedSchemaAPI_94CB460BC30867F-001\tempDir-001\node1\testschemaapi_shard1_replica1\data\tlog\tlog.0000000000000000000: java.nio.file.FileSystemException: C:\Users\jenkins\workspace\Lucene-Solr-master-Windows\solr\build\solr-core\test\J0\temp\solr.schema.TestManagedSchemaAPI_94CB460BC30867F-001\tempDir-001\node1\testschemaapi_shard1_replica1\data\tlog\tlog.0000000000000000000: The process cannot access the file because it is being used by another process.

   C:\Users\jenkins\workspace\Lucene-Solr-master-Windows\solr\build\solr-core\test\J0\temp\solr.schema.TestManagedSchemaAPI_94CB460BC30867F-001\tempDir-001\node1\testschemaapi_shard1_replica1\data\tlog: java.nio.file.DirectoryNotEmptyException: C:\Users\jenkins\workspace\Lucene-Solr-master-Windows\solr\build\solr-core\test\J0\temp\solr.schema.TestManagedSchemaAPI_94CB460BC30867F-001\tempDir-001\node1\testschemaapi_shard1_replica1\data\tlog
   C:\Users\jenkins\workspace\Lucene-Solr-master-Windows\solr\build\solr-core\test\J0\temp\solr.schema.TestManagedSchemaAPI_94CB460BC30867F-001\tempDir-001\node1\testschemaapi_shard1_replica1\data: java.nio.file.DirectoryNotEmptyException: C:\Users\jenkins\workspace\Lucene-Solr-master-Windows\solr\build\solr-core\test\J0\temp\solr.schema.TestManagedSchemaAPI_94CB460BC30867F-001\tempDir-001\node1\testschemaapi_shard1_replica1\data
   C:\Users\jenkins\workspace\Lucene-Solr-master-Windows\solr\build\solr-core\test\J0\temp\solr.schema.TestManagedSchemaAPI_94CB460BC30867F-001\tempDir-001\node1\testschemaapi_shard1_replica1: java.nio.file.DirectoryNotEmptyException: C:\Users\jenkins\workspace\Lucene-Solr-master-Windows\solr\build\solr-core\test\J0\temp\solr.schema.TestManagedSchemaAPI_94CB460BC30867F-001\tempDir-001\node1\testschemaapi_shard1_replica1
   C:\Users\jenkins\workspace\Lucene-Solr-master-Windows\solr\build\solr-core\test\J0\temp\solr.schema.TestManagedSchemaAPI_94CB460BC30867F-001\tempDir-001\node1: java.nio.file.DirectoryNotEmptyException: C:\Users\jenkins\workspace\Lucene-Solr-master-Windows\solr\build\solr-core\test\J0\temp\solr.schema.TestManagedSchemaAPI_94CB460BC30867F-001\tempDir-001\node1
   C:\Users\jenkins\workspace\Lucene-Solr-master-Windows\solr\build\solr-core\test\J0\temp\solr.schema.TestManagedSchemaAPI_94CB460BC30867F-001\tempDir-001: java.nio.file.DirectoryNotEmptyException: C:\Users\jenkins\workspace\Lucene-Solr-master-Windows\solr\build\solr-core\test\J0\temp\solr.schema.TestManagedSchemaAPI_94CB460BC30867F-001\tempDir-001
   C:\Users\jenkins\workspace\Lucene-Solr-master-Windows\solr\build\solr-core\test\J0\temp\solr.schema.TestManagedSchemaAPI_94CB460BC30867F-001: java.nio.file.DirectoryNotEmptyException: C:\Users\jenkins\workspace\Lucene-Solr-master-Windows\solr\build\solr-core\test\J0\temp\solr.schema.TestManagedSchemaAPI_94CB460BC30867F-001

	at org.apache.lucene.util.IOUtils.rm(IOUtils.java:323)
	at org.apache.lucene.util.TestRuleTemporaryFilesCleanup.afterAlways(TestRuleTemporaryFilesCleanup.java:216)
	at com.carrotsearch.randomizedtesting.rules.TestRuleAdapter$1.afterAlways(TestRuleAdapter.java:31)
	at com.carrotsearch.randomizedtesting.rules.StatementAdapter.evaluate(StatementAdapter.java:43)
	at com.carrotsearch.randomizedtesting.rules.StatementAdapter.evaluate(StatementAdapter.java:36)
	at org.apache.lucene.util.TestRuleAssertionsRequired$1.evaluate(TestRuleAssertionsRequired.java:53)
	at org.apache.lucene.util.TestRuleMarkFailure$1.evaluate(TestRuleMarkFailure.java:47)
	at org.apache.lucene.util.TestRuleIgnoreAfterMaxFailures$1.evaluate(TestRuleIgnoreAfterMaxFailures.java:64)
	at org.apache.lucene.util.TestRuleIgnoreTestSuites$1.evaluate(TestRuleIgnoreTestSuites.java:54)
	at com.carrotsearch.randomizedtesting.rules.StatementAdapter.evaluate(StatementAdapter.java:36)
	at com.carrotsearch.randomizedtesting.ThreadLeakControl$StatementRunner.run(ThreadLeakControl.java:367)
	at java.lang.Thread.run(Thread.java:745)


FAILED:  org.apache.solr.cloud.overseer.ZkStateReaderTest.testStateFormatUpdateWithTimeDelay

Error Message:


Stack Trace:
java.util.concurrent.TimeoutException
	at __randomizedtesting.SeedInfo.seed([94CB460BC30867F:76D203E5D552ABF5]:0)
	at org.apache.solr.common.cloud.ZkStateReader.waitForState(ZkStateReader.java:1200)
	at org.apache.solr.cloud.overseer.ZkStateReaderTest.testStateFormatUpdate(ZkStateReaderTest.java:125)
	at org.apache.solr.cloud.overseer.ZkStateReaderTest.testStateFormatUpdateWithTimeDelay(ZkStateReaderTest.java:53)
	at sun.reflect.NativeMethodAccessorImpl.invoke0(Native Method)
	at sun.reflect.NativeMethodAccessorImpl.invoke(NativeMethodAccessorImpl.java:62)
	at sun.reflect.DelegatingMethodAccessorImpl.invoke(DelegatingMethodAccessorImpl.java:43)
	at java.lang.reflect.Method.invoke(Method.java:498)
	at com.carrotsearch.randomizedtesting.RandomizedRunner.invoke(RandomizedRunner.java:1764)
	at com.carrotsearch.randomizedtesting.RandomizedRunner$8.evaluate(RandomizedRunner.java:871)
	at com.carrotsearch.randomizedtesting.RandomizedRunner$9.evaluate(RandomizedRunner.java:907)
	at com.carrotsearch.randomizedtesting.RandomizedRunner$10.evaluate(RandomizedRunner.java:921)
	at com.carrotsearch.randomizedtesting.rules.SystemPropertiesRestoreRule$1.evaluate(SystemPropertiesRestoreRule.java:57)
	at org.apache.lucene.util.TestRuleSetupTeardownChained$1.evaluate(TestRuleSetupTeardownChained.java:49)
	at org.apache.lucene.util.AbstractBeforeAfterRule$1.evaluate(AbstractBeforeAfterRule.java:45)
	at org.apache.lucene.util.TestRuleThreadAndTestName$1.evaluate(TestRuleThreadAndTestName.java:48)
	at org.apache.lucene.util.TestRuleIgnoreAfterMaxFailures$1.evaluate(TestRuleIgnoreAfterMaxFailures.java:64)
	at org.apache.lucene.util.TestRuleMarkFailure$1.evaluate(TestRuleMarkFailure.java:47)
	at com.carrotsearch.randomizedtesting.rules.StatementAdapter.evaluate(StatementAdapter.java:36)
	at com.carrotsearch.randomizedtesting.ThreadLeakControl$StatementRunner.run(ThreadLeakControl.java:367)
	at com.carrotsearch.randomizedtesting.ThreadLeakControl.forkTimeoutingTask(ThreadLeakControl.java:809)
	at com.carrotsearch.randomizedtesting.ThreadLeakControl$3.evaluate(ThreadLeakControl.java:460)
	at com.carrotsearch.randomizedtesting.RandomizedRunner.runSingleTest(RandomizedRunner.java:880)
	at com.carrotsearch.randomizedtesting.RandomizedRunner$5.evaluate(RandomizedRunner.java:781)
	at com.carrotsearch.randomizedtesting.RandomizedRunner$6.evaluate(RandomizedRunner.java:816)
	at com.carrotsearch.randomizedtesting.RandomizedRunner$7.evaluate(RandomizedRunner.java:827)
	at com.carrotsearch.randomizedtesting.rules.StatementAdapter.evaluate(StatementAdapter.java:36)
	at com.carrotsearch.randomizedtesting.rules.SystemPropertiesRestoreRule$1.evaluate(SystemPropertiesRestoreRule.java:57)
	at org.apache.lucene.util.AbstractBeforeAfterRule$1.evaluate(AbstractBeforeAfterRule.java:45)
	at com.carrotsearch.randomizedtesting.rules.StatementAdapter.evaluate(StatementAdapter.java:36)
	at org.apache.lucene.util.TestRuleStoreClassName$1.evaluate(TestRuleStoreClassName.java:41)
	at com.carrotsearch.randomizedtesting.rules.NoShadowingOrOverridesOnMethodsRule$1.evaluate(NoShadowingOrOverridesOnMethodsRule.java:40)
	at com.carrotsearch.randomizedtesting.rules.NoShadowingOrOverridesOnMethodsRule$1.evaluate(NoShadowingOrOverridesOnMethodsRule.java:40)
	at com.carrotsearch.randomizedtesting.rules.StatementAdapter.evaluate(StatementAdapter.java:36)
	at com.carrotsearch.randomizedtesting.rules.StatementAdapter.evaluate(StatementAdapter.java:36)
	at com.carrotsearch.randomizedtesting.rules.StatementAdapter.evaluate(StatementAdapter.java:36)
	at org.apache.lucene.util.TestRuleAssertionsRequired$1.evaluate(TestRuleAssertionsRequired.java:53)
	at org.apache.lucene.util.TestRuleMarkFailure$1.evaluate(TestRuleMarkFailure.java:47)
	at org.apache.lucene.util.TestRuleIgnoreAfterMaxFailures$1.evaluate(TestRuleIgnoreAfterMaxFailures.java:64)
	at org.apache.lucene.util.TestRuleIgnoreTestSuites$1.evaluate(TestRuleIgnoreTestSuites.java:54)
	at com.carrotsearch.randomizedtesting.rules.StatementAdapter.evaluate(StatementAdapter.java:36)
	at com.carrotsearch.randomizedtesting.ThreadLeakControl$StatementRunner.run(ThreadLeakControl.java:367)
	at java.lang.Thread.run(Thread.java:745)




Build Log:
[...truncated 12086 lines...]
   [junit4] Suite: org.apache.solr.cloud.overseer.ZkStateReaderTest
   [junit4]   2> Creating dataDir: C:\Users\jenkins\workspace\Lucene-Solr-master-Windows\solr\build\solr-core\test\J0\temp\solr.cloud.overseer.ZkStateReaderTest_94CB460BC30867F-001\init-core-data-001
   [junit4]   2> 2183814 INFO  (SUITE-ZkStateReaderTest-seed#[94CB460BC30867F]-worker) [    ] o.a.s.SolrTestCaseJ4 Randomized ssl (false) and clientAuth (false) via: @org.apache.solr.util.RandomizeSSL(reason=, value=NaN, ssl=NaN, clientAuth=NaN)
   [junit4]   2> 2183816 INFO  (TEST-ZkStateReaderTest.testStateFormatUpdateWithExplicitRefresh-seed#[94CB460BC30867F]) [    ] o.a.s.SolrTestCaseJ4 ###Starting testStateFormatUpdateWithExplicitRefresh
   [junit4]   2> 2183818 INFO  (TEST-ZkStateReaderTest.testStateFormatUpdateWithExplicitRefresh-seed#[94CB460BC30867F]) [    ] o.a.s.c.ZkTestServer STARTING ZK TEST SERVER
   [junit4]   2> 2183819 INFO  (Thread-6292) [    ] o.a.s.c.ZkTestServer client port:0.0.0.0/0.0.0.0:0
   [junit4]   2> 2183819 INFO  (Thread-6292) [    ] o.a.s.c.ZkTestServer Starting server
   [junit4]   2> 2183918 INFO  (TEST-ZkStateReaderTest.testStateFormatUpdateWithExplicitRefresh-seed#[94CB460BC30867F]) [    ] o.a.s.c.ZkTestServer start zk server on port:63431
   [junit4]   2> 2183918 INFO  (TEST-ZkStateReaderTest.testStateFormatUpdateWithExplicitRefresh-seed#[94CB460BC30867F]) [    ] o.a.s.c.c.SolrZkClient Using default ZkCredentialsProvider
   [junit4]   2> 2183920 INFO  (TEST-ZkStateReaderTest.testStateFormatUpdateWithExplicitRefresh-seed#[94CB460BC30867F]) [    ] o.a.s.c.c.ConnectionManager Waiting for client to connect to ZooKeeper
   [junit4]   2> 2183925 INFO  (zkCallback-3217-thread-1) [    ] o.a.s.c.c.ConnectionManager Watcher org.apache.solr.common.cloud.ConnectionManager@474ffd name:ZooKeeperConnection Watcher:127.0.0.1:63431 got event WatchedEvent state:SyncConnected type:None path:null path:null type:None
   [junit4]   2> 2183929 INFO  (TEST-ZkStateReaderTest.testStateFormatUpdateWithExplicitRefresh-seed#[94CB460BC30867F]) [    ] o.a.s.c.c.ConnectionManager Client is connected to ZooKeeper
   [junit4]   2> 2183930 INFO  (TEST-ZkStateReaderTest.testStateFormatUpdateWithExplicitRefresh-seed#[94CB460BC30867F]) [    ] o.a.s.c.c.SolrZkClient Using default ZkACLProvider
   [junit4]   2> 2183931 WARN  (NIOServerCxn.Factory:0.0.0.0/0.0.0.0:0) [    ] o.a.z.s.NIOServerCnxn caught end of stream exception
   [junit4]   2> EndOfStreamException: Unable to read additional data from client sessionid 0x15518f539710000, likely client has closed socket
   [junit4]   2> 	at org.apache.zookeeper.server.NIOServerCnxn.doIO(NIOServerCnxn.java:228)
   [junit4]   2> 	at org.apache.zookeeper.server.NIOServerCnxnFactory.run(NIOServerCnxnFactory.java:208)
   [junit4]   2> 	at java.lang.Thread.run(Thread.java:745)
   [junit4]   2> 2183932 INFO  (TEST-ZkStateReaderTest.testStateFormatUpdateWithExplicitRefresh-seed#[94CB460BC30867F]) [    ] o.a.s.c.c.SolrZkClient Using default ZkCredentialsProvider
   [junit4]   2> 2183933 INFO  (TEST-ZkStateReaderTest.testStateFormatUpdateWithExplicitRefresh-seed#[94CB460BC30867F]) [    ] o.a.s.c.c.ConnectionManager Waiting for client to connect to ZooKeeper
   [junit4]   2> 2183935 INFO  (zkCallback-3218-thread-1) [    ] o.a.s.c.c.ConnectionManager Watcher org.apache.solr.common.cloud.ConnectionManager@1b3a9d3 name:ZooKeeperConnection Watcher:127.0.0.1:63431 got event WatchedEvent state:SyncConnected type:None path:null path:null type:None
   [junit4]   2> 2183936 INFO  (TEST-ZkStateReaderTest.testStateFormatUpdateWithExplicitRefresh-seed#[94CB460BC30867F]) [    ] o.a.s.c.c.ConnectionManager Client is connected to ZooKeeper
   [junit4]   2> 2183936 INFO  (TEST-ZkStateReaderTest.testStateFormatUpdateWithExplicitRefresh-seed#[94CB460BC30867F]) [    ] o.a.s.c.c.SolrZkClient Using default ZkACLProvider
   [junit4]   2> 2183936 INFO  (TEST-ZkStateReaderTest.testStateFormatUpdateWithExplicitRefresh-seed#[94CB460BC30867F]) [    ] o.a.s.c.c.SolrZkClient makePath: /solr
   [junit4]   2> 2183938 WARN  (NIOServerCxn.Factory:0.0.0.0/0.0.0.0:0) [    ] o.a.z.s.NIOServerCnxn caught end of stream exception
   [junit4]   2> EndOfStreamException: Unable to read additional data from client sessionid 0x15518f539710001, likely client has closed socket
   [junit4]   2> 	at org.apache.zookeeper.server.NIOServerCnxn.doIO(NIOServerCnxn.java:228)
   [junit4]   2> 	at org.apache.zookeeper.server.NIOServerCnxnFactory.run(NIOServerCnxnFactory.java:208)
   [junit4]   2> 	at java.lang.Thread.run(Thread.java:745)
   [junit4]   2> 2183938 INFO  (TEST-ZkStateReaderTest.testStateFormatUpdateWithExplicitRefresh-seed#[94CB460BC30867F]) [    ] o.a.s.c.c.SolrZkClient Using default ZkCredentialsProvider
   [junit4]   2> 2183941 INFO  (TEST-ZkStateReaderTest.testStateFormatUpdateWithExplicitRefresh-seed#[94CB460BC30867F]) [    ] o.a.s.c.c.ConnectionManager Waiting for client to connect to ZooKeeper
   [junit4]   2> 2183942 INFO  (zkCallback-3219-thread-1) [    ] o.a.s.c.c.ConnectionManager Watcher org.apache.solr.common.cloud.ConnectionManager@1088ec4 name:ZooKeeperConnection Watcher:127.0.0.1:63431/solr got event WatchedEvent state:SyncConnected type:None path:null path:null type:None
   [junit4]   2> 2183943 INFO  (TEST-ZkStateReaderTest.testStateFormatUpdateWithExplicitRefresh-seed#[94CB460BC30867F]) [    ] o.a.s.c.c.ConnectionManager Client is connected to ZooKeeper
   [junit4]   2> 2183943 INFO  (TEST-ZkStateReaderTest.testStateFormatUpdateWithExplicitRefresh-seed#[94CB460BC30867F]) [    ] o.a.s.c.c.SolrZkClient Using default ZkACLProvider
   [junit4]   2> 2183943 INFO  (TEST-ZkStateReaderTest.testStateFormatUpdateWithExplicitRefresh-seed#[94CB460BC30867F]) [    ] o.a.s.c.c.SolrZkClient makePath: /live_nodes
   [junit4]   2> 2183945 INFO  (TEST-ZkStateReaderTest.testStateFormatUpdateWithExplicitRefresh-seed#[94CB460BC30867F]) [    ] o.a.s.c.c.SolrZkClient makePath: /collections
   [junit4]   2> 2183946 INFO  (TEST-ZkStateReaderTest.testStateFormatUpdateWithExplicitRefresh-seed#[94CB460BC30867F]) [    ] o.a.s.c.c.SolrZkClient makePath: /aliases.json
   [junit4]   2> 2183947 INFO  (TEST-ZkStateReaderTest.testStateFormatUpdateWithExplicitRefresh-seed#[94CB460BC30867F]) [    ] o.a.s.c.c.SolrZkClient makePath: /clusterstate.json
   [junit4]   2> 2183950 INFO  (TEST-ZkStateReaderTest.testStateFormatUpdateWithExplicitRefresh-seed#[94CB460BC30867F]) [    ] o.a.s.c.c.SolrZkClient makePath: /security.json
   [junit4]   2> 2183951 INFO  (TEST-ZkStateReaderTest.testStateFormatUpdateWithExplicitRefresh-seed#[94CB460BC30867F]) [    ] o.a.s.c.c.ZkStateReader Updating cluster state from ZooKeeper... 
   [junit4]   2> 2183952 INFO  (TEST-ZkStateReaderTest.testStateFormatUpdateWithExplicitRefresh-seed#[94CB460BC30867F]) [    ] o.a.s.c.c.ZkStateReader Loaded empty cluster properties
   [junit4]   2> 2183953 INFO  (TEST-ZkStateReaderTest.testStateFormatUpdateWithExplicitRefresh-seed#[94CB460BC30867F]) [    ] o.a.s.c.c.ZkStateReader Updated live nodes from ZooKeeper... (0) -> (0)
   [junit4]   2> 2183956 INFO  (TEST-ZkStateReaderTest.testStateFormatUpdateWithExplicitRefresh-seed#[94CB460BC30867F]) [    ] o.a.s.c.c.ZkStateReader Deleting data for [c1]
   [junit4]   2> 2183956 INFO  (TEST-ZkStateReaderTest.testStateFormatUpdateWithExplicitRefresh-seed#[94CB460BC30867F]) [    ] o.a.s.c.c.SolrZkClient makePath: /collections/c1
   [junit4]   2> 2183958 INFO  (zkCallback-3219-thread-1) [    ] o.a.s.c.c.ZkStateReader A collections change: [WatchedEvent state:SyncConnected type:NodeChildrenChanged path:/collections], has occurred - updating...
   [junit4]   2> 2183960 INFO  (zkCallback-3219-thread-1) [    ] o.a.s.c.c.ZkStateReader A cluster state change: [WatchedEvent state:SyncConnected type:NodeDataChanged path:/clusterstate.json], has occurred - updating... (live nodes size: [0])
   [junit4]   2> 2183965 INFO  (TEST-ZkStateReaderTest.testStateFormatUpdateWithExplicitRefresh-seed#[94CB460BC30867F]) [    ] o.a.s.c.o.ZkStateWriter going to create_collection /collections/c1/state.json
   [junit4]   2> 2183965 INFO  (zkCallback-3219-thread-1) [    ] o.a.s.c.c.ZkStateReader A cluster state change: [WatchedEvent state:SyncConnected type:NodeCreated path:/collections/c1/state.json] for collection [c1] has occurred - updating... (live nodes size: [0])
   [junit4]   2> 2183966 INFO  (zkCallback-3219-thread-1) [    ] o.a.s.c.c.ZkStateReader Add data for [c1] ver [0]
   [junit4]   2> 2183966 INFO  (zkCallback-3219-thread-2) [    ] o.a.s.c.c.ZkStateReader A cluster state change: [WatchedEvent state:SyncConnected type:NodeDataChanged path:/clusterstate.json], has occurred - updating... (live nodes size: [0])
   [junit4]   2> 2183968 WARN  (NIOServerCxn.Factory:0.0.0.0/0.0.0.0:0) [    ] o.a.z.s.NIOServerCnxn caught end of stream exception
   [junit4]   2> EndOfStreamException: Unable to read additional data from client sessionid 0x15518f539710002, likely client has closed socket
   [junit4]   2> 	at org.apache.zookeeper.server.NIOServerCnxn.doIO(NIOServerCnxn.java:228)
   [junit4]   2> 	at org.apache.zookeeper.server.NIOServerCnxnFactory.run(NIOServerCnxnFactory.java:208)
   [junit4]   2> 	at java.lang.Thread.run(Thread.java:745)
   [junit4]   2> 2183972 INFO  (TEST-ZkStateReaderTest.testStateFormatUpdateWithExplicitRefresh-seed#[94CB460BC30867F]) [    ] o.a.s.c.ZkTestServer connecting to 127.0.0.1:63431 63431
   [junit4]   2> 2183978 INFO  (Thread-6292) [    ] o.a.s.c.ZkTestServer connecting to 127.0.0.1:63431 63431
   [junit4]   2> 2183981 INFO  (TEST-ZkStateReaderTest.testStateFormatUpdateWithExplicitRefresh-seed#[94CB460BC30867F]) [    ] o.a.s.SolrTestCaseJ4 ###Ending testStateFormatUpdateWithExplicitRefresh
   [junit4]   2> 2183986 INFO  (TEST-ZkStateReaderTest.testStateFormatUpdateWithTimeDelay-seed#[94CB460BC30867F]) [    ] o.a.s.SolrTestCaseJ4 ###Starting testStateFormatUpdateWithTimeDelay
   [junit4]   2> 2183987 INFO  (TEST-ZkStateReaderTest.testStateFormatUpdateWithTimeDelay-seed#[94CB460BC30867F]) [    ] o.a.s.c.ZkTestServer STARTING ZK TEST SERVER
   [junit4]   2> 2183988 INFO  (Thread-6293) [    ] o.a.s.c.ZkTestServer client port:0.0.0.0/0.0.0.0:0
   [junit4]   2> 2183988 INFO  (Thread-6293) [    ] o.a.s.c.ZkTestServer Starting server
   [junit4]   2> 2184088 INFO  (TEST-ZkStateReaderTest.testStateFormatUpdateWithTimeDelay-seed#[94CB460BC30867F]) [    ] o.a.s.c.ZkTestServer start zk server on port:63509
   [junit4]   2> 2184088 INFO  (TEST-ZkStateReaderTest.testStateFormatUpdateWithTimeDelay-seed#[94CB460BC30867F]) [    ] o.a.s.c.c.SolrZkClient Using default ZkCredentialsProvider
   [junit4]   2> 2184089 INFO  (TEST-ZkStateReaderTest.testStateFormatUpdateWithTimeDelay-seed#[94CB460BC30867F]) [    ] o.a.s.c.c.ConnectionManager Waiting for client to connect to ZooKeeper
   [junit4]   2> 2184093 INFO  (zkCallback-3221-thread-1) [    ] o.a.s.c.c.ConnectionManager Watcher org.apache.solr.common.cloud.ConnectionManager@73bc4d name:ZooKeeperConnection Watcher:127.0.0.1:63509 got event WatchedEvent state:SyncConnected type:None path:null path:null type:None
   [junit4]   2> 2184093 INFO  (TEST-ZkStateReaderTest.testStateFormatUpdateWithTimeDelay-seed#[94CB460BC30867F]) [    ] o.a.s.c.c.ConnectionManager Client is connected to ZooKeeper
   [junit4]   2> 2184093 INFO  (TEST-ZkStateReaderTest.testStateFormatUpdateWithTimeDelay-seed#[94CB460BC30867F]) [    ] o.a.s.c.c.SolrZkClient Using default ZkACLProvider
   [junit4]   2> 2184094 WARN  (NIOServerCxn.Factory:0.0.0.0/0.0.0.0:0) [    ] o.a.z.s.NIOServerCnxn caught end of stream exception
   [junit4]   2> EndOfStreamException: Unable to read additional data from client sessionid 0x15518f53a1b0000, likely client has closed socket
   [junit4]   2> 	at org.apache.zookeeper.server.NIOServerCnxn.doIO(NIOServerCnxn.java:228)
   [junit4]   2> 	at org.apache.zookeeper.server.NIOServerCnxnFactory.run(NIOServerCnxnFactory.java:208)
   [junit4]   2> 	at java.lang.Thread.run(Thread.java:745)
   [junit4]   2> 2184094 INFO  (TEST-ZkStateReaderTest.testStateFormatUpdateWithTimeDelay-seed#[94CB460BC30867F]) [    ] o.a.s.c.c.SolrZkClient Using default ZkCredentialsProvider
   [junit4]   2> 2184097 INFO  (TEST-ZkStateReaderTest.testStateFormatUpdateWithTimeDelay-seed#[94CB460BC30867F]) [    ] o.a.s.c.c.ConnectionManager Waiting for client to connect to ZooKeeper
   [junit4]   2> 2184103 INFO  (zkCallback-3222-thread-1) [    ] o.a.s.c.c.ConnectionManager Watcher org.apache.solr.common.cloud.ConnectionManager@9bca3a name:ZooKeeperConnection Watcher:127.0.0.1:63509 got event WatchedEvent state:SyncConnected type:None path:null path:null type:None
   [junit4]   2> 2184103 INFO  (TEST-ZkStateReaderTest.testStateFormatUpdateWithTimeDelay-seed#[94CB460BC30867F]) [    ] o.a.s.c.c.ConnectionManager Client is connected to ZooKeeper
   [junit4]   2> 2184104 INFO  (TEST-ZkStateReaderTest.testStateFormatUpdateWithTimeDelay-seed#[94CB460BC30867F]) [    ] o.a.s.c.c.SolrZkClient Using default ZkACLProvider
   [junit4]   2> 2184104 INFO  (TEST-ZkStateReaderTest.testStateFormatUpdateWithTimeDelay-seed#[94CB460BC30867F]) [    ] o.a.s.c.c.SolrZkClient makePath: /solr
   [junit4]   2> 2184108 WARN  (NIOServerCxn.Factory:0.0.0.0/0.0.0.0:0) [    ] o.a.z.s.NIOServerCnxn caught end of stream exception
   [junit4]   2> EndOfStreamException: Unable to read additional data from client sessionid 0x15518f53a1b0001, likely client has closed socket
   [junit4]   2> 	at org.apache.zookeeper.server.NIOServerCnxn.doIO(NIOServerCnxn.java:228)
   [junit4]   2> 	at org.apache.zookeeper.server.NIOServerCnxnFactory.run(NIOServerCnxnFactory.java:208)
   [junit4]   2> 	at java.lang.Thread.run(Thread.java:745)
   [junit4]   2> 2184111 INFO  (TEST-ZkStateReaderTest.testStateFormatUpdateWithTimeDelay-seed#[94CB460BC30867F]) [    ] o.a.s.c.c.SolrZkClient Using default ZkCredentialsProvider
   [junit4]   2> 2184112 INFO  (TEST-ZkStateReaderTest.testStateFormatUpdateWithTimeDelay-seed#[94CB460BC30867F]) [    ] o.a.s.c.c.ConnectionManager Waiting for client to connect to ZooKeeper
   [junit4]   2> 2184119 INFO  (zkCallback-3223-thread-1) [    ] o.a.s.c.c.ConnectionManager Watcher org.apache.solr.common.cloud.ConnectionManager@1c3615c name:ZooKeeperConnection Watcher:127.0.0.1:63509/solr got event WatchedEvent state:SyncConnected type:None path:null path:null type:None
   [junit4]   2> 2184119 INFO  (TEST-ZkStateReaderTest.testStateFormatUpdateWithTimeDelay-seed#[94CB460BC30867F]) [    ] o.a.s.c.c.ConnectionManager Client is connected to ZooKeeper
   [junit4]   2> 2184119 INFO  (TEST-ZkStateReaderTest.testStateFormatUpdateWithTimeDelay-seed#[94CB460BC30867F]) [    ] o.a.s.c.c.SolrZkClient Using default ZkACLProvider
   [junit4]   2> 2184124 INFO  (TEST-ZkStateReaderTest.testStateFormatUpdateWithTimeDelay-seed#[94CB460BC30867F]) [    ] o.a.s.c.c.SolrZkClient makePath: /live_nodes
   [junit4]   2> 2184126 INFO  (TEST-ZkStateReaderTest.testStateFormatUpdateWithTimeDelay-seed#[94CB460BC30867F]) [    ] o.a.s.c.c.SolrZkClient makePath: /collections
   [junit4]   2> 2184128 INFO  (TEST-ZkStateReaderTest.testStateFormatUpdateWithTimeDelay-seed#[94CB460BC30867F]) [    ] o.a.s.c.c.SolrZkClient makePath: /aliases.json
   [junit4]   2> 2184131 INFO  (TEST-ZkStateReaderTest.testStateFormatUpdateWithTimeDelay-seed#[94CB460BC30867F]) [    ] o.a.s.c.c.SolrZkClient makePath: /clusterstate.json
   [junit4]   2> 2184133 INFO  (TEST-ZkStateReaderTest.testStateFormatUpdateWithTimeDelay-seed#[94CB460BC30867F]) [    ] o.a.s.c.c.SolrZkClient makePath: /security.json
   [junit4]   2> 2184136 INFO  (TEST-ZkStateReaderTest.testStateFormatUpdateWithTimeDelay-seed#[94CB460BC30867F]) [    ] o.a.s.c.c.ZkStateReader Updating cluster state from ZooKeeper... 
   [junit4]   2> 2184136 INFO  (TEST-ZkStateReaderTest.testStateFormatUpdateWithTimeDelay-seed#[94CB460BC30867F]) [    ] o.a.s.c.c.ZkStateReader Loaded empty cluster properties
   [junit4]   2> 2184139 INFO  (TEST-ZkStateReaderTest.testStateFormatUpdateWithTimeDelay-seed#[94CB460BC30867F]) [    ] o.a.s.c.c.ZkStateReader Updated live nodes from ZooKeeper... (0) -> (0)
   [junit4]   2> 2184141 INFO  (TEST-ZkStateReaderTest.testStateFormatUpdateWithTimeDelay-seed#[94CB460BC30867F]) [    ] o.a.s.c.c.ZkStateReader Deleting data for [c1]
   [junit4]   2> 2184141 INFO  (TEST-ZkStateReaderTest.testStateFormatUpdateWithTimeDelay-seed#[94CB460BC30867F]) [    ] o.a.s.c.c.SolrZkClient makePath: /collections/c1
   [junit4]   2> 2184143 INFO  (zkCallback-3223-thread-1) [    ] o.a.s.c.c.ZkStateReader A collections change: [WatchedEvent state:SyncConnected type:NodeChildrenChanged path:/collections], has occurred - updating...
   [junit4]   2> 2184146 INFO  (zkCallback-3223-thread-1) [    ] o.a.s.c.c.ZkStateReader A cluster state change: [WatchedEvent state:SyncConnected type:NodeDataChanged path:/clusterstate.json], has occurred - updating... (live nodes size: [0])
   [junit4]   2> 2184148 INFO  (TEST-ZkStateReaderTest.testStateFormatUpdateWithTimeDelay-seed#[94CB460BC30867F]) [    ] o.a.s.c.o.ZkStateWriter going to create_collection /collections/c1/state.json
   [junit4]   2> 2184148 INFO  (zkCallback-3223-thread-1) [    ] o.a.s.c.c.ZkStateReader A cluster state change: [WatchedEvent state:SyncConnected type:NodeCreated path:/collections/c1/state.json] for collection [c1] has occurred - updating... (live nodes size: [0])
   [junit4]   2> 2184150 INFO  (zkCallback-3223-thread-1) [    ] o.a.s.c.c.ZkStateReader Add data for [c1] ver [0]
   [junit4]   2> 2184150 INFO  (zkCallback-3223-thread-2) [    ] o.a.s.c.c.ZkStateReader A cluster state change: [WatchedEvent state:SyncConnected type:NodeDataChanged path:/clusterstate.json], has occurred - updating... (live nodes size: [0])
   [junit4]   2> 2214153 WARN  (NIOServerCxn.Factory:0.0.0.0/0.0.0.0:0) [    ] o.a.z.s.NIOServerCnxn caught end of stream exception
   [junit4]   2> EndOfStreamException: Unable to read additional data from client sessionid 0x15518f53a1b0002, likely client has closed socket
   [junit4]   2> 	at org.apache.zookeeper.server.NIOServerCnxn.doIO(NIOServerCnxn.java:228)
   [junit4]   2> 	at org.apache.zookeeper.server.NIOServerCnxnFactory.run(NIOServerCnxnFactory.java:208)
   [junit4]   2> 	at java.lang.Thread.run(Thread.java:745)
   [junit4]   2> 2214155 INFO  (TEST-ZkStateReaderTest.testStateFormatUpdateWithTimeDelay-seed#[94CB460BC30867F]) [    ] o.a.s.c.ZkTestServer connecting to 127.0.0.1:63509 63509
   [junit4]   2> 2214158 INFO  (Thread-6293) [    ] o.a.s.c.ZkTestServer connecting to 127.0.0.1:63509 63509
   [junit4]   2> 2214161 INFO  (TEST-ZkStateReaderTest.testStateFormatUpdateWithTimeDelay-seed#[94CB460BC30867F]) [    ] o.a.s.SolrTestCaseJ4 ###Ending testStateFormatUpdateWithTimeDelay
   [junit4]   2> NOTE: reproduce with: ant test  -Dtestcase=ZkStateReaderTest -Dtests.method=testStateFormatUpdateWithTimeDelay -Dtests.seed=94CB460BC30867F -Dtests.slow=true -Dtests.locale=zh-SG -Dtests.timezone=Africa/Ndjamena -Dtests.asserts=true -Dtests.file.encoding=Cp1252
   [junit4] ERROR   30.2s J0 | ZkStateReaderTest.testStateFormatUpdateWithTimeDelay <<<
   [junit4]    > Throwable #1: java.util.concurrent.TimeoutException
   [junit4]    > 	at __randomizedtesting.SeedInfo.seed([94CB460BC30867F:76D203E5D552ABF5]:0)
   [junit4]    > 	at org.apache.solr.common.cloud.ZkStateReader.waitForState(ZkStateReader.java:1200)
   [junit4]    > 	at org.apache.solr.cloud.overseer.ZkStateReaderTest.testStateFormatUpdate(ZkStateReaderTest.java:125)
   [junit4]    > 	at org.apache.solr.cloud.overseer.ZkStateReaderTest.testStateFormatUpdateWithTimeDelay(ZkStateReaderTest.java:53)
   [junit4]    > 	at java.lang.Thread.run(Thread.java:745)
   [junit4]   2> 2214166 INFO  (TEST-ZkStateReaderTest.testWatchedCollectionCreation-seed#[94CB460BC30867F]) [    ] o.a.s.SolrTestCaseJ4 ###Starting testWatchedCollectionCreation
   [junit4]   2> 2214167 INFO  (TEST-ZkStateReaderTest.testWatchedCollectionCreation-seed#[94CB460BC30867F]) [    ] o.a.s.c.ZkTestServer STARTING ZK TEST SERVER
   [junit4]   2> 2214168 INFO  (Thread-6294) [    ] o.a.s.c.ZkTestServer client port:0.0.0.0/0.0.0.0:0
   [junit4]   2> 2214168 INFO  (Thread-6294) [    ] o.a.s.c.ZkTestServer Starting server
   [junit4]   2> 2214268 INFO  (TEST-ZkStateReaderTest.testWatchedCollectionCreation-seed#[94CB460BC30867F]) [    ] o.a.s.c.ZkTestServer start zk server on port:57610
   [junit4]   2> 2214268 INFO  (TEST-ZkStateReaderTest.testWatchedCollectionCreation-seed#[94CB460BC30867F]) [    ] o.a.s.c.c.SolrZkClient Using default ZkCredentialsProvider
   [junit4]   2> 2214269 INFO  (TEST-ZkStateReaderTest.testWatchedCollectionCreation-seed#[94CB460BC30867F]) [    ] o.a.s.c.c.ConnectionManager Waiting for client to connect to ZooKeeper
   [junit4]   2> 2214273 INFO  (zkCallback-3225-thread-1) [    ] o.a.s.c.c.ConnectionManager Watcher org.apache.solr.common.cloud.ConnectionManager@18d984c name:ZooKeeperConnection Watcher:127.0.0.1:57610 got event WatchedEvent state:SyncConnected type:None path:null path:null type:None
   [junit4]   2> 2214273 INFO  (TEST-ZkStateReaderTest.testWatchedCollectionCreation-seed#[94CB460BC30867F]) [    ] o.a.s.c.c.ConnectionManager Client is connected to ZooKeeper
   [junit4]   2> 2214274 INFO  (TEST-ZkStateReaderTest.testWatchedCollectionCreation-seed#[94CB460BC30867F]) [    ] o.a.s.c.c.SolrZkClient Using default ZkACLProvider
   [junit4]   2> 2214275 INFO  (TEST-ZkStateReaderTest.testWatchedCollectionCreation-seed#[94CB460BC30867F]) [    ] o.a.s.c.c.SolrZkClient Using default ZkCredentialsProvider
   [junit4]   2> 2214278 INFO  (TEST-ZkStateReaderTest.testWatchedCollectionCreation-seed#[94CB460BC30867F]) [    ] o.a.s.c.c.ConnectionManager Waiting for client to connect to ZooKeeper
   [junit4]   2> 2214280 INFO  (zkCallback-3226-thread-1) [    ] o.a.s.c.c.ConnectionManager Watcher org.apache.solr.common.cloud.ConnectionManager@fdedc2 name:ZooKeeperConnection Watcher:127.0.0.1:57610 got event WatchedEvent state:SyncConnected type:None path:null path:null type:None
   [junit4]   2> 2214281 INFO  (TEST-ZkStateReaderTest.testWatchedCollectionCreation-seed#[94CB460BC30867F]) [    ] o.a.s.c.c.ConnectionManager Client is connected to ZooKeeper
   [junit4]   2> 2214281 INFO  (TEST-ZkStateReaderTest.testWatchedCollectionCreation-seed#[94CB460BC30867F]) [    ] o.a.s.c.c.SolrZkClient Using default ZkACLProvider
   [junit4]   2> 2214281 INFO  (TEST-ZkStateReaderTest.testWatchedCollectionCreation-seed#[94CB460BC30867F]) [    ] o.a.s.c.c.SolrZkClient makePath: /solr
   [junit4]   2> 2214285 INFO  (TEST-ZkStateReaderTest.testWatchedCollectionCreation-seed#[94CB460BC30867F]) [    ] o.a.s.c.c.SolrZkClient Using default ZkCredentialsProvider
   [junit4]   2> 2214286 INFO  (TEST-ZkStateReaderTest.testWatchedCollectionCreation-seed#[94CB460BC30867F]) [    ] o.a.s.c.c.ConnectionManager Waiting for client to connect to ZooKeeper
   [junit4]   2> 2214288 INFO  (zkCallback-3227-thread-1) [    ] o.a.s.c.c.ConnectionManager Watcher org.apache.solr.common.cloud.ConnectionManager@19549ac name:ZooKeeperConnection Watcher:127.0.0.1:57610/solr got event WatchedEvent state:SyncConnected type:None path:null path:null type:None
   [junit4]   2> 2214288 INFO  (TEST-ZkStateReaderTest.testWatchedCollectionCreation-seed#[94CB460BC30867F]) [    ] o.a.s.c.c.ConnectionManager Client is connected to ZooKeeper
   [junit4]   2> 2214288 INFO  (TEST-ZkStateReaderTest.testWatchedCollectionCreation-seed#[94CB460BC30867F]) [    ] o.a.s.c.c.SolrZkClient Using default ZkACLProvider
   [junit4]   2> 2214289 INFO  (TEST-ZkStateReaderTest.testWatchedCollectionCreation-seed#[94CB460BC30867F]) [    ] o.a.s.c.c.SolrZkClient makePath: /live_nodes
   [junit4]   2> 2214291 INFO  (TEST-ZkStateReaderTest.testWatchedCollectionCreation-seed#[94CB460BC30867F]) [    ] o.a.s.c.c.SolrZkClient makePath: /collections
   [junit4]   2> 2214293 INFO  (TEST-ZkStateReaderTest.testWatchedCollectionCreation-seed#[94CB460BC30867F]) [    ] o.a.s.c.c.SolrZkClient makePath: /aliases.json
   [junit4]   2> 2214295 INFO  (TEST-ZkStateReaderTest.testWatchedCollectionCreation-seed#[94CB460BC30867F]) [    ] o.a.s.c.c.SolrZkClient makePath: /clusterstate.json
   [junit4]   2> 2214296 INFO  (TEST-ZkStateReaderTest.testWatchedCollectionCreation-seed#[94CB460BC30867F]) [    ] o.a.s.c.c.SolrZkClient makePath: /security.json
   [junit4]   2> 2214298 INFO  (TEST-ZkStateReaderTest.testWatchedCollectionCreation-seed#[94CB460BC30867F]) [    ] o.a.s.c.c.ZkStateReader Updating cluster state from ZooKeeper... 
   [junit4]   2> 2214299 INFO  (TEST-ZkStateReaderTest.testWatchedCollectionCreation-seed#[94CB460BC30867F]) [    ] o.a.s.c.c.ZkStateReader Loaded empty cluster properties
   [junit4]   2> 2214300 INFO  (TEST-ZkStateReaderTest.testWatchedCollectionCreation-seed#[94CB460BC30867F]) [    ] o.a.s.c.c.ZkStateReader Updated live nodes from ZooKeeper... (0) -> (0)
   [junit4]   2> 2214303 INFO  (TEST-ZkStateReaderTest.testWatchedCollectionCreation-seed#[94CB460BC30867F]) [    ] o.a.s.c.c.ZkStateReader Deleting data for [c1]
   [junit4]   2> 2214303 INFO  (TEST-ZkStateReaderTest.testWatchedCollectionCreation-seed#[94CB460BC30867F]) [    ] o.a.s.c.c.SolrZkClient makePath: /collections/c1
   [junit4]   2> 2214305 INFO  (zkCallback-3227-thread-1) [    ] o.a.s.c.c.ZkStateReader A collections change: [WatchedEvent state:SyncConnected type:NodeChildrenChanged path:/collections], has occurred - updating...
   [junit4]   2> 2214307 INFO  (TEST-ZkStateReaderTest.testWatchedCollectionCreation-seed#[94CB460BC30867F]) [    ] o.a.s.c.o.ZkStateWriter going to create_collection /collections/c1/state.json
   [junit4]   2> 2214308 INFO  (zkCallback-3227-thread-1) [    ] o.a.s.c.c.ZkStateReader A cluster state change: [WatchedEvent state:SyncConnected type:NodeCreated path:/collections/c1/state.json] for collection [c1] has occurred - updating... (live nodes size: [0])
   [junit4]   2> 2214308 INFO  (zkCallback-3227-thread-1) [    ] o.a.s.c.c.ZkStateReader Add data for [c1] ver [0]
   [junit4]   2> 2214311 INFO  (TEST-ZkStateReaderTest.testWatchedCollectionCreation-seed#[94CB460BC30867F]) [    ] o.a.s.c.ZkTestServer connecting to 127.0.0.1:57610 57610
   [junit4]   2> 2214312 INFO  (Thread-6294) [    ] o.a.s.c.ZkTestServer connecting to 127.0.0.1:57610 57610
   [junit4]   2> 2214316 INFO  (TEST-ZkStateReaderTest.testWatchedCollectionCreation-seed#[94CB460BC30867F]) [    ] o.a.s.SolrTestCaseJ4 ###Ending testWatchedCollectionCreation
   [junit4]   2> 2214319 INFO  (TEST-ZkStateReaderTest.testStateFormatUpdateWithTimeDelayLazy-seed#[94CB460BC30867F]) [    ] o.a.s.SolrTestCaseJ4 ###Starting testStateFormatUpdateWithTimeDelayLazy
   [junit4]   2> 2214321 INFO  (TEST-ZkStateReaderTest.testStateFormatUpdateWithTimeDelayLazy-seed#[94CB460BC30867F]) [    ] o.a.s.c.ZkTestServer STARTING ZK TEST SERVER
   [junit4]   2> 2214321 INFO  (Thread-6295) [    ] o.a.s.c.ZkTestServer client port:0.0.0.0/0.0.0.0:0
   [junit4]   2> 2214321 INFO  (Thread-6295) [    ] o.a.s.c.ZkTestServer Starting server
   [junit4]   2> 2214421 INFO  (TEST-ZkStateReaderTest.testStateFormatUpdateWithTimeDelayLazy-seed#[94CB460BC30867F]) [    ] o.a.s.c.ZkTestServer start zk server on port:57644
   [junit4]   2> 2214421 INFO  (TEST-ZkStateReaderTest.testStateFormatUpdateWithTimeDelayLazy-seed#[94CB460BC30867F]) [    ] o.a.s.c.c.SolrZkClient Using default ZkCredentialsProvider
   [junit4]   2> 2214422 INFO  (TEST-ZkStateReaderTest.testStateFormatUpdateWithTimeDelayLazy-seed#[94CB460BC30867F]) [    ] o.a.s.c.c.ConnectionManager Waiting for client to connect to ZooKeeper
   [junit4]   2> 2214427 INFO  (zkCallback-3229-thread-1) [    ] o.a.s.c.c.ConnectionManager Watcher org.apache.solr.common.cloud.ConnectionManager@596a62 name:ZooKeeperConnection Watcher:127.0.0.1:57644 got event WatchedEvent state:SyncConnected type:None path:null path:null type:None
   [junit4]   2> 2214428 INFO  (TEST-ZkStateReaderTest.testStateFormatUpdateWithTimeDelayLazy-seed#[94CB460BC30867F]) [    ] o.a.s.c.c.ConnectionManager Client is connected to ZooKeeper
   [junit4]   2> 2214428 INFO  (TEST-ZkStateReaderTest.testStateFormatUpdateWithTimeDelayLazy-seed#[94CB460BC30867F]) [    ] o.a.s.c.c.SolrZkClient Using default ZkACLProvider
   [junit4]   2> 2214429 WARN  (NIOServerCxn.Factory:0.0.0.0/0.0.0.0:0) [    ] o.a.z.s.NIOServerCnxn caught end of stream exception
   [junit4]   2> EndOfStreamException: Unable to read additional data from client sessionid 0x15518f5b0970000, likely client has closed socket
   [junit4]   2> 	at org.apache.zookeeper.server.NIOServerCnxn.doIO(NIOServerCnxn.java:228)
   [junit4]   2> 	at org.apache.zookeeper.server.NIOServerCnxnFactory.run(NIOServerCnxnFactory.java:208)
   [junit4]   2> 	at java.lang.Thread.run(Thread.java:745)
   [junit4]   2> 2214430 INFO  (TEST-ZkStateReaderTest.testStateFormatUpdateWithTimeDelayLazy-seed#[94CB460BC30867F]) [    ] o.a.s.c.c.SolrZkClient Using default ZkCredentialsProvider
   [junit4]   2> 2214431 INFO  (TEST-ZkStateReaderTest.testStateFormatUpdateWithTimeDelayLazy-seed#[94CB460BC30867F]) [    ] o.a.s.c.c.ConnectionManager Waiting for client to connect to ZooKeeper
   [junit4]   2> 2214433 INFO  (zkCallback-3230-thread-1) [    ] o.a.s.c.c.ConnectionManager Watcher org.apache.solr.common.cloud.ConnectionManager@1374de3 name:ZooKeeperConnection Watcher:127.0.0.1:57644 got event WatchedEvent state:SyncConnected type:None path:null path:null type:None
   [junit4]   2> 2214433 INFO  (TEST-ZkStateReaderTest.testStateFormatUpdateWithTimeDelayLazy-seed#[94CB460BC30867F]) [    ] o.a.s.c.c.ConnectionManager Client is connected to ZooKeeper
   [junit4]   2> 2214434 INFO  (TEST-ZkStateReaderTest.testStateFormatUpdateWithTimeDelayLazy-seed#[94CB460BC30867F]) [    ] o.a.s.c.c.SolrZkClient Using default ZkACLProvider
   [junit4]   2> 2214434 INFO  (TEST-ZkStateReaderTest.testStateFormatUpdateWithTimeDelayLazy-seed#[94CB460BC30867F]) [    ] o.a.s.c.c.SolrZkClient makePath: /solr
   [junit4]   2> 2214438 WARN  (NIOServerCxn.Factory:0.0.0.0/0.0.0.0:0) [    ] o.a.z.s.NIOServerCnxn caught end of stream exception
   [junit4]   2> EndOfStreamException: Unable to read additional data from client sessionid 0x15518f5b0970001, likely client has closed socket
   [junit4]   2> 	at org.apache.zookeeper.server.NIOServerCnxn.doIO(NIOServerCnxn.java:228)
   [junit4]   2> 	at org.apache.zookeeper.server.NIOServerCnxnFactory.run(NIOServerCnxnFactory.java:208)
   [junit4]   2> 	at java.lang.Thread.run(Thread.java:745)
   [junit4]   2> 2214438 INFO  (TEST-ZkStateReaderTest.testStateFormatUpdateWithTimeDelayLazy-seed#[94CB460BC30867F]) [    ] o.a.s.c.c.SolrZkClient Using default ZkCredentialsProvider
   [junit4]   2> 2214439 INFO  (TEST-ZkStateReaderTest.testStateFormatUpdateWithTimeDelayLazy-seed#[94CB460BC30867F]) [    ] o.a.s.c.c.ConnectionManager Waiting for client to connect to ZooKeeper
   [junit4]   2> 2214442 INFO  (zkCallback-3231-thread-1) [    ] o.a.s.c.c.ConnectionManager Watcher org.apache.solr.common.cloud.ConnectionManager@921ae3 name:ZooKeeperConnection Watcher:127.0.0.1:57644/solr got event WatchedEvent state:SyncConnected type:None path:null path:null type:None
   [junit4]   2> 2214442 INFO  (TEST-ZkStateReaderTest.testStateFormatUpdateWithTimeDelayLazy-seed#[94CB460BC30867F]) [    ] o.a.s.c.c.ConnectionManager Client is connected to ZooKeeper
   [junit4]   2> 2214442 INFO  (TEST-ZkStateReaderTest.testStateFormatUpdateWithTimeDelayLazy-seed#[94CB460BC30867F]) [    ] o.a.s.c.c.SolrZkClient Using default ZkACLProvider
   [junit4]   2> 2214442 INFO  (TEST-ZkStateReaderTest.testStateFormatUpdateWithTimeDelayLazy-seed#[94CB460BC30867F]) [    ] o.a.s.c.c.SolrZkClient makePath: /live_nodes
   [junit4]   2> 2214444 INFO  (TEST-ZkStateReaderTest.testStateFormatUpdateWithTimeDelayLazy-seed#[94CB460BC30867F]) [    ] o.a.s.c.c.SolrZkClient makePath: /collections
   [junit4]   2> 2214445 INFO  (TEST-ZkStateReaderTest.testStateFormatUpdateWithTimeDelayLazy-seed#[94CB460BC30867F]) [    ] o.a.s.c.c.SolrZkClient makePath: /aliases.json
   [junit4]   2> 2214447 INFO  (TEST-ZkStateReaderTest.testStateFormatUpdateWithTimeDelayLazy-seed#[94CB460BC30867F]) [    ] o.a.s.c.c.SolrZkClient makePath: /clusterstate.json
   [junit4]   2> 2214451 INFO  (TEST-ZkStateReaderTest.testStateFormatUpdateWithTimeDelayLazy-seed#[94CB460BC30867F]) [    ] o.a.s.c.c.SolrZkClient makePath: /security.json
   [junit4]   2> 2214453 INFO  (TEST-ZkStateReaderTest.testStateFormatUpdateWithTimeDelayLazy-seed#[94CB460BC30867F]) [    ] o.a.s.c.c.ZkStateReader Updating cluster state from ZooKeeper... 
   [junit4]   2> 2214455 INFO  (TEST-ZkStateReaderTest.testStateFormatUpdateWithTimeDelayLazy-seed#[94CB460BC30867F]) [    ] o.a.s.c.c.ZkStateReader Loaded empty cluster properties
   [junit4]   2> 2214456 INFO  (TEST-ZkStateReaderTest.testStateFormatUpdateWithTimeDelayLazy-seed#[94CB460BC30867F]) [    ] o.a.s.c.c.ZkStateReader Updated live nodes from ZooKeeper... (0) -> (0)
   [junit4]   2> 2214460 INFO  (TEST-ZkStateReaderTest.testStateFormatUpdateWithTimeDelayLazy-seed#[94CB460BC30867F]) [    ] o.a.s.c.c.SolrZkClient makePath: /collections/c1
   [junit4]   2> 2214461 INFO  (zkCallback-3231-thread-1) [    ] o.a.s.c.c.ZkStateReader A collections change: [WatchedEvent state:SyncConnected type:NodeChildrenChanged path:/collections], has occurred - updating...
   [junit4]   2> 2214465 INFO  (zkCallback-3231-thread-1) [    ] o.a.s.c.c.ZkStateReader A cluster state change: [WatchedEvent state:SyncConnected type:NodeDataChanged path:/clusterstate.json], has occurred - updating... (live nodes size: [0])
   [junit4]   2> 2214468 INFO  (TEST-ZkStateReaderTest.testStateFormatUpdateWithTimeDelayLazy-seed#[94CB460BC30867F]) [    ] o.a.s.c.c.ZkStateReader Deleting data for [c1]
   [junit4]   2> 2214469 INFO  (TEST-ZkStateReaderTest.testStateFormatUpdateWithTimeDelayLazy-seed#[94CB460BC30867F]) [    ] o.a.s.c.o.ZkStateWriter going to create_collection /collections/c1/state.json
   [junit4]   2> 2214469 INFO  (zkCallback-3231-thread-1) [    ] o.a.s.c.c.ZkStateReader Uninteresting collection c1
   [junit4]   2> 2214471 INFO  (zkCallback-3231-thread-1) [    ] o.a.s.c.c.ZkStateReader A cluster state change: [WatchedEvent state:SyncConnected type:NodeDataChanged path:/clusterstate.json], has occurred - updating... (live nodes size: [0])
   [junit4]   2> 2214472 INFO  (TEST-ZkStateReaderTest.testStateFormatUpdateWithTimeDelayLazy-seed#[94CB460BC30867F]) [    ] o.a.s.c.c.ZkStateReader Add data for [c1] ver [0]
   [junit4]   2> 2214475 INFO  (TEST-ZkStateReaderTest.testStateFormatUpdateWithTimeDelayLazy-seed#[94CB460BC30867F]) [    ] o.a.s.c.ZkTestServer connecting to 127.0.0.1:57644 57644
   [junit4]   2> 2214477 INFO  (Thread-6295) [    ] o.a.s.c.ZkTestServer connecting to 127.0.0.1:57644 57644
   [junit4]   2> 2214479 INFO  (TEST-ZkStateReaderTest.testStateFormatUpdateWithTimeDelayLazy-seed#[94CB460BC30867F]) [    ] o.a.s.SolrTestCaseJ4 ###Ending testStateFormatUpdateWithTimeDelayLazy
   [junit4]   2> 2214484 INFO  (TEST-ZkStateReaderTest.testStateFormatUpdateWithExplicitRefreshLazy-seed#[94CB460BC30867F]) [    ] o.a.s.SolrTestCaseJ4 ###Starting testStateFormatUpdateWithExplicitRefreshLazy
   [junit4]   2> 2214486 INFO  (TEST-ZkStateReaderTest.testStateFormatUpdateWithExplicitRefreshLazy-seed#[94CB460BC30867F]) [    ] o.a.s.c.ZkTestServer STARTING ZK TEST SERVER
   [junit4]   2> 2214486 INFO  (Thread-6296) [    ] o.a.s.c.ZkTestServer client port:0.0.0.0/0.0.0.0:0
   [junit4]   2> 2214486 INFO  (Thread-6296) [    ] o.a.s.c.ZkTestServer Starting server
   [junit4]   2> 2214587 INFO  (TEST-ZkStateReaderTest.testStateFormatUpdateWithExplicitRefreshLazy-seed#[94CB460BC30867F]) [    ] o.a.s.c.ZkTestServer start zk server on port:57660
   [junit4]   2> 2214587 INFO  (TEST-ZkStateReaderTest.testStateFormatUpdateWithExplicitRefreshLazy-seed#[94CB460BC30867F]) [    ] o.a.s.c.c.SolrZkClient Using default ZkCredentialsProvider
   [junit4]   2> 2214588 INFO  (TEST-ZkStateReaderTest.testStateFormatUpdateWithExplicitRefreshLazy-seed#[94CB460BC30867F]) [    ] o.a.s.c.c.ConnectionManager Waiting for client to connect to ZooKeeper
   [junit4]   2> 2214593 INFO  (zkCallback-3233-thread-1) [    ] o.a.s.c.c.ConnectionManager Watcher org.apache.solr.common.cloud.ConnectionManager@1d981e7 name:ZooKeeperConnection Watcher:127.0.0.1:57660 got event WatchedEvent state:SyncConnected type:None path:null path:null type:None
   [junit4]   2> 2214593 INFO  (TEST-ZkStateReaderTest.testStateFormatUpdateWithExplicitRefreshLazy-seed#[94CB460BC30867F]) [    ] o.a.s.c.c.ConnectionManager Client is connected to ZooKeeper
   [junit4]   2> 2214593 INFO  (TEST-ZkStateReaderTest.testStateFormatUpdateWithExplicitRefreshLazy-seed#[94CB460BC30867F]) [    ] o.a.s.c.c.SolrZkClient Using default ZkACLProvider
   [junit4]   2> 2214594 INFO  (TEST-ZkStateReaderTest.testStateFormatUpdateWithExplicitRefreshLazy-seed#[94CB460BC30867F]) [    ] o.a.s.c.c.SolrZkClient Using default ZkCredentialsProvider
   [junit4]   2> 2214596 INFO  (TEST-ZkStateReaderTest.testStateFormatUpdateWithExplicitRefreshLazy-seed#[94CB460BC30867F]) [    ] o.a.s.c.c.ConnectionManager Waiting for client to connect to ZooKeeper
   [junit4]   2> 2214597 INFO  (zkCallback-3234-thread-1) [    ] o.a.s.c.c.ConnectionManager Watcher org.apache.solr.common.cloud.ConnectionManager@a679fd name:ZooKeeperConnection Watcher:127.0.0.1:57660 got event WatchedEvent state:SyncConnected type:None path:null path:null type:None
   [junit4]   2> 2214597 INFO  (TEST-ZkStateReaderTest.testStateFormatUpdateWithExplicitRefreshLazy-seed#[94CB460BC30867F]) [    ] o.a.s.c.c.ConnectionManager Client is connected to ZooKeeper
   [junit4]   2> 2214597 INFO  (TEST-ZkStateReaderTest.testStateFormatUpdateWithExplicitRefreshLazy-seed#[94CB460BC30867F]) [    ] o.a.s.c.c.SolrZkClient Using default ZkACLProvider
   [junit4]   2> 2214598 INFO  (TEST-ZkStateReaderTest.testStateFormatUpdateWithExplicitRefreshLazy-seed#[94CB460BC30867F]) [    ] o.a.s.c.c.SolrZkClient makePath: /solr
   [junit4]   2> 2214601 INFO  (TEST-ZkStateReaderTest.testStateFormatUpdateWithExplicitRefreshLazy-seed#[94CB460BC30867F]) [    ] o.a.s.c.c.SolrZkClient Using default ZkCredentialsProvider
   [junit4]   2> 2214603 INFO  (TEST-ZkStateReaderTest.testStateFormatUpdateWithExplicitRefreshLazy-seed#[94CB460BC30867F]) [    ] o.a.s.c.c.ConnectionManager Waiting for client to connect to ZooKeeper
   [junit4]   2> 2214605 INFO  (zkCallback-3235-thread-1) [    ] o.a.s.c.c.ConnectionManager Watcher org.apache.solr.common.cloud.ConnectionManager@90313e name:ZooKeeperConnection Watcher:127.0.0.1:57660/solr got event WatchedEvent state:SyncConnected type:None path:null path:null type:None
   [junit4]   2> 2214605 INFO  (TEST-ZkStateReaderTest.testStateFormatUpdateWithExplicitRefreshLazy-seed#[94CB460BC30867F]) [    ] o.a.s.c.c.ConnectionManager Client is connected to ZooKeeper
   [junit4]   2> 2214605 INFO  (TEST-ZkStateReaderTest.testStateFormatUpdateWithExplicitRefreshLazy-seed#[94CB460BC30867F]) [    ] o.a.s.c.c.SolrZkClient Using default ZkACLProvider
   [junit4]   2> 2214606 INFO  (TEST-ZkStateReaderTest.testStateFormatUpdateWithExplicitRefreshLazy-seed#[94CB460BC30867F]) [    ] o.a.s.c.c.SolrZkClient makePath: /live_nodes
   [junit4]   2> 2214608 INFO  (TEST-ZkStateReaderTest.testStateFormatUpdateWithExplicitRefreshLazy-seed#[94CB460BC30867F]) [    ] o.a.s.c.c.SolrZkClient makePath: /collections
   [junit4]   2> 2214610 INFO  (TEST-ZkStateReaderTest.testStateFormatUpdateWithExplicitRefreshLazy-seed#[94CB460BC30867F]) [    ] o.a.s.c.c.SolrZkClient makePath: /aliases.json
   [junit4]   2> 2214611 INFO  (TEST-ZkStateReaderTest.testStateFormatUpdateWithExplicitRefreshLazy-seed#[94CB460BC30867F]) [    ] o.a.s.c.c.SolrZkClient makePath: /clusterstate.json
   [junit4]   2> 2214613 INFO  (TEST-ZkStateReaderTest.testStateFormatUpdateWithExplicitRefreshLazy-seed#[94CB460BC30867F]) [    ] o.a.s.c.c.SolrZkClient makePath: /security.json
   [junit4]   2> 2214615 INFO  (TEST-ZkStateReaderTest.testStateFormatUpdateWithExplicitRefreshLazy-seed#[94CB460BC30867F]) [    ] o.a.s.c.c.ZkStateReader Updating cluster state from ZooKeeper... 
   [junit4]   2> 2214615 INFO  (TEST-ZkStateReaderTest.testStateFormatUpdateWithExplicitRefreshLazy-seed#[94CB460BC30867F]) [    ] o.a.s.c.c.ZkStateReader Loaded empty cluster properties
   [junit4]   2> 2214616 INFO  (TEST-ZkStateReaderTest.testStateFormatUpdateWithExplicitRefreshLazy-seed#[94CB460BC30867F]) [    ] o.a.s.c.c.ZkStateReader Updated live nodes from ZooKeeper... (0) -> (0)
   [junit4]   2> 2214618 INFO  (TEST-ZkStateReaderTest.testStateFormatUpdateWithExplicitRefreshLazy-seed#[94CB460BC30867F]) [    ] o.a.s.c.c.SolrZkClient makePath: /collections/c1
   [junit4]   2> 2214619 INFO  (zkCallback-3235-thread-1) [    ] o.a.s.c.c.ZkStateReader A collections change: [WatchedEvent state:SyncConnected type:NodeChildrenChanged path:/collections], has occurred - updating...
   [junit4]   2> 2214620 INFO  (zkCallback-3235-thread-1) [    ] o.a.s.c.c.ZkStateReader A cluster state change: [WatchedEvent state:SyncConnected type:NodeDataChanged path:/clusterstate.json], has occurred - updating... (live nodes size: [0])
   [junit4]   2> 2214621 INFO  (TEST-ZkStateReaderTest.testStateFormatUpdateWithExplicitRefreshLazy-seed#[94CB460BC30867F]) [    ] o.a.s.c.o.ZkStateWriter going to create_collection /collections/c1/state.json
   [junit4]   2> 2214622 INFO  (zkCallback-3235-thread-1) [    ] o.a.s.c.c.ZkStateReader A cluster state change: [WatchedEvent state:SyncConnected type:NodeDataChanged path:/clusterstate.json], has occurred - updating... (live nodes size: [0])
   [junit4]   2> 2214627 INFO  (TEST-ZkStateReaderTest.testStateFormatUpdateWithExplicitRefreshLazy-seed#[94CB460BC30867F]) [    ] o.a.s.c.ZkTestServer connecting to 127.0.0.1:57660 57660
   [junit4]   2> 2214630 INFO  (Thread-6296) [    ] o.a.s.c.ZkTestServer connecting to 127.0.0.1:57660 57660
   [junit4]   2> 2214632 INFO  (TEST-ZkStateReaderTest.testStateFormatUpdateWithExplicitRefreshLazy-seed#[94CB460BC30867F]) [    ] o.a.s.SolrTestCaseJ4 ###Ending testStateFormatUpdateWithExplicitRefreshLazy
   [junit4]   2> 2214637 INFO  (TEST-ZkStateReaderTest.testExternalCollectionWatchedNotWatched-seed#[94CB460BC30867F]) [    ] o.a.s.SolrTestCaseJ4 ###Starting testExternalCollectionWatchedNotWatched
   [junit4]   2> 2214638 INFO  (TEST-ZkStateReaderTest.testExternalCollectionWatchedNotWatched-seed#[94CB460BC30867F]) [    ] o.a.s.c.ZkTestServer STARTING ZK TEST SERVER
   [junit4]   2> 2214639 INFO  (Thread-6297) [    ] o.a.s.c.ZkTestServer client port:0.0.0.0/0.0.0.0:0
   [junit4]   2> 2214639 INFO  (Thread-6297) [    ] o.a.s.c.ZkTestServer Starting server
   [junit4]   2> 2214739 INFO  (TEST-ZkStateReaderTest.testExternalCollectionWatchedNotWatched-seed#[94CB460BC30867F]) [    ] o.a.s.c.ZkTestServer start zk server on port:57676
   [junit4]   2> 2214739 INFO  (TEST-ZkStateReaderTest.testExternalCollectionWatchedNotWatched-seed#[94CB460BC30867F]) [    ] o.a.s.c.c.SolrZkClient Using default ZkCredentialsProvider
   [junit4]   2> 2214740 INFO  (TEST-ZkStateReaderTest.testExternalCollectionWatchedNotWatched-seed#[94CB460BC30867F]) [    ] o.a.s.c.c.ConnectionManager Waiting for client to connect to ZooKeeper
   [junit4]   2> 2214746 INFO  (zkCallback-3237-thread-1) [    ] o.a.s.c.c.ConnectionManager Watcher org.apache.solr.common.cloud.ConnectionManager@6ddba1 name:ZooKeeperConnection Watcher:127.0.0.1:57676 got event WatchedEvent state:SyncConnected type:None path:null path:null type:None
   [junit4]   2> 2214746 INFO  (TEST-ZkStateReaderTest.testExternalCollectionWatchedNotWatched-seed#[94CB460BC30867F]) [    ] o.a.s.c.c.ConnectionManager Client is connected to ZooKeeper
   [junit4]   2> 2214747 INFO  (TEST-ZkStateReaderTest.testExternalCollectionWatchedNotWatched-seed#[94CB460BC30867F]) [    ] o.a.s.c.c.SolrZkClient Using default ZkACLProvider
   [junit4]   2> 2214751 INFO  (TEST-ZkStateReaderTest.testExternalCollectionWatchedNotWatched-seed#[94CB460BC30867F]) [    ] o.a.s.c.c.SolrZkClient Using default ZkCredentialsProvider
   [junit4]   2> 2214751 WARN  (NIOServerCxn.Factory:0.0.0.0/0.0.0.0:0) [    ] o.a.z.s.NIOServerCnxn caught end of stream exception
   [junit4]   2> EndOfStreamException: Unable to read additional data from client sessionid 0x15518f5b1d50000, likely client has closed socket
   [junit4]   2> 	at org.apache.zookeeper.server.NIOServerCnxn.doIO(NIOServerCnxn.java:228)
   [junit4]   2> 	at org.apache.zookeeper.server.NIOServerCnxnFactory.run(NIOServerCnxnFactory.java:208)
   [junit4]   2> 	at java.lang.Thread.run(Thread.java:745)
   [junit4]   2> 2214752 INFO  (TEST-ZkStateReaderTest.testExternalCollectionWatchedNotWatched-seed#[94CB460BC30867F]) [    ] o.a.s.c.c.ConnectionManager Waiting for client to connect to ZooKeeper
   [junit4]   2> 2214754 INFO  (zkCallback-3238-thread-1) [    ] o.a.s.c.c.ConnectionManager Watcher org.apache.solr.common.cloud.ConnectionManager@ba8167 name:ZooKeeperConnection Watcher:127.0.0.1:57676 got event WatchedEvent state:SyncConnected type:None path:null path:null type:None
   [junit4]   2> 2214755 INFO  (TEST-ZkStateReaderTest.testExternalCollectionWatchedNotWatched-seed#[94CB460BC30867F]) [    ] o.a.s.c.c.ConnectionManager Client is connected to ZooKeeper
   [junit4]   2> 2214755 INFO  (TEST-ZkStateReaderTest.testExternalCollectionWatchedNotWatched-seed#[94CB460BC30867F]) [    ] o.a.s.c.c.SolrZkClient Using default ZkACLProvider
   [junit4]   2> 2214755 INFO  (TEST-ZkStateReaderTest.testExternalCollectionWatchedNotWatched-seed#[94CB460BC30867F]) [    ] o.a.s.c.c.SolrZkClient makePath: /solr
   [junit4]   2> 2214760 INFO  (TEST-ZkStateReaderTest.testExternalCollectionWatchedNotWatched-seed#[94CB460BC30867F]) [    ] o.a.s.c.c.SolrZkClient Using default ZkCredentialsProvider
   [junit4]   2> 2214762 INFO  (TEST-ZkStateReaderTest.testExternalCollectionWatchedNotWatched-seed#[94CB460BC30867F]) [    ] o.a.s.c.c.ConnectionManager Waiting for client to connect to ZooKeeper
   [junit4]   2> 2214764 INFO  (zkCallback-3239-thread-1) [    ] o.a.s.c.c.ConnectionManager Watcher org.apache.solr.common.cloud.ConnectionManager@a8b7f name:ZooKeeperConnection Watcher:127.0.0.1:57676/solr got event WatchedEvent state:SyncConnected type:None path:null path:null type:None
   [junit4]   2> 2214765 INFO  (TEST-ZkStateReaderTest.testExternalCollectionWatchedNotWatched-seed#[94CB460BC30867F]) [    ] o.a.s.c.c.ConnectionManager Client is connected to ZooKeeper
   [junit4]   2> 2214765 INFO  (TEST-ZkStateReaderTest.testExternalCollectionWatchedNotWatched-seed#[94CB460BC30867F]) [    ] o.a.s.c.c.SolrZkClient Using default ZkACLProvider
   [junit4]   2> 2214765 INFO  (TEST-ZkStateReaderTest.testExternalCollectionWatchedNotWatched-seed#[94CB460BC30867F]) [    ] o.a.s.c.c.SolrZkClient makePath: /live_nodes
   [junit4]   2> 2214768 INFO  (TEST-ZkStateReaderTest.testExternalCollectionWatchedNotWatched-seed#[94CB460BC30867F]) [    ] o.a.s.c.c.SolrZkClient makePath: /collections
   [junit4]   2> 2214770 INFO  (TEST-ZkStateReaderTest.testExternalCollectionWatchedNotWatched-seed#[94CB460BC30867F]) [    ] o.a.s.c.c.SolrZkClient makePath: /aliases.json
   [junit4]   2> 2214772 INFO  (TEST-ZkStateReaderTest.testExternalCollectionWatchedNotWatched-seed#[94CB460BC30867F]) [    ] o.a.s.c.c.SolrZkClient makePath: /clusterstate.json
   [junit4]   2> 2214774 INFO  (TEST-ZkStateReaderTest.testExternalCollectionWatchedNotWatched-seed#[94CB460BC30867F]) [    ] o.a.s.c.c.SolrZkClient makePath: /security.json
   [junit4]   2> 2214775 INFO  (TEST-ZkStateReaderTest.testExternalCollectionWatchedNotWatched-seed#[94CB460BC30867F]) [    ] o.a.s.c.c.ZkStateReader Updating cluster state from ZooKeeper... 
   [junit4]   2> 2214776 INFO  (TEST-ZkStateReaderTest.testExternalCollectionWatchedNotWatched-seed#[94CB460BC30867F]) [    ] o.a.s.c.c.ZkStateReader Loaded empty cluster properties
   [junit4]   2> 2214777 INFO  (TEST-ZkStateReaderTest.testExternalCollectionWatchedNotWatched-seed#[94CB460BC30867F]) [    ] o.a.s.c.c.ZkStateReader Updated live nodes from ZooKeeper... (0) -> (0)
   [junit4]   2> 2214779 INFO  (TEST-ZkStateReaderTest.testExternalCollectionWatchedNotWatched-seed#[94CB460BC30867F]) [    ] o.a.s.c.c.SolrZkClient makePath: /collections/c1
   [junit4]   2> 2214781 INFO  (zkCallback-3239-thread-1) [    ] o.a.s.c.c.ZkStateReader A collections change: [WatchedEvent state:SyncConnected type:NodeChildrenChanged path:/collections], has occurred - updating...
   [junit4]   2> 2214782 INFO  (TEST-ZkStateReaderTest.testExternalCollectionWatchedNotWatched-seed#[94CB460BC30867F]) [    ] o.a.s.c.o.ZkStateWriter going to create_collection /collections/c1/state.json
   [junit4]   2> 2214783 INFO  (TEST-ZkStateReaderTest.testExternalCollectionWatchedNotWatched-seed#[94CB460BC30867F]) [    ] o.a.s.c.c.ZkStateReader Add data for [c1] ver [0]
   [junit4]   2> 2214784 WARN  (NIOServerCxn.Factory:0.0.0.0/0.0.0.0:0) [    ] o.a.z.s.NIOServerCnxn caught end of stream exception
   [junit4]   2> EndOfStreamException: Unable to read additional data from client sessionid 0x15518f5b1d50002, likely client has closed socket
   [junit4]   2> 	at org.apache.zookeeper.server.NIOServerCnxn.doIO(NIOServerCnxn.java:228)
   [junit4]   2> 	at org.apache.zookeeper.server.NIOServerCnxnFactory.run(NIOServerCnxnFactory.java:208)
   [junit4]   2> 	at java.lang.Thread.run(Thread.java:745)
   [junit4]   2> 2214787 INFO  (TEST-ZkStateReaderTest.testExternalCollectionWatchedNotWatched-seed#[94CB460BC30867F]) [    ] o.a.s.c.ZkTestServer connecting to 127.0.0.1:57676 57676
   [junit4]   2> 2214791 INFO  (Thread-6297) [    ] o.a.s.c.ZkTestServer connecting to 127.0.0.1:57676 57676
   [junit4]   2> 2214795 INFO  (TEST-ZkStateReaderTest.testExternalCollectionWatchedNotWatched-seed#[94CB460BC30867F]) [    ] o.a.s.SolrTestCaseJ4 ###Ending testExternalCollectionWatchedNotWatched
   [junit4]   2> 2214796 INFO  (SUITE-ZkStateReaderTest-seed#[94CB460BC30867F]-worker) [    ] o.a.s.SolrTestCaseJ4 ###deleteCore
   [junit4]   2> NOTE: leaving temporary files on disk at: C:\Users\jenkins\workspace\Lucene-Solr-master-Windows\solr\build\solr-core\test\J0\temp\solr.cloud.overseer.ZkStateReaderTest_94CB460BC30867F-001
   [junit4]   2> Jun 04, 2016 1:10:03 AM com.carrotsearch.randomizedtesting.ThreadLeakControl checkThreadLeaks
   [junit4]   2> WARNING: Will linger awaiting termination of 4 leaked thread(s).
   [junit4]   2> NOTE: test params are: codec=Asserting(Lucene62), sim=RandomSimilarity(queryNorm=true,coord=no): {}, locale=zh-SG, timezone=Africa/Ndjamena
   [junit4]   2> NOTE: Windows 10 10.0 x86/Oracle Corporation 1.8.0_92 (32-bit)/cpus=3,threads=1,free=277397136,total=518979584
   [junit4]   2> NOTE: All tests run in this JVM: [TestFieldCacheSanityChecker, SparseHLLTest, HdfsUnloadDistributedZkTest, SliceStateTest, HdfsBasicDistributedZk2Test, BlockJoinFacetDistribTest, StatelessScriptUpdateProcessorFactoryTest, TestLMDirichletSimilarityFactory, UpdateParamsTest, TestArbitraryIndexDir, ZkCLITest, HdfsLockFactoryTest, TestCloudInspectUtil, PeerSyncTest, TestStressLucene, HighlighterMaxOffsetTest, DocumentBuilderTest, DocumentAnalysisRequestHandlerTest, TestSolrCloudWithKerberosAlt, TestRandomDVFaceting, DistributedQueryComponentCustomSortTest, TestIntervalFaceting, RequestLoggingTest, SpatialFilterTest, TestWordDelimiterFilterFactory, LeaderInitiatedRecoveryOnCommitTest, IndexSchemaTest, TermsComponentTest, TestSmileRequest, TestReplicationHandler, TestDocSet, HdfsCollectionsAPIDistributedZkTest, CustomCollectionTest, TestTestInjection, TestCollectionAPI, TestRawTransformer, RecoveryAfterSoftCommitTest, TestAddFieldRealTimeGet, ExplicitHLLTest, TestSweetSpotSimilarityFactory, TestSearchPerf, StandardRequestHandlerTest, ActionThrottleTest, DataDrivenBlockJoinTest, InfoHandlerTest, TestNumericTerms32, ScriptEngineTest, RegexBoostProcessorTest, TestBulkSchemaConcurrent, HdfsChaosMonkeyNothingIsSafeTest, TestRTimerTree, MBeansHandlerTest, HdfsRestartWhileUpdatingTest, TestFilteredDocIdSet, TestSearcherReuse, TestStressUserVersions, TestUninvertingReader, AnalyticsMergeStrategyTest, TestFieldCacheWithThreads, TestLeaderElectionZkExpiry, AlternateDirectoryTest, PrimUtilsTest, BlockJoinFacetSimpleTest, FastVectorHighlighterTest, TestConfigOverlay, SystemInfoHandlerTest, SampleTest, TestGroupingSearch, TestConfigSetProperties, TestScoreJoinQPNoScore, OverseerTest, SolrTestCaseJ4Test, SolrCoreTest, TestSha256AuthenticationProvider, TestFieldCollectionResource, TestCollationFieldDocValues, AsyncMigrateRouteKeyTest, SimpleCollectionCreateDeleteTest, TestSortingResponseWriter, HardAutoCommitTest, TestDistributedSearch, TestFaceting, TestBulkSchemaAPI, TestMiniSolrCloudClusterBase, TestSubQueryTransformer, SchemaVersionSpecificBehaviorTest, TestPerFieldSimilarityWithDefaultOverride, TestFunctionQuery, TestConfigSetsAPIExclusivity, TestDFRSimilarityFactory, DistributedExpandComponentTest, AtomicUpdatesTest, SolrRequestParserTest, TestRequestStatusCollectionAPI, HighlighterTest, TestSolrFieldCacheMBean, CircularListTest, TestNoOpRegenerator, HttpPartitionTest, TimeZoneUtilsTest, TestSurroundQueryParser, TestCSVLoader, SuggesterFSTTest, HLLSerializationTest, DisMaxRequestHandlerTest, DOMUtilTest, TestGraphMLResponseWriter, CurrencyFieldXmlFileTest, TestMergePolicyConfig, WrapperMergePolicyFactoryTest, TestComponentsName, TestSolrDeletionPolicy1, TestTrackingShardHandlerFactory, TestLazyCores, TestXIncludeConfig, TestConfigReload, OverseerCollectionConfigSetProcessorTest, TestSolrQueryParserResource, TestElisionMultitermQuery, TestSolrDynamicMBean, TestSubQueryTransformerDistrib, TestDFISimilarityFactory, TestTolerantUpdateProcessorRandomCloud, JsonLoaderTest, TestCustomDocTransformer, TestDynamicLoading, TestPostingsSolrHighlighter, TestMinMaxOnMultiValuedField, TestFieldTypeCollectionResource, ZkControllerTest, DistributedSuggestComponentTest, DistribCursorPagingTest, ReplicationFactorTest, DeleteShardTest, TestFieldCacheSortRandom, TestJmxIntegration, ReturnFieldsTest, IndexBasedSpellCheckerTest, MigrateRouteKeyTest, HdfsRecoverLeaseTest, SuggestComponentTest, ClusterStateUpdateTest, TestJsonRequest, OverseerStatusTest, TestPhraseSuggestions, DeleteLastCustomShardedReplicaTest, TestReqParamsAPI, DistributedFacetPivotLongTailTest, DocValuesMultiTest, BasicDistributedZkTest, BasicDistributedZk2Test, CollectionsAPIDistributedZkTest, TestRandomFaceting, LeaderElectionTest, TestRecovery, DistributedSpellCheckComponentTest, TestRealTimeGet, TestStressReorder, TestReload, TestRangeQuery, TestCoreContainer, SimpleFacetsTest, TestSolr4Spatial, QueryElevationComponentTest, ConvertedLegacyTest, TestSort, TestFiltering, TestBadConfig, CurrencyFieldOpenExchangeTest, SimplePostToolTest, TestCoreDiscovery, AnalysisAfterCoreReloadTest, TestExtendedDismaxParser, SpellCheckCollatorTest, SuggesterWFSTTest, PolyFieldTest, NoCacheHeaderTest, WordBreakSolrSpellCheckerTest, SolrCoreCheckLockOnStartupTest, TestPseudoReturnFields, TestUpdate, FieldMutatingUpdateProcessorTest, TestAtomicUpdateErrorCases, QueryEqualityTest, TestRemoteStreaming, XsltUpdateRequestHandlerTest, TestWriterPerf, TestQueryTypes, TestOmitPositions, PathHierarchyTokenizerFactoryTest, TermVectorComponentTest, RequiredFieldsTest, TestCollationField, JSONWriterTest, TestAnalyzedSuggestions, TestPartialUpdateDeduplication, TestPHPSerializedResponseWriter, TestLFUCache, CopyFieldTest, SolrIndexConfigTest, NumericFieldsTest, TestConfig, TestSolrCoreProperties, TestLuceneMatchVersion, TestCodecSupport, TestJmxMonitoredMap, PluginInfoTest, TestFastLRUCache, DateMathParserTest, ChaosMonkeyNothingIsSafeTest, TestEmbeddedSolrServerConstructors, AliasIntegrationTest, CleanupOldIndexTest, CollectionStateFormat2Test, CollectionTooManyReplicasTest, DeleteStatusTest, DistribJoinFromCollectionTest, OutOfBoxZkACLAndCredentialsProvidersTest, OverseerRolesTest, RestartWhileUpdatingTest, SSLMigrationTest, SaslZkACLProviderTest, SharedFSAutoReplicaFailoverTest, SolrCloudExampleTest, TestCloudBackupRestore, TestCloudDeleteByQuery, TestCryptoKeys, TestDistribDocBasedVersion, TestDownShardTolerantSearch, TestLeaderInitiatedRecoveryThread, TestRandomRequestDistribution, TestReplicaProperties, TestStressCloudBlindAtomicUpdates, TriLevelCompositeIdRoutingTest, VMParamsZkACLAndCredentialsProvidersTest, HdfsThreadLeakTest, HdfsWriteToMultipleCollectionsTest, StressHdfsTest, ZkStateReaderTest]
   [junit4] Completed [495/612 (1!)] on J0 in 32.03s, 6 tests, 1 error <<< FAILURES!

[...truncated 163 lines...]
   [junit4] Suite: org.apache.solr.schema.TestManagedSchemaAPI
   [junit4]   2> Creating dataDir: C:\Users\jenkins\workspace\Lucene-Solr-master-Windows\solr\build\solr-core\test\J0\temp\solr.schema.TestManagedSchemaAPI_94CB460BC30867F-001\init-core-data-001
   [junit4]   2> 2392230 INFO  (SUITE-TestManagedSchemaAPI-seed#[94CB460BC30867F]-worker) [    ] o.a.s.SolrTestCaseJ4 Randomized ssl (false) and clientAuth (true) via: @org.apache.solr.util.RandomizeSSL(reason=, value=NaN, ssl=NaN, clientAuth=NaN)
   [junit4]   2> 2392232 INFO  (SUITE-TestManagedSchemaAPI-seed#[94CB460BC30867F]-worker) [    ] o.a.s.c.ZkTestServer STARTING ZK TEST SERVER
   [junit4]   2> 2392248 INFO  (Thread-7498) [    ] o.a.s.c.ZkTestServer client port:0.0.0.0/0.0.0.0:0
   [junit4]   2> 2392248 INFO  (Thread-7498) [    ] o.a.s.c.ZkTestServer Starting server
   [junit4]   2> 2392333 INFO  (SUITE-TestManagedSchemaAPI-seed#[94CB460BC30867F]-worker) [    ] o.a.s.c.ZkTestServer start zk server on port:59324
   [junit4]   2> 2392333 INFO  (SUITE-TestManagedSchemaAPI-seed#[94CB460BC30867F]-worker) [    ] o.a.s.c.c.SolrZkClient Using default ZkCredentialsProvider
   [junit4]   2> 2392334 INFO  (SUITE-TestManagedSchemaAPI-seed#[94CB460BC30867F]-worker) [    ] o.a.s.c.c.ConnectionManager Waiting for client to connect to ZooKeeper
   [junit4]   2> 2392338 INFO  (zkCallback-4088-thread-1) [    ] o.a.s.c.c.ConnectionManager Watcher org.apache.solr.common.cloud.ConnectionManager@181ba91 name:ZooKeeperConnection Watcher:127.0.0.1:59324 got event WatchedEvent state:SyncConnected type:None path:null path:null type:None
   [junit4]   2> 2392338 INFO  (SUITE-TestManagedSchemaAPI-seed#[94CB460BC30867F]-worker) [    ] o.a.s.c.c.ConnectionManager Client is connected to ZooKeeper
   [junit4]   2> 2392339 INFO  (SUITE-TestManagedSchemaAPI-seed#[94CB460BC30867F]-worker) [    ] o.a.s.c.c.SolrZkClient Using default ZkACLProvider
   [junit4]   2> 2392339 INFO  (SUITE-TestManagedSchemaAPI-seed#[94CB460BC30867F]-worker) [    ] o.a.s.c.c.SolrZkClient makePath: /solr/solr.xml
   [junit4]   2> 2392345 INFO  (jetty-launcher-4087-thread-1) [    ] o.e.j.s.Server jetty-9.3.8.v20160314
   [junit4]   2> 2392346 INFO  (jetty-launcher-4087-thread-1) [    ] o.e.j.s.h.ContextHandler Started o.e.j.s.ServletContextHandler@f3522d{/solr,null,AVAILABLE}
   [junit4]   2> 2392347 INFO  (jetty-launcher-4087-thread-2) [    ] o.e.j.s.Server jetty-9.3.8.v20160314
   [junit4]   2> 2392348 INFO  (jetty-launcher-4087-thread-1) [    ] o.e.j.s.ServerConnector Started ServerConnector@fee4d5{HTTP/1.1,[http/1.1]}{127.0.0.1:59328}
   [junit4]   2> 2392348 INFO  (jetty-launcher-4087-thread-1) [    ] o.e.j.s.Server Started @2401584ms
   [junit4]   2> 2392348 INFO  (jetty-launcher-4087-thread-1) [    ] o.a.s.c.s.e.JettySolrRunner Jetty properties: {hostContext=/solr, hostPort=59328}
   [junit4]   2> 2392348 INFO  (jetty-launcher-4087-thread-1) [    ] o.a.s.s.SolrDispatchFilter SolrDispatchFilter.init(): sun.misc.Launcher$AppClassLoader@1d16e93
   [junit4]   2> 2392348 INFO  (jetty-launcher-4087-thread-2) [    ] o.e.j.s.h.ContextHandler Started o.e.j.s.ServletContextHandler@70db01{/solr,null,AVAILABLE}
   [junit4]   2> 2392348 INFO  (jetty-launcher-4087-thread-1) [    ] o.a.s.c.SolrResourceLoader new SolrResourceLoader for directory: 'C:\Users\jenkins\workspace\Lucene-Solr-master-Windows\solr\build\solr-core\test\J0\temp\solr.schema.TestManagedSchemaAPI_94CB460BC30867F-001\tempDir-001\node2'
   [junit4]   2> 2392348 INFO  (jetty-launcher-4087-thread-1) [    ] o.a.s.c.SolrResourceLoader JNDI not configured for solr (NoInitialContextEx)
   [junit4]   2> 2392348 INFO  (jetty-launcher-4087-thread-1) [    ] o.a.s.c.SolrResourceLoader solr home defaulted to 'solr/' (could not find system property or JNDI)
   [junit4]   2> 2392349 INFO  (jetty-launcher-4087-thread-2) [    ] o.e.j.s.ServerConnector Started ServerConnector@98bd5a{HTTP/1.1,[http/1.1]}{127.0.0.1:59331}
   [junit4]   2> 2392349 INFO  (jetty-launcher-4087-thread-2) [    ] o.e.j.s.Server Started @2401585ms
   [junit4]   2> 2392349 INFO  (jetty-launcher-4087-thread-2) [    ] o.a.s.c.s.e.JettySolrRunner Jetty properties: {hostContext=/solr, hostPort=59331}
   [junit4]   2> 2392349 INFO  (jetty-launcher-4087-thread-2) [    ] o.a.s.s.SolrDispatchFilter SolrDispatchFilter.init(): sun.misc.Launcher$AppClassLoader@1d16e93
   [junit4]   2> 2392349 INFO  (jetty-launcher-4087-thread-1) [    ] o.a.s.c.c.SolrZkClient Using default ZkCredentialsProvider
   [junit4]   2> 2392349 INFO  (jetty-launcher-4087-thread-2) [    ] o.a.s.c.SolrResourceLoader new SolrResourceLoader for directory: 'C:\Users\jenkins\workspace\Lucene-Solr-master-Windows\solr\build\solr-core\test\J0\temp\solr.schema.TestManagedSchemaAPI_94CB460BC30867F-001\tempDir-001\node1'
   [junit4]   2> 2392349 INFO  (jetty-launcher-4087-thread-2) [    ] o.a.s.c.SolrResourceLoader JNDI not configured for solr (NoInitialContextEx)
   [junit4]   2> 2392349 INFO  (jetty-launcher-4087-thread-2) [    ] o.a.s.c.SolrResourceLoader solr home defaulted to 'solr/' (could not find system property or JNDI)
   [junit4]   2> 2392350 INFO  (jetty-launcher-4087-thread-1) [    ] o.a.s.c.c.ConnectionManager Waiting for client to connect to ZooKeeper
   [junit4]   2> 2392350 INFO  (jetty-launcher-4087-thread-2) [    ] o.a.s.c.c.SolrZkClient Using default ZkCredentialsProvider
   [junit4]   2> 2392351 INFO  (jetty-launcher-4087-thread-2) [    ] o.a.s.c.c.ConnectionManager Waiting for client to connect to ZooKeeper
   [junit4]   2> 2392382 INFO  (zkCallback-4090-thread-1) [    ] o.a.s.c.c.ConnectionManager Watcher org.apache.solr.common.cloud.ConnectionManager@76bd0c name:ZooKeeperConnection Watcher:127.0.0.1:59324/solr got event WatchedEvent state:SyncConnected type:None path:null path:null type:None
   [junit4]   2> 2392383 INFO  (jetty-launcher-4087-thread-2) [    ] o.a.s.c.c.ConnectionManager Client is connected to ZooKeeper
   [junit4]   2> 2392383 INFO  (zkCallback-4089-thread-1) [    ] o.a.s.c.c.ConnectionManager Watcher org.apache.solr.common.cloud.ConnectionManager@1987a8a name:ZooKeeperConnection Watcher:127.0.0.1:59324/solr got event WatchedEvent state:SyncConnected type:None path:null path:null type:None
   [junit4]   2> 2392383 INFO  (jetty-launcher-4087-thread-1) [    ] o.a.s.c.c.ConnectionManager Client is connected to ZooKeeper
   [junit4]   2> 2392383 INFO  (jetty-launcher-4087-thread-2) [    ] o.a.s.c.c.SolrZkClient Using default ZkACLProvider
   [junit4]   2> 2392383 INFO  (jetty-launcher-4087-thread-1) [    ] o.a.s.c.c.SolrZkClient Using default ZkACLProvider
   [junit4]   2> 2392384 INFO  (jetty-launcher-4087-thread-2) [    ] o.a.s.s.SolrDispatchFilter solr.xml found in ZooKeeper. Loading...
   [junit4]   2> 2392384 INFO  (jetty-launcher-4087-thread-1) [    ] o.a.s.s.SolrDispatchFilter solr.xml found in ZooKeeper. Loading...
   [junit4]   2> 2392399 INFO  (jetty-launcher-4087-thread-2) [    ] o.a.s.c.CorePropertiesLocator Config-defined core root directory: C:\Users\jenkins\workspace\Lucene-Solr-master-Windows\solr\build\solr-core\test\J0\temp\solr.schema.TestManagedSchemaAPI_94CB460BC30867F-001\tempDir-001\node1\.
   [junit4]   2> 2392400 INFO  (jetty-launcher-4087-thread-2) [    ] o.a.s.c.CoreContainer New CoreContainer 21008821
   [junit4]   2> 2392400 INFO  (jetty-launcher-4087-thread-2) [    ] o.a.s.c.CoreContainer Loading cores into CoreContainer [instanceDir=C:\Users\jenkins\workspace\Lucene-Solr-master-Windows\solr\build\solr-core\test\J0\temp\solr.schema.TestManagedSchemaAPI_94CB460BC30867F-001\tempDir-001\node1]
   [junit4]   2> 2392400 WARN  (jetty-launcher-4087-thread-2) [    ] o.a.s.c.CoreContainer Couldn't add files from C:\Users\jenkins\workspace\Lucene-Solr-master-Windows\solr\build\solr-core\test\J0\temp\solr.schema.TestManagedSchemaAPI_94CB460BC30867F-001\tempDir-001\node1\lib to classpath: C:\Users\jenkins\workspace\Lucene-Solr-master-Windows\solr\build\solr-core\test\J0\temp\solr.schema.TestManagedSchemaAPI_94CB460BC30867F-001\tempDir-001\node1\lib
   [junit4]   2> 2392400 INFO  (jetty-launcher-4087-thread-2) [    ] o.a.s.h.c.HttpShardHandlerFactory created with socketTimeout : 90000,urlScheme : ,connTimeout : 15000,maxConnectionsPerHost : 20,maxConnections : 10000,corePoolSize : 0,maximumPoolSize : 2147483647,maxThreadIdleTime : 5,sizeOfQueue : -1,fairnessPolicy : false,
   [junit4]   2> 2392405 INFO  (jetty-launcher-4087-thread-2) [    ] o.a.s.u.UpdateShardHandler Creating UpdateShardHandler HTTP client with params: 
   [junit4]   2> 2392407 INFO  (jetty-launcher-4087-thread-2) [    ] o.a.s.l.LogWatcher SLF4J impl is org.slf4j.impl.Log4jLoggerFactory
   [junit4]   2> 2392408 INFO  (jetty-launcher-4087-thread-2) [    ] o.a.s.l.LogWatcher Registering Log Listener [Log4j (org.slf4j.impl.Log4jLoggerFactory)]
   [junit4]   2> 2392408 INFO  (jetty-launcher-4087-thread-2) [    ] o.a.s.c.ZkContainer Zookeeper client=127.0.0.1:59324/solr
   [junit4]   2> 2392408 INFO  (jetty-launcher-4087-thread-2) [    ] o.a.s.c.ZkController zkHost includes chroot
   [junit4]   2> 2392408 INFO  (jetty-launcher-4087-thread-2) [    ] o.a.s.c.c.SolrZkClient Using default ZkCredentialsProvider
   [junit4]   2> 2392409 INFO  (jetty-launcher-4087-thread-2) [    ] o.a.s.c.c.ConnectionManager Waiting for client to connect to ZooKeeper
   [junit4]   2> 2392425 INFO  (jetty-launcher-4087-thread-1) [    ] o.a.s.c.CorePropertiesLocator Config-defined core root directory: C:\Users\jenkins\workspace\Lucene-Solr-master-Windows\solr\build\solr-core\test\J0\temp\solr.schema.TestManagedSchemaAPI_94CB460BC30867F-001\tempDir-001\node2\.
   [junit4]   2> 2392425 INFO  (jetty-launcher-4087-thread-1) [    ] o.a.s.c.CoreContainer New CoreContainer 7511176
   [junit4]   2> 2392425 INFO  (jetty-launcher-4087-thread-1) [    ] o.a.s.c.CoreContainer Loading cores into CoreContainer [instanceDir=C:\Users\jenkins\workspace\Lucene-Solr-master-Windows\solr\build\solr-core\test\J0\temp\solr.schema.TestManagedSchemaAPI_94CB460BC30867F-001\tempDir-001\node2]
   [junit4]   2> 2392425 WARN  (jetty-launcher-4087-thread-1) [    ] o.a.s.c.CoreContainer Couldn't add files from C:\Users\jenkins\workspace\Lucene-Solr-master-Windows\solr\build\solr-core\test\J0\temp\solr.schema.TestManagedSchemaAPI_94CB460BC30867F-001\tempDir-001\node2\lib to classpath: C:\Users\jenkins\workspace\Lucene-Solr-master-Windows\solr\build\solr-core\test\J0\temp\solr.schema.TestManagedSchemaAPI_94CB460BC30867F-001\tempDir-001\node2\lib
   [junit4]   2> 2392426 INFO  (jetty-launcher-4087-thread-1) [    ] o.a.s.h.c.HttpShardHandlerFactory created with socketTimeout : 90000,urlScheme : ,connTimeout : 15000,maxConnectionsPerHost : 20,maxConnections : 10000,corePoolSize : 0,maximumPoolSize : 2147483647,maxThreadIdleTime : 5,sizeOfQueue : -1,fairnessPolicy : false,
   [junit4]   2> 2392428 INFO  (jetty-launcher-4087-thread-1) [    ] o.a.s.u.UpdateShardHandler Creating UpdateShardHandler HTTP client with params: 
   [junit4]   2> 2392428 INFO  (zkCallback-4093-thread-1) [    ] o.a.s.c.c.ConnectionManager Watcher org.apache.solr.common.cloud.ConnectionManager@1ea067f name:ZooKeeperConnection Watcher:127.0.0.1:59324 got event WatchedEvent state:SyncConnected type:None path:null path:null type:None
   [junit4]   2> 2392429 INFO  (jetty-launcher-4087-thread-2) [    ] o.a.s.c.c.ConnectionManager Client is connected to ZooKeeper
   [junit4]   2> 2392429 INFO  (jetty-launcher-4087-thread-2) [    ] o.a.s.c.c.SolrZkClient Using default ZkACLProvider
   [junit4]   2> 2392430 INFO  (jetty-launcher-4087-thread-1) [    ] o.a.s.l.LogWatcher SLF4J impl is org.slf4j.impl.Log4jLoggerFactory
   [junit4]   2> 2392430 INFO  (jetty-launcher-4087-thread-1) [    ] o.a.s.l.LogWatcher Registering Log Listener [Log4j (org.slf4j.impl.Log4jLoggerFactory)]
   [junit4]   2> 2392430 INFO  (jetty-launcher-4087-thread-1) [    ] o.a.s.c.ZkContainer Zookeeper client=127.0.0.1:59324/solr
   [junit4]   2> 2392430 INFO  (jetty-launcher-4087-thread-1) [    ] o.a.s.c.ZkController zkHost includes chroot
   [junit4]   2> 2392430 INFO  (jetty-launcher-4087-thread-1) [    ] o.a.s.c.c.SolrZkClient Using default ZkCredentialsProvider
   [junit4]   2> 2392430 WARN  (NIOServerCxn.Factory:0.0.0.0/0.0.0.0:0) [    ] o.a.z.s.NIOServerCnxn caught end of stream exception
   [junit4]   2> EndOfStreamException: Unable to read additional data from client sessionid 0x15518f867a10003, likely client has closed socket
   [junit4]   2> 	at org.apache.zookeeper.server.NIOServerCnxn.doIO(NIOServerCnxn.java:228)
   [junit4]   2> 	at org.apache.zookeeper.server.NIOServerCnxnFactory.run(NIOServerCnxnFactory.java:208)
   [junit4]   2> 	at java.lang.Thread.run(Thread.java:745)
   [junit4]   2> 2392431 INFO  (jetty-launcher-4087-thread-2) [n:127.0.0.1:59331_solr    ] o.a.s.c.ZkController Added new OnReconnect listener org.apache.solr.cloud.ZkController$$Lambda$12/17411291@5e254a
   [junit4]   2> 2392433 INFO  (jetty-launcher-4087-thread-2) [n:127.0.0.1:59331_solr    ] o.a.s.c.c.ConnectionManager Waiting for client to connect to ZooKeeper
   [junit4]   2> 2392433 INFO  (jetty-launcher-4087-thread-1) [    ] o.a.s.c.c.ConnectionManager Waiting for client to connect to ZooKeeper
   [junit4]   2> 2392435 INFO  (zkCallback-4096-thread-1) [    ] o.a.s.c.c.ConnectionManager Watcher org.apache.solr.common.cloud.ConnectionManager@13f5286 name:ZooKeeperConnection Watcher:127.0.0.1:59324 got event WatchedEvent state:SyncConnected type:None path:null path:null type:None
   [junit4]   2> 2392435 INFO  (jetty-launcher-4087-thread-1) [    ] o.a.s.c.c.ConnectionManager Client is connected to ZooKeeper
   [junit4]   2> 2392435 INFO  (zkCallback-4097-thread-1-processing-n:127.0.0.1:59331_solr) [n:127.0.0.1:59331_solr    ] o.a.s.c.c.ConnectionManager Watcher org.apache.solr.common.cloud.ConnectionManager@71a91e name:ZooKeeperConnection Watcher:127.0.0.1:59324/solr got event WatchedEvent state:SyncConnected type:None path:null path:null type:None
   [junit4]   2> 2392435 INFO  (jetty-launcher-4087-thread-1) [    ] o.a.s.c.c.SolrZkClient Using default ZkACLProvider
   [junit4]   2> 2392435 INFO  (jetty-launcher-4087-thread-2) [n:127.0.0.1:59331_solr    ] o.a.s.c.c.ConnectionManager Client is connected to ZooKeeper
   [junit4]   2> 2392436 INFO  (jetty-launcher-4087-thread-2) [n:127.0.0.1:59331_solr    ] o.a.s.c.c.SolrZkClient makePath: /overseer/queue
   [junit4]   2> 2392438 INFO  (jetty-launcher-4087-thread-1) [n:127.0.0.1:59328_solr    ] o.a.s.c.ZkController Added new OnReconnect listener org.apache.solr.cloud.ZkController$$Lambda$12/17411291@1f6a1de
   [junit4]   2> 2392439 INFO  (jetty-launcher-4087-thread-1) [n:127.0.0.1:59328_solr    ] o.a.s.c.c.ConnectionManager Waiting for client to connect to ZooKeeper
   [junit4]   2> 2392449 INFO  (jetty-launcher-4087-thread-2) [n:127.0.0.1:59331_solr    ] o.a.s.c.c.SolrZkClient makePath: /overseer/collection-queue-work
   [junit4]   2> 2392474 INFO  (zkCallback-4098-thread-1-processing-n:127.0.0.1:59328_solr) [n:127.0.0.1:59328_solr    ] o.a.s.c.c.ConnectionManager Watcher org.apache.solr.common.cloud.ConnectionManager@129cb33 name:ZooKeeperConnection Watcher:127.0.0.1:59324/solr got event WatchedEvent state:SyncConnected type:None path:null path:null type:None
   [junit4]   2> 2392474 INFO  (jetty-launcher-4087-thread-1) [n:127.0.0.1:59328_solr    ] o.a.s.c.c.ConnectionManager Client is connected to ZooKeeper
   [junit4]   2> 2392476 INFO  (jetty-launcher-4087-thread-2) [n:127.0.0.1:59331_solr    ] o.a.s.c.c.SolrZkClient makePath: /overseer/collection-map-running
   [junit4]   2> 2392477 INFO  (jetty-launcher-4087-thread-2) [n:127.0.0.1:59331_solr    ] o.a.s.c.c.SolrZkClient makePath: /overseer/collection-map-completed
   [junit4]   2> 2392479 INFO  (jetty-launcher-4087-thread-2) [n:127.0.0.1:59331_solr    ] o.a.s.c.c.SolrZkClient makePath: /overseer/collection-map-failure
   [junit4]   2> 2392481 INFO  (jetty-launcher-4087-thread-2) [n:127.0.0.1:59331_solr    ] o.a.s.c.c.SolrZkClient makePath: /live_nodes
   [junit4]   2> 2392481 INFO  (jetty-launcher-4087-thread-2) [n:127.0.0.1:59331_solr    ] o.a.s.c.c.SolrZkClient makePath: /collections
   [junit4]   2> 2392482 INFO  (jetty-launcher-4087-thread-1) [n:127.0.0.1:59328_solr    ] o.a.s.c.c.SolrZkClient makePath: /collections
   [junit4]   2> 2392483 INFO  (jetty-launcher-4087-thread-2) [n:127.0.0.1:59331_solr    ] o.a.s.c.c.SolrZkClient makePath: /aliases.json
   [junit4]   2> 2392484 INFO  (jetty-launcher-4087-thread-1) [n:127.0.0.1:59328_solr    ] o.a.s.c.c.SolrZkClient makePath: /aliases.json
   [junit4]   2> 2392485 INFO  (jetty-launcher-4087-thread-1) [n:127.0.0.1:59328_solr    ] o.a.s.c.c.SolrZkClient makePath: /clusterstate.json
   [junit4]   2> 2392485 INFO  (jetty-launcher-4087-thread-2) [n:127.0.0.1:59331_solr    ] o.a.s.c.c.SolrZkClient makePath: /clusterstate.json
   [junit4]   2> 2392486 INFO  (jetty-launcher-4087-thread-2) [n:127.0.0.1:59331_solr    ] o.a.s.c.c.SolrZkClient makePath: /security.json
   [junit4]   2> 2392494 INFO  (jetty-launcher-4087-thread-1) [n:127.0.0.1:59328_solr    ] o.a.s.c.c.SolrZkClient makePath: /security.json
   [junit4]   2> 2392508 INFO  (jetty-launcher-4087-thread-2) [n:127.0.0.1:59331_solr    ] o.a.s.c.c.ZkStateReader Updating cluster state from ZooKeeper... 
   [junit4]   2> 2392513 INFO  (jetty-launcher-4087-thread-1) [n:127.0.0.1:59328_solr    ] o.a.s.c.c.ZkStateReader Updating cluster state from ZooKeeper... 
   [junit4]   2> 2392520 INFO  (jetty-launcher-4087-thread-2) [n:127.0.0.1:59331_solr    ] o.a.s.c.c.ZkStateReader Loaded empty cluster properties
   [junit4]   2> 2392521 INFO  (jetty-launcher-4087-thread-1) [n:127.0.0.1:59328_solr    ] o.a.s.c.c.ZkStateReader Loaded empty cluster properties
   [junit4]   2> 2392522 INFO  (jetty-launcher-4087-thread-2) [n:127.0.0.1:59331_solr    ] o.a.s.c.c.ZkStateReader Updated live nodes from ZooKeeper... (0) -> (0)
   [junit4]   2> 2392522 INFO  (jetty-launcher-4087-thread-1) [n:127.0.0.1:59328_solr    ] o.a.s.c.c.ZkStateReader Updated live nodes from ZooKeeper... (0) -> (0)
   [junit4]   2> 2392524 INFO  (jetty-launcher-4087-thread-2) [n:127.0.0.1:59331_solr    ] o.a.s.c.c.SolrZkClient makePath: /overseer_elect
   [junit4]   2> 2392525 INFO  (jetty-launcher-4087-thread-1) [n:127.0.0.1:59328_solr    ] o.a.s.c.c.SolrZkClient makePath: /overseer_elect
   [junit4]   2> 2392526 INFO

[...truncated too long message...]

dCollectionResource, TestCollationFieldDocValues, AsyncMigrateRouteKeyTest, SimpleCollectionCreateDeleteTest, TestSortingResponseWriter, HardAutoCommitTest, TestDistributedSearch, TestFaceting, TestBulkSchemaAPI, TestMiniSolrCloudClusterBase, TestSubQueryTransformer, SchemaVersionSpecificBehaviorTest, TestPerFieldSimilarityWithDefaultOverride, TestFunctionQuery, TestConfigSetsAPIExclusivity, TestDFRSimilarityFactory, DistributedExpandComponentTest, AtomicUpdatesTest, SolrRequestParserTest, TestRequestStatusCollectionAPI, HighlighterTest, TestSolrFieldCacheMBean, CircularListTest, TestNoOpRegenerator, HttpPartitionTest, TimeZoneUtilsTest, TestSurroundQueryParser, TestCSVLoader, SuggesterFSTTest, HLLSerializationTest, DisMaxRequestHandlerTest, DOMUtilTest, TestGraphMLResponseWriter, CurrencyFieldXmlFileTest, TestMergePolicyConfig, WrapperMergePolicyFactoryTest, TestComponentsName, TestSolrDeletionPolicy1, TestTrackingShardHandlerFactory, TestLazyCores, TestXIncludeConfig, TestConfigReload, OverseerCollectionConfigSetProcessorTest, TestSolrQueryParserResource, TestElisionMultitermQuery, TestSolrDynamicMBean, TestSubQueryTransformerDistrib, TestDFISimilarityFactory, TestTolerantUpdateProcessorRandomCloud, JsonLoaderTest, TestCustomDocTransformer, TestDynamicLoading, TestPostingsSolrHighlighter, TestMinMaxOnMultiValuedField, TestFieldTypeCollectionResource, ZkControllerTest, DistributedSuggestComponentTest, DistribCursorPagingTest, ReplicationFactorTest, DeleteShardTest, TestFieldCacheSortRandom, TestJmxIntegration, ReturnFieldsTest, IndexBasedSpellCheckerTest, MigrateRouteKeyTest, HdfsRecoverLeaseTest, SuggestComponentTest, ClusterStateUpdateTest, TestJsonRequest, OverseerStatusTest, TestPhraseSuggestions, DeleteLastCustomShardedReplicaTest, TestReqParamsAPI, DistributedFacetPivotLongTailTest, DocValuesMultiTest, BasicDistributedZkTest, BasicDistributedZk2Test, CollectionsAPIDistributedZkTest, TestRandomFaceting, LeaderElectionTest, TestRecovery, DistributedSpellCheckComponentTest, TestRealTimeGet, TestStressReorder, TestReload, TestRangeQuery, TestCoreContainer, SimpleFacetsTest, TestSolr4Spatial, QueryElevationComponentTest, ConvertedLegacyTest, TestSort, TestFiltering, TestBadConfig, CurrencyFieldOpenExchangeTest, SimplePostToolTest, TestCoreDiscovery, AnalysisAfterCoreReloadTest, TestExtendedDismaxParser, SpellCheckCollatorTest, SuggesterWFSTTest, PolyFieldTest, NoCacheHeaderTest, WordBreakSolrSpellCheckerTest, SolrCoreCheckLockOnStartupTest, TestPseudoReturnFields, TestUpdate, FieldMutatingUpdateProcessorTest, TestAtomicUpdateErrorCases, QueryEqualityTest, TestRemoteStreaming, XsltUpdateRequestHandlerTest, TestWriterPerf, TestQueryTypes, TestOmitPositions, PathHierarchyTokenizerFactoryTest, TermVectorComponentTest, RequiredFieldsTest, TestCollationField, JSONWriterTest, TestAnalyzedSuggestions, TestPartialUpdateDeduplication, TestPHPSerializedResponseWriter, TestLFUCache, CopyFieldTest, SolrIndexConfigTest, NumericFieldsTest, TestConfig, TestSolrCoreProperties, TestLuceneMatchVersion, TestCodecSupport, TestJmxMonitoredMap, PluginInfoTest, TestFastLRUCache, DateMathParserTest, ChaosMonkeyNothingIsSafeTest, TestEmbeddedSolrServerConstructors, AliasIntegrationTest, CleanupOldIndexTest, CollectionStateFormat2Test, CollectionTooManyReplicasTest, DeleteStatusTest, DistribJoinFromCollectionTest, OutOfBoxZkACLAndCredentialsProvidersTest, OverseerRolesTest, RestartWhileUpdatingTest, SSLMigrationTest, SaslZkACLProviderTest, SharedFSAutoReplicaFailoverTest, SolrCloudExampleTest, TestCloudBackupRestore, TestCloudDeleteByQuery, TestCryptoKeys, TestDistribDocBasedVersion, TestDownShardTolerantSearch, TestLeaderInitiatedRecoveryThread, TestRandomRequestDistribution, TestReplicaProperties, TestStressCloudBlindAtomicUpdates, TriLevelCompositeIdRoutingTest, VMParamsZkACLAndCredentialsProvidersTest, HdfsThreadLeakTest, HdfsWriteToMultipleCollectionsTest, StressHdfsTest, ZkStateReaderTest, BlobRepositoryCloudTest, CachingDirectoryFactoryTest, DirectoryFactoryTest, HdfsDirectoryFactoryTest, QueryResultKeyTest, TestInfoStreamLogging, TestInitParams, TestNRTOpen, TestReloadAndDeleteDocs, TestShardHandlerFactory, TestSolrXml, TestSQLHandler, TestSolrConfigHandlerCloud, CoreAdminCreateDiscoverTest, CoreAdminRequestStatusTest, SegmentsInfoRequestHandlerTest, DistributedDebugComponentTest, DistributedFacetPivotLargeTest, DistributedFacetPivotSmallTest, SpatialHeatmapFacetsTest, TestManagedSchema, TestManagedSchemaAPI]
   [junit4]   2> NOTE: reproduce with: ant test  -Dtestcase=TestManagedSchemaAPI -Dtests.seed=94CB460BC30867F -Dtests.slow=true -Dtests.locale=ja-JP -Dtests.timezone=Europe/Helsinki -Dtests.asserts=true -Dtests.file.encoding=Cp1252
   [junit4] ERROR   0.00s J0 | TestManagedSchemaAPI (suite) <<<
   [junit4]    > Throwable #1: java.lang.AssertionError: ObjectTracker found 8 object(s) that were not released!!! [MDCAwareThreadPoolExecutor, MockDirectoryWrapper, TransactionLog, TransactionLog, MockDirectoryWrapper, MockDirectoryWrapper, MockDirectoryWrapper, MDCAwareThreadPoolExecutor]
   [junit4]    > 	at __randomizedtesting.SeedInfo.seed([94CB460BC30867F]:0)
   [junit4]    > 	at org.apache.solr.SolrTestCaseJ4.teardownTestCases(SolrTestCaseJ4.java:256)
   [junit4]    > 	at java.lang.Thread.run(Thread.java:745)Throwable #2: java.io.IOException: Could not remove the following files (in the order of attempts):
   [junit4]    >    C:\Users\jenkins\workspace\Lucene-Solr-master-Windows\solr\build\solr-core\test\J0\temp\solr.schema.TestManagedSchemaAPI_94CB460BC30867F-001\tempDir-001\node1\testschemaapi_shard1_replica1\data\tlog\tlog.0000000000000000000: java.nio.file.FileSystemException: C:\Users\jenkins\workspace\Lucene-Solr-master-Windows\solr\build\solr-core\test\J0\temp\solr.schema.TestManagedSchemaAPI_94CB460BC30867F-001\tempDir-001\node1\testschemaapi_shard1_replica1\data\tlog\tlog.0000000000000000000: The process cannot access the file because it is being used by another process.
   [junit4]    >    C:\Users\jenkins\workspace\Lucene-Solr-master-Windows\solr\build\solr-core\test\J0\temp\solr.schema.TestManagedSchemaAPI_94CB460BC30867F-001\tempDir-001\node1\testschemaapi_shard1_replica1\data\tlog: java.nio.file.DirectoryNotEmptyException: C:\Users\jenkins\workspace\Lucene-Solr-master-Windows\solr\build\solr-core\test\J0\temp\solr.schema.TestManagedSchemaAPI_94CB460BC30867F-001\tempDir-001\node1\testschemaapi_shard1_replica1\data\tlog
   [junit4]    >    C:\Users\jenkins\workspace\Lucene-Solr-master-Windows\solr\build\solr-core\test\J0\temp\solr.schema.TestManagedSchemaAPI_94CB460BC30867F-001\tempDir-001\node1\testschemaapi_shard1_replica1\data: java.nio.file.DirectoryNotEmptyException: C:\Users\jenkins\workspace\Lucene-Solr-master-Windows\solr\build\solr-core\test\J0\temp\solr.schema.TestManagedSchemaAPI_94CB460BC30867F-001\tempDir-001\node1\testschemaapi_shard1_replica1\data
   [junit4]    >    C:\Users\jenkins\workspace\Lucene-Solr-master-Windows\solr\build\solr-core\test\J0\temp\solr.schema.TestManagedSchemaAPI_94CB460BC30867F-001\tempDir-001\node1\testschemaapi_shard1_replica1: java.nio.file.DirectoryNotEmptyException: C:\Users\jenkins\workspace\Lucene-Solr-master-Windows\solr\build\solr-core\test\J0\temp\solr.schema.TestManagedSchemaAPI_94CB460BC30867F-001\tempDir-001\node1\testschemaapi_shard1_replica1
   [junit4]    >    C:\Users\jenkins\workspace\Lucene-Solr-master-Windows\solr\build\solr-core\test\J0\temp\solr.schema.TestManagedSchemaAPI_94CB460BC30867F-001\tempDir-001\node1: java.nio.file.DirectoryNotEmptyException: C:\Users\jenkins\workspace\Lucene-Solr-master-Windows\solr\build\solr-core\test\J0\temp\solr.schema.TestManagedSchemaAPI_94CB460BC30867F-001\tempDir-001\node1
   [junit4]    >    C:\Users\jenkins\workspace\Lucene-Solr-master-Windows\solr\build\solr-core\test\J0\temp\solr.schema.TestManagedSchemaAPI_94CB460BC30867F-001\tempDir-001: java.nio.file.DirectoryNotEmptyException: C:\Users\jenkins\workspace\Lucene-Solr-master-Windows\solr\build\solr-core\test\J0\temp\solr.schema.TestManagedSchemaAPI_94CB460BC30867F-001\tempDir-001
   [junit4]    >    C:\Users\jenkins\workspace\Lucene-Solr-master-Windows\solr\build\solr-core\test\J0\temp\solr.schema.TestManagedSchemaAPI_94CB460BC30867F-001: java.nio.file.DirectoryNotEmptyException: C:\Users\jenkins\workspace\Lucene-Solr-master-Windows\solr\build\solr-core\test\J0\temp\solr.schema.TestManagedSchemaAPI_94CB460BC30867F-001
   [junit4]    > 	at org.apache.lucene.util.IOUtils.rm(IOUtils.java:323)
   [junit4]    > 	at java.lang.Thread.run(Thread.java:745)
   [junit4] Completed [549/612 (2!)] on J0 in 13.64s, 1 test, 1 failure, 1 error <<< FAILURES!

[...truncated 217 lines...]
BUILD FAILED
C:\Users\jenkins\workspace\Lucene-Solr-master-Windows\build.xml:740: The following error occurred while executing this line:
C:\Users\jenkins\workspace\Lucene-Solr-master-Windows\build.xml:684: The following error occurred while executing this line:
C:\Users\jenkins\workspace\Lucene-Solr-master-Windows\build.xml:59: The following error occurred while executing this line:
C:\Users\jenkins\workspace\Lucene-Solr-master-Windows\solr\build.xml:233: The following error occurred while executing this line:
C:\Users\jenkins\workspace\Lucene-Solr-master-Windows\solr\common-build.xml:531: The following error occurred while executing this line:
C:\Users\jenkins\workspace\Lucene-Solr-master-Windows\lucene\common-build.xml:1427: The following error occurred while executing this line:
C:\Users\jenkins\workspace\Lucene-Solr-master-Windows\lucene\common-build.xml:984: There were test failures: 612 suites (10 ignored), 2560 tests, 2 suite-level errors, 1 error, 126 ignored (82 assumptions) [seed: 94CB460BC30867F]

Total time: 64 minutes 28 seconds
Build step 'Invoke Ant' marked build as failure
Archiving artifacts
[WARNINGS] Skipping publisher since build result is FAILURE
Recording test results
Email was triggered for: Failure - Any
Sending email for trigger: Failure - Any