You are viewing a plain text version of this content. The canonical link for it is here.
Posted to builds@beam.apache.org by Apache Jenkins Server <je...@builds.apache.org> on 2022/02/13 18:18:17 UTC
Build failed in Jenkins: beam_PostCommit_XVR_PythonUsingJava_Dataflow #74
See <https://ci-beam.apache.org/job/beam_PostCommit_XVR_PythonUsingJava_Dataflow/74/display/redirect>
Changes:
------------------------------------------
[...truncated 54.58 KB...]
Using cached botocore-1.23.54-py3-none-any.whl (8.5 MB)
Collecting cffi>=1.12
Using cached cffi-1.15.0-cp36-cp36m-manylinux_2_5_x86_64.manylinux1_x86_64.whl (405 kB)
Collecting fasteners>=0.14
Using cached fasteners-0.17.3-py3-none-any.whl (18 kB)
Collecting rsa<5,>=3.1.4
Using cached rsa-4.8-py3-none-any.whl (39 kB)
Collecting pyasn1-modules>=0.2.1
Using cached pyasn1_modules-0.2.8-py2.py3-none-any.whl (155 kB)
Requirement already satisfied: packaging>=14.3 in <https://ci-beam.apache.org/job/beam_PostCommit_XVR_PythonUsingJava_Dataflow/ws/src/build/gradleenv/1922375555/lib/python3.6/site-packages> (from google-cloud-bigquery<3,>=1.6.0->apache-beam==2.38.0.dev0) (21.3)
Collecting google-resumable-media<3.0dev,>=0.6.0
Using cached google_resumable_media-2.2.1-py2.py3-none-any.whl (75 kB)
Collecting google-api-core[grpc]<3.0.0dev,>=1.29.0
Using cached google_api_core-2.5.0-py2.py3-none-any.whl (111 kB)
Collecting libcst>=0.2.5
Using cached libcst-0.4.1-cp36-cp36m-manylinux_2_17_x86_64.manylinux2014_x86_64.whl (2.7 MB)
Collecting grpc-google-iam-v1<0.13dev,>=0.12.3
Using cached grpc_google_iam_v1-0.12.3-py3-none-any.whl
Collecting google-api-core[grpc]<3.0.0dev,>=1.29.0
Using cached google_api_core-1.31.5-py2.py3-none-any.whl (93 kB)
Collecting google-auth<3,>=1.18.0
Using cached google_auth-1.35.0-py2.py3-none-any.whl (152 kB)
Requirement already satisfied: setuptools>=40.3.0 in <https://ci-beam.apache.org/job/beam_PostCommit_XVR_PythonUsingJava_Dataflow/ws/src/build/gradleenv/1922375555/lib/python3.6/site-packages> (from google-auth<3,>=1.18.0->apache-beam==2.38.0.dev0) (59.6.0)
Collecting grpcio-status>=1.18.0
Using cached grpcio_status-1.43.0-py3-none-any.whl (10.0 kB)
Collecting overrides<7.0.0,>=6.0.1
Using cached overrides-6.1.0-py3-none-any.whl (14 kB)
Collecting docopt
Using cached docopt-0.6.2-py2.py3-none-any.whl
Collecting pyparsing<3,>=2.4.2
Using cached pyparsing-2.4.7-py2.py3-none-any.whl (67 kB)
Collecting pbr>=0.11
Using cached pbr-5.8.1-py2.py3-none-any.whl (113 kB)
Collecting pyasn1>=0.1.7
Using cached pyasn1-0.4.8-py2.py3-none-any.whl (77 kB)
Requirement already satisfied: py>=1.5.0 in <https://ci-beam.apache.org/job/beam_PostCommit_XVR_PythonUsingJava_Dataflow/ws/src/build/gradleenv/1922375555/lib/python3.6/site-packages> (from pytest<5.0,>=4.4.0->apache-beam==2.38.0.dev0) (1.11.0)
Collecting wcwidth
Using cached wcwidth-0.2.5-py2.py3-none-any.whl (30 kB)
Collecting atomicwrites>=1.0
Using cached atomicwrites-1.4.0-py2.py3-none-any.whl (6.8 kB)
Collecting pluggy<1.0,>=0.12
Using cached pluggy-0.13.1-py2.py3-none-any.whl (18 kB)
Requirement already satisfied: importlib-metadata>=0.12 in <https://ci-beam.apache.org/job/beam_PostCommit_XVR_PythonUsingJava_Dataflow/ws/src/build/gradleenv/1922375555/lib/python3.6/site-packages> (from pytest<5.0,>=4.4.0->apache-beam==2.38.0.dev0) (2.1.3)
Collecting more-itertools>=4.0.0
Using cached more_itertools-8.12.0-py3-none-any.whl (54 kB)
Collecting attrs>=17.4.0
Using cached attrs-21.4.0-py2.py3-none-any.whl (60 kB)
Collecting execnet>=1.1
Using cached execnet-1.9.0-py2.py3-none-any.whl (39 kB)
Collecting pytest-forked
Using cached pytest_forked-1.4.0-py3-none-any.whl (4.9 kB)
Collecting charset-normalizer~=2.0.0
Using cached charset_normalizer-2.0.12-py3-none-any.whl (39 kB)
Collecting urllib3<1.27,>=1.21.1
Using cached urllib3-1.26.8-py2.py3-none-any.whl (138 kB)
Collecting certifi>=2017.4.17
Using cached certifi-2021.10.8-py2.py3-none-any.whl (149 kB)
Collecting idna<4,>=2.5
Using cached idna-3.3-py3-none-any.whl (61 kB)
Collecting greenlet!=0.4.17
Using cached greenlet-1.1.2-cp36-cp36m-manylinux_2_17_x86_64.manylinux2014_x86_64.whl (147 kB)
Collecting docker
Using cached docker-5.0.3-py2.py3-none-any.whl (146 kB)
Collecting deprecation
Using cached deprecation-2.1.0-py2.py3-none-any.whl (11 kB)
Collecting wrapt
Using cached wrapt-1.13.3-cp36-cp36m-manylinux_2_5_x86_64.manylinux1_x86_64.manylinux_2_12_x86_64.manylinux2010_x86_64.whl (78 kB)
Collecting pymysql
Using cached PyMySQL-1.0.2-py3-none-any.whl (43 kB)
Collecting pycparser
Using cached pycparser-2.21-py2.py3-none-any.whl (118 kB)
Collecting googleapis-common-protos<2.0dev,>=1.6.0
Using cached googleapis_common_protos-1.54.0-py2.py3-none-any.whl (207 kB)
Collecting google-crc32c<2.0dev,>=1.0
Using cached google_crc32c-1.3.0-cp36-cp36m-manylinux_2_12_x86_64.manylinux2010_x86_64.whl (37 kB)
Requirement already satisfied: zipp>=0.5 in <https://ci-beam.apache.org/job/beam_PostCommit_XVR_PythonUsingJava_Dataflow/ws/src/build/gradleenv/1922375555/lib/python3.6/site-packages> (from importlib-metadata>=0.12->pytest<5.0,>=4.4.0->apache-beam==2.38.0.dev0) (3.6.0)
Collecting typing-inspect>=0.4.0
Using cached typing_inspect-0.7.1-py3-none-any.whl (8.4 kB)
Collecting requests-oauthlib>=0.5.0
Using cached requests_oauthlib-1.3.1-py2.py3-none-any.whl (23 kB)
Collecting isodate>=0.6.0
Using cached isodate-0.6.1-py2.py3-none-any.whl (41 kB)
Collecting typing-utils>=0.0.3
Using cached typing_utils-0.1.0-py3-none-any.whl (10 kB)
Collecting websocket-client>=0.32.0
Using cached websocket_client-1.2.3-py3-none-any.whl (53 kB)
Collecting oauthlib>=3.0.0
Using cached oauthlib-3.2.0-py3-none-any.whl (151 kB)
Collecting mypy-extensions>=0.3.0
Using cached mypy_extensions-0.4.3-py2.py3-none-any.whl (4.5 kB)
Building wheels for collected packages: apache-beam
Building wheel for apache-beam (setup.py): started
Building wheel for apache-beam (setup.py): finished with status 'done'
Created wheel for apache-beam: filename=apache_beam-2.38.0.dev0-py3-none-any.whl size=2659545 sha256=5809ffccc63de3bb1381bfaf2c241867378c25ae5cafae2593531a8a6acdad8d
Stored in directory: /home/jenkins/.cache/pip/wheels/ae/83/60/8ffa598c4b9bac2ca773fed6f402d79ce042675f87beed8970
Successfully built apache-beam
Installing collected packages: pyasn1, urllib3, rsa, pyparsing, pyasn1-modules, idna, charset-normalizer, certifi, cachetools, typing-extensions, requests, pytz, mypy-extensions, googleapis-common-protos, google-auth, websocket-client, wcwidth, typing-inspect, pyyaml, python-dateutil, pycparser, pluggy, oauthlib, more-itertools, jmespath, google-api-core, dataclasses, attrs, atomicwrites, wrapt, typing-utils, requests-oauthlib, pytest, proto-plus, numpy, libcst, isodate, httplib2, grpcio-gcp, grpc-google-iam-v1, greenlet, google-crc32c, docopt, docker, deprecation, cffi, botocore, testcontainers, sqlalchemy, s3transfer, pytest-forked, pymysql, pymongo, pydot, pyarrow, pbr, overrides, orjson, oauth2client, msrest, hdfs, grpcio-status, google-resumable-media, google-cloud-pubsub, google-cloud-core, fasteners, fastavro, execnet, dill, cryptography, crcmod, cloudpickle, azure-core, tenacity, requests-mock, pytest-xdist, pytest-timeout, pyhamcrest, psycopg2-binary, parameterized, pandas, mock, google-cloud-vision, google-cloud-videointelligence, google-cloud-spanner, google-cloud-recommendations-ai, google-cloud-pubsublite, google-cloud-language, google-cloud-dlp, google-cloud-datastore, google-cloud-bigtable, google-cloud-bigquery-storage, google-cloud-bigquery, google-apitools, freezegun, boto3, azure-storage-blob, apache-beam
Attempting uninstall: pyparsing
Found existing installation: pyparsing 3.0.7
Uninstalling pyparsing-3.0.7:
Successfully uninstalled pyparsing-3.0.7
Attempting uninstall: pluggy
Found existing installation: pluggy 1.0.0
Uninstalling pluggy-1.0.0:
Successfully uninstalled pluggy-1.0.0
Successfully installed apache-beam-2.38.0.dev0 atomicwrites-1.4.0 attrs-21.4.0 azure-core-1.22.1 azure-storage-blob-12.9.0 boto3-1.20.54 botocore-1.23.54 cachetools-4.2.4 certifi-2021.10.8 cffi-1.15.0 charset-normalizer-2.0.12 cloudpickle-2.0.0 crcmod-1.7 cryptography-36.0.1 dataclasses-0.8 deprecation-2.1.0 dill-0.3.1.1 docker-5.0.3 docopt-0.6.2 execnet-1.9.0 fastavro-1.4.7 fasteners-0.17.3 freezegun-1.1.0 google-api-core-1.31.5 google-apitools-0.5.31 google-auth-1.35.0 google-cloud-bigquery-2.32.0 google-cloud-bigquery-storage-2.11.0 google-cloud-bigtable-1.7.0 google-cloud-core-1.7.2 google-cloud-datastore-1.15.3 google-cloud-dlp-3.6.0 google-cloud-language-1.3.0 google-cloud-pubsub-2.9.0 google-cloud-pubsublite-1.3.0 google-cloud-recommendations-ai-0.2.0 google-cloud-spanner-1.19.1 google-cloud-videointelligence-1.16.1 google-cloud-vision-1.0.0 google-crc32c-1.3.0 google-resumable-media-2.2.1 googleapis-common-protos-1.54.0 greenlet-1.1.2 grpc-google-iam-v1-0.12.3 grpcio-gcp-0.2.2 grpcio-status-1.43.0 hdfs-2.6.0 httplib2-0.19.1 idna-3.3 isodate-0.6.1 jmespath-0.10.0 libcst-0.4.1 mock-2.0.0 more-itertools-8.12.0 msrest-0.6.21 mypy-extensions-0.4.3 numpy-1.19.5 oauth2client-4.1.3 oauthlib-3.2.0 orjson-3.6.1 overrides-6.1.0 pandas-1.1.5 parameterized-0.7.5 pbr-5.8.1 pluggy-0.13.1 proto-plus-1.20.0 psycopg2-binary-2.9.3 pyarrow-6.0.1 pyasn1-0.4.8 pyasn1-modules-0.2.8 pycparser-2.21 pydot-1.4.2 pyhamcrest-1.10.1 pymongo-3.12.3 pymysql-1.0.2 pyparsing-2.4.7 pytest-4.6.11 pytest-forked-1.4.0 pytest-timeout-1.4.2 pytest-xdist-1.34.0 python-dateutil-2.8.2 pytz-2021.3 pyyaml-6.0 requests-2.27.1 requests-mock-1.9.3 requests-oauthlib-1.3.1 rsa-4.8 s3transfer-0.5.1 sqlalchemy-1.4.31 tenacity-5.1.5 testcontainers-3.4.2 typing-extensions-4.1.0 typing-inspect-0.7.1 typing-utils-0.1.0 urllib3-1.26.8 wcwidth-0.2.5 websocket-client-1.2.3 wrapt-1.13.3
> Task :release:go-licenses:java:dockerRun
+ go-licenses save github.com/apache/beam/sdks/java/container --save_path=/output/licenses
> Task :release:go-licenses:py:dockerRun
+ go-licenses save github.com/apache/beam/sdks/python/container --save_path=/output/licenses
+ go-licenses csv github.com/apache/beam/sdks/python/container
+ tee /output/licenses/list.csv
github.com/nightlyone/lockfile,https://github.com/nightlyone/lockfile/blob/master/LICENSE,MIT
github.com/apache/beam/sdks/python/container,https://github.com/apache/beam/blob/master/LICENSE,Apache-2.0
github.com/apache/beam/sdks/go/pkg/beam,https://github.com/apache/beam/blob/master/sdks/go/README.md,Apache-2.0
google.golang.org/protobuf,https://go.googlesource.com/protobuf/+/refs/heads/master/LICENSE,BSD-3-Clause
google.golang.org/genproto/googleapis/rpc/status,https://github.com/googleapis/go-genproto/blob/master/LICENSE,Apache-2.0
golang.org/x/sys,https://go.googlesource.com/sys/+/refs/heads/master/LICENSE,BSD-3-Clause
golang.org/x/text,https://go.googlesource.com/text/+/refs/heads/master/LICENSE,BSD-3-Clause
google.golang.org/grpc,https://github.com/grpc/grpc-go/blob/master/LICENSE,Apache-2.0
golang.org/x/net,https://go.googlesource.com/net/+/refs/heads/master/LICENSE,BSD-3-Clause
github.com/golang/protobuf,https://github.com/golang/protobuf/blob/master/LICENSE,BSD-3-Clause
+ chmod -R a+w /output/licenses
> Task :release:go-licenses:java:dockerRun
+ go-licenses csv github.com/apache/beam/sdks/java/container
+ tee /output/licenses/list.csv
github.com/apache/beam/sdks/java/container,https://github.com/apache/beam/blob/master/LICENSE,Apache-2.0
google.golang.org/grpc,https://github.com/grpc/grpc-go/blob/master/LICENSE,Apache-2.0
golang.org/x/net,https://go.googlesource.com/net/+/refs/heads/master/LICENSE,BSD-3-Clause
github.com/golang/protobuf,https://github.com/golang/protobuf/blob/master/LICENSE,BSD-3-Clause
google.golang.org/protobuf,https://go.googlesource.com/protobuf/+/refs/heads/master/LICENSE,BSD-3-Clause
golang.org/x/sys,https://go.googlesource.com/sys/+/refs/heads/master/LICENSE,BSD-3-Clause
github.com/apache/beam/sdks/go/pkg/beam,https://github.com/apache/beam/blob/master/sdks/go/README.md,Apache-2.0
google.golang.org/genproto/googleapis/rpc/status,https://github.com/googleapis/go-genproto/blob/master/LICENSE,Apache-2.0
golang.org/x/text,https://go.googlesource.com/text/+/refs/heads/master/LICENSE,BSD-3-Clause
+ chmod -R a+w /output/licenses
> Task :release:go-licenses:java:createLicenses
> Task :sdks:java:container:java8:copyGolangLicenses
> Task :release:go-licenses:py:createLicenses
> Task :sdks:python:container:py36:copyGolangLicenses
> Task :sdks:java:container:java8:dockerPrepare
> Task :sdks:python:container:py36:dockerPrepare
> Task :sdks:java:container:java8:docker
> Task :sdks:python:container:py36:docker
> Task :runners:google-cloud-dataflow-java:buildAndPushDockerJavaContainer
WARNING: `gcloud docker` will not be supported for Docker client versions above 18.03.
As an alternative, use `gcloud auth configure-docker` to configure `docker` to
use `gcloud` as a credential helper, then use `docker` as you would for non-GCR
registries, e.g. `docker pull gcr.io/project-id/my-image`. Add
`--verbosity=error` to silence this warning: `gcloud docker
--verbosity=error -- pull gcr.io/project-id/my-image`.
See: https://cloud.google.com/container-registry/docs/support/deprecation-notices#gcloud-docker
> Task :runners:google-cloud-dataflow-java:buildAndPushDockerPythonContainer
WARNING: `gcloud docker` will not be supported for Docker client versions above 18.03.
As an alternative, use `gcloud auth configure-docker` to configure `docker` to
use `gcloud` as a credential helper, then use `docker` as you would for non-GCR
registries, e.g. `docker pull gcr.io/project-id/my-image`. Add
`--verbosity=error` to silence this warning: `gcloud docker
--verbosity=error -- pull gcr.io/project-id/my-image`.
See: https://cloud.google.com/container-registry/docs/support/deprecation-notices#gcloud-docker
> Task :runners:google-cloud-dataflow-java:setupXVR
> Task :runners:google-cloud-dataflow-java:validatesCrossLanguageRunnerSetup
> Task :runners:google-cloud-dataflow-java:validatesCrossLanguageRunnerPythonUsingJava
> Task :runners:google-cloud-dataflow-java:validatesCrossLanguageRunnerPythonUsingJava FAILED
> Task :runners:google-cloud-dataflow-java:validatesCrossLanguageRunnerCleanup
> Task :runners:google-cloud-dataflow-java:cleanupXVR UP-TO-DATE
> Task :runners:google-cloud-dataflow-java:cleanUpDockerPythonImages
Tag: [us.gcr.io/apache-beam-testing/java-postcommit-it/python:20220213180229]
- referencing digest: [us.gcr.io/apache-beam-testing/java-postcommit-it/python@sha256:4ceea341714e2a4e2767a8d20711f5b52de6344892376804581238dfc46bfa9c]
Deleted [[us.gcr.io/apache-beam-testing/java-postcommit-it/python:20220213180229] (referencing [us.gcr.io/apache-beam-testing/java-postcommit-it/python@sha256:4ceea341714e2a4e2767a8d20711f5b52de6344892376804581238dfc46bfa9c])].
Digests:
- us.gcr.io/apache-beam-testing/java-postcommit-it/python@sha256:4ceea341714e2a4e2767a8d20711f5b52de6344892376804581238dfc46bfa9c
Deleted [us.gcr.io/apache-beam-testing/java-postcommit-it/python@sha256:4ceea341714e2a4e2767a8d20711f5b52de6344892376804581238dfc46bfa9c].
> Task :runners:google-cloud-dataflow-java:cleanUpDockerJavaImages
Tag: [us.gcr.io/apache-beam-testing/java-postcommit-it/java:20220213180229]
- referencing digest: [us.gcr.io/apache-beam-testing/java-postcommit-it/java@sha256:631e4b4a36326f019ae7191373cb2057b98e992159b0b33613516ea5f6777b98]
Deleted [[us.gcr.io/apache-beam-testing/java-postcommit-it/java:20220213180229] (referencing [us.gcr.io/apache-beam-testing/java-postcommit-it/java@sha256:631e4b4a36326f019ae7191373cb2057b98e992159b0b33613516ea5f6777b98])].
Digests:
- us.gcr.io/apache-beam-testing/java-postcommit-it/java@sha256:3c7b189338878558b206cb2a7f480ac1b250a9d2792fc2e5984b0f67975efe3c
ERROR: (gcloud.container.images.delete) Not found: response: {'docker-distribution-api-version': 'registry/2.0', 'content-type': 'application/json', 'date': 'Sun, 13 Feb 2022 18:18:15 GMT', 'server': 'Docker Registry', 'cache-control': 'private', 'x-xss-protection': '0', 'x-frame-options': 'SAMEORIGIN', 'transfer-encoding': 'chunked', 'status': '404', 'content-length': '168', '-content-encoding': 'gzip'}
Failed to compute blob liveness for manifest: 'sha256:3c7b189338878558b206cb2a7f480ac1b250a9d2792fc2e5984b0f67975efe3c': None
> Task :runners:google-cloud-dataflow-java:cleanUpDockerJavaImages FAILED
FAILURE: Build completed with 2 failures.
1: Task failed with an exception.
-----------
* What went wrong:
Execution failed for task ':runners:google-cloud-dataflow-java:validatesCrossLanguageRunnerPythonUsingJava'.
> Process 'command 'sh'' finished with non-zero exit value 1
* Try:
> Run with --stacktrace option to get the stack trace.
> Run with --info or --debug option to get more log output.
> Run with --scan to get full insights.
==============================================================================
2: Task failed with an exception.
-----------
* Where:
Build file '<https://ci-beam.apache.org/job/beam_PostCommit_XVR_PythonUsingJava_Dataflow/ws/src/runners/google-cloud-dataflow-java/build.gradle'> line: 297
* What went wrong:
Execution failed for task ':runners:google-cloud-dataflow-java:cleanUpDockerJavaImages'.
> Process 'command './scripts/cleanup_untagged_gcr_images.sh'' finished with non-zero exit value 1
* Try:
> Run with --stacktrace option to get the stack trace.
> Run with --info or --debug option to get more log output.
> Run with --scan to get full insights.
==============================================================================
* Get more help at https://help.gradle.org
Deprecated Gradle features were used in this build, making it incompatible with Gradle 8.0.
You can use '--warning-mode all' to show the individual deprecation warnings and determine if they come from your own scripts or plugins.
See https://docs.gradle.org/7.3.2/userguide/command_line_interface.html#sec:command_line_warnings
Execution optimizations have been disabled for 1 invalid unit(s) of work during this build to ensure correctness.
Please consult deprecation warnings for more details.
BUILD FAILED in 16m 6s
113 actionable tasks: 78 executed, 29 from cache, 6 up-to-date
Publishing build scan...
https://gradle.com/s/nit4gtshrrci2
Build step 'Invoke Gradle script' changed build result to FAILURE
Build step 'Invoke Gradle script' marked build as failure
---------------------------------------------------------------------
To unsubscribe, e-mail: builds-unsubscribe@beam.apache.org
For additional commands, e-mail: builds-help@beam.apache.org
Jenkins build is back to normal : beam_PostCommit_XVR_PythonUsingJava_Dataflow #76
Posted by Apache Jenkins Server <je...@builds.apache.org>.
See <https://ci-beam.apache.org/job/beam_PostCommit_XVR_PythonUsingJava_Dataflow/76/display/redirect>
---------------------------------------------------------------------
To unsubscribe, e-mail: builds-unsubscribe@beam.apache.org
For additional commands, e-mail: builds-help@beam.apache.org
Build failed in Jenkins: beam_PostCommit_XVR_PythonUsingJava_Dataflow #75
Posted by Apache Jenkins Server <je...@builds.apache.org>.
See <https://ci-beam.apache.org/job/beam_PostCommit_XVR_PythonUsingJava_Dataflow/75/display/redirect>
Changes:
------------------------------------------
[...truncated 441.70 KB...]
execnet==1.9.0
fastavro==1.4.7
fasteners==0.17.3
flatbuffers==1.12
freezegun==1.1.0
future==0.18.2
gast==0.4.0
google-api-core==1.31.5
google-api-python-client==2.37.0
google-apitools==0.5.31
google-auth==1.35.0
google-auth-httplib2==0.1.0
google-auth-oauthlib==0.4.6
google-cloud-bigquery==2.32.0
google-cloud-bigquery-storage==2.11.0
google-cloud-bigtable==1.7.0
google-cloud-core==1.7.2
google-cloud-datastore==1.15.3
google-cloud-dlp==3.6.0
google-cloud-language==1.3.0
google-cloud-profiler==3.0.7
google-cloud-pubsub==2.9.0
google-cloud-pubsublite==1.3.0
google-cloud-recommendations-ai==0.2.0
google-cloud-spanner==1.19.1
google-cloud-videointelligence==1.16.1
google-cloud-vision==1.0.0
google-crc32c==1.3.0
google-pasta==0.2.0
google-python-cloud-debugger==2.18
google-resumable-media==2.2.1
googleapis-common-protos==1.54.0
greenlet==1.1.2
grpc-google-iam-v1==0.12.3
grpcio==1.43.0
grpcio-gcp==0.2.2
grpcio-status==1.43.0
guppy3==3.1.2
h5py==3.1.0
hdfs==2.6.0
httplib2==0.19.1
idna==3.3
importlib-metadata==4.8.3
joblib==1.1.0
keras==2.6.0
Keras-Preprocessing==1.1.2
libcst==0.4.1
Markdown==3.3.6
mmh3==3.0.0
mock==2.0.0
more-itertools==8.12.0
mypy-extensions==0.4.3
nltk==3.6.7
nose==1.3.7
numpy==1.19.5
oauth2client==4.1.3
oauthlib==3.2.0
opt-einsum==3.3.0
orjson==3.6.1
overrides==6.1.0
packaging==21.3
pandas==1.1.5
parameterized==0.7.5
pbr==5.8.1
pip==21.2.4
pluggy==0.13.1
proto-plus==1.20.0
protobuf==3.19.4
psycopg2-binary==2.9.3
py==1.11.0
pyarrow==6.0.1
pyasn1==0.4.8
pyasn1-modules==0.2.8
pycparser==2.21
pydot==1.4.2
PyHamcrest==1.10.1
pymongo==3.12.3
PyMySQL==1.0.2
pyparsing==2.4.7
pytest==4.6.11
pytest-forked==1.4.0
pytest-timeout==1.4.2
pytest-xdist==1.34.0
python-dateutil==2.8.2
python-snappy==0.6.0
pytz==2021.3
PyYAML==6.0
regex==2022.1.18
requests==2.27.1
requests-mock==1.9.3
requests-oauthlib==1.3.1
rsa==4.8
scikit-learn==0.24.2
scipy==1.5.4
setuptools==57.5.0
six==1.15.0
soupsieve==2.3.1
SQLAlchemy==1.4.31
tenacity==5.1.5
tensorboard==2.6.0
tensorboard-data-server==0.6.1
tensorboard-plugin-wit==1.8.1
tensorflow==2.6.2
tensorflow-estimator==2.6.0
termcolor==1.1.0
testcontainers==3.4.2
threadpoolctl==3.1.0
tqdm==4.62.3
typing-extensions==3.7.4.3
typing-inspect==0.7.1
typing-utils==0.1.0
uritemplate==4.1.1
urllib3==1.26.8
wcwidth==0.2.5
websocket-client==1.2.3
Werkzeug==2.0.3
wheel==0.37.0
wrapt==1.12.1
zipp==3.6.0
Removing intermediate container 9657e86bc296
---> 165b071feecb
Step 16/31 : COPY target/LICENSE /opt/apache/beam/
---> b83d38addb2d
Step 17/31 : COPY target/LICENSE.python /opt/apache/beam/
---> 9386f910ee3d
Step 18/31 : COPY target/NOTICE /opt/apache/beam/
---> d5db6bf3fbcf
Step 19/31 : COPY target/launcher/linux_amd64/boot /opt/apache/beam/
---> ecc49f242c6e
Step 20/31 : ENTRYPOINT ["/opt/apache/beam/boot"]
---> Running in 81c71de97c7d
Removing intermediate container 81c71de97c7d
---> f3a8e5d97219
Step 21/31 : FROM beam as third_party_licenses
---> f3a8e5d97219
Step 22/31 : ARG pull_licenses
---> Running in bca346abc78f
Removing intermediate container bca346abc78f
---> d679bb57f332
Step 23/31 : COPY target/license_scripts /tmp/license_scripts/
---> 3c5da746f40d
Step 24/31 : COPY target/LICENSE target/go-licenses/* /opt/apache/beam/third_party_licenses/golang/
---> 8c4e71ae3c0b
Step 25/31 : RUN rm /opt/apache/beam/third_party_licenses/golang/LICENSE
---> Running in 91c3508be609
Removing intermediate container 91c3508be609
---> 12f822a7fecf
Step 26/31 : COPY target/license_scripts /tmp/license_scripts/
---> 16d42d60ffd8
Step 27/31 : RUN if [ "$pull_licenses" = "true" ] ; then pip install 'pip-licenses<3.0.0' pyyaml tenacity && python /tmp/license_scripts/pull_licenses_py.py ; fi
---> Running in 627c30e0bde9
Collecting pip-licenses<3.0.0
Downloading pip_licenses-2.3.0-py3-none-any.whl (14 kB)
Requirement already satisfied: pyyaml in /usr/local/lib/python3.6/site-packages (6.0)
Requirement already satisfied: tenacity in /usr/local/lib/python3.6/site-packages (5.1.5)
Collecting PTable
Downloading PTable-0.9.2.tar.gz (31 kB)
Requirement already satisfied: six>=1.9.0 in /usr/local/lib/python3.6/site-packages (from tenacity) (1.15.0)
Building wheels for collected packages: PTable
Building wheel for PTable (setup.py): started
Building wheel for PTable (setup.py): finished with status 'done'
Created wheel for PTable: filename=PTable-0.9.2-py3-none-any.whl size=22924 sha256=4c9ed895a264e181570ab2d6a0ba9a4c7cc538698ece09648564967068c1f4f1
Stored in directory: /root/.cache/pip/wheels/f3/65/67/71f473ec87ea4554d1bdfb1b5128cfe1414c2b113b72a1ee8e
Successfully built PTable
Installing collected packages: PTable, pip-licenses
Successfully installed PTable-0.9.2 pip-licenses-2.3.0
[91mWARNING: Running pip as the 'root' user can result in broken permissions and conflicting behaviour with the system package manager. It is recommended to use a virtual environment instead: https://pip.pypa.io/warnings/venv
[0m[91mWARNING: You are using pip version 21.2.4; however, version 21.3.1 is available.
You should consider upgrading via the '/usr/local/bin/python -m pip install --upgrade pip' command.
[0m[91mINFO:root:Successfully pulled licenses for 138 dependencies
[0mSkip pulling license for bs4
Removing intermediate container 627c30e0bde9
---> fc8449e9a0c1
Step 28/31 : FROM beam
---> f3a8e5d97219
Step 29/31 : ARG pull_licenses
---> Running in 1abc7785bcb6
Removing intermediate container 1abc7785bcb6
---> 06845c438cb5
Step 30/31 : COPY --from=third_party_licenses /opt/apache/beam/third_party_licenses /opt/apache/beam/third_party_licenses
---> d19c7afd27e7
Step 31/31 : RUN if [ "$pull_licenses" != "true" ] ; then rm -rf /opt/apache/beam/third_party_licenses ; fi
---> Running in e8f0b378d727
Removing intermediate container e8f0b378d727
---> f3eb62eea707
Successfully built f3eb62eea707
Successfully tagged apache/beam_python3.6_sdk:2.38.0.dev
> Task :runners:google-cloud-dataflow-java:buildAndPushDockerPythonContainer
WARNING: `gcloud docker` will not be supported for Docker client versions above 18.03.
As an alternative, use `gcloud auth configure-docker` to configure `docker` to
use `gcloud` as a credential helper, then use `docker` as you would for non-GCR
registries, e.g. `docker pull gcr.io/project-id/my-image`. Add
`--verbosity=error` to silence this warning: `gcloud docker
--verbosity=error -- pull gcr.io/project-id/my-image`.
See: https://cloud.google.com/container-registry/docs/support/deprecation-notices#gcloud-docker
> Task :runners:google-cloud-dataflow-java:setupXVR
> Task :runners:google-cloud-dataflow-java:validatesCrossLanguageRunnerSetup
> Task :runners:google-cloud-dataflow-java:validatesCrossLanguageRunnerPythonUsingJava
> Task :runners:google-cloud-dataflow-java:validatesCrossLanguageRunnerPythonUsingJava FAILED
> Task :runners:google-cloud-dataflow-java:validatesCrossLanguageRunnerCleanup
> Task :runners:google-cloud-dataflow-java:cleanupXVR UP-TO-DATE
> Task :runners:google-cloud-dataflow-java:cleanUpDockerPythonImages
Tag: [us.gcr.io/apache-beam-testing/java-postcommit-it/python:20220214000248]
- referencing digest: [us.gcr.io/apache-beam-testing/java-postcommit-it/python@sha256:b0c9d785e4c9d11c650271cc844f16dc576a997fd2fc0af16a2781257591a2ec]
Deleted [[us.gcr.io/apache-beam-testing/java-postcommit-it/python:20220214000248] (referencing [us.gcr.io/apache-beam-testing/java-postcommit-it/python@sha256:b0c9d785e4c9d11c650271cc844f16dc576a997fd2fc0af16a2781257591a2ec])].
> Task :runners:google-cloud-dataflow-java:cleanUpDockerJavaImages
Tag: [us.gcr.io/apache-beam-testing/java-postcommit-it/java:20220214000248]
- referencing digest: [us.gcr.io/apache-beam-testing/java-postcommit-it/java@sha256:4cfc64f27892f2ae38c8e3e8dabc64ecaa46ee10c2c09fa4b4f61695acf4242d]
Deleted [[us.gcr.io/apache-beam-testing/java-postcommit-it/java:20220214000248] (referencing [us.gcr.io/apache-beam-testing/java-postcommit-it/java@sha256:4cfc64f27892f2ae38c8e3e8dabc64ecaa46ee10c2c09fa4b4f61695acf4242d])].
FAILURE: Build failed with an exception.
* What went wrong:
Execution failed for task ':runners:google-cloud-dataflow-java:validatesCrossLanguageRunnerPythonUsingJava'.
> Process 'command 'sh'' finished with non-zero exit value 1
* Try:
> Run with --stacktrace option to get the stack trace.
> Run with --info or --debug option to get more log output.
> Run with --scan to get full insights.
* Get more help at https://help.gradle.org
Deprecated Gradle features were used in this build, making it incompatible with Gradle 8.0.
You can use '--warning-mode all' to show the individual deprecation warnings and determine if they come from your own scripts or plugins.
See https://docs.gradle.org/7.3.2/userguide/command_line_interface.html#sec:command_line_warnings
Execution optimizations have been disabled for 1 invalid unit(s) of work during this build to ensure correctness.
Please consult deprecation warnings for more details.
BUILD FAILED in 19m
113 actionable tasks: 78 executed, 29 from cache, 6 up-to-date
Publishing build scan...
https://gradle.com/s/j243ldqhaoowm
Build step 'Invoke Gradle script' changed build result to FAILURE
Build step 'Invoke Gradle script' marked build as failure
---------------------------------------------------------------------
To unsubscribe, e-mail: builds-unsubscribe@beam.apache.org
For additional commands, e-mail: builds-help@beam.apache.org