You are viewing a plain text version of this content. The canonical link for it is here.
Posted to builds@beam.apache.org by Apache Jenkins Server <je...@builds.apache.org> on 2023/08/22 00:03:19 UTC

Build failed in Jenkins: beam_PostCommit_Java_PVR_Spark_Batch #2407

See <https://ci-beam.apache.org/job/beam_PostCommit_Java_PVR_Spark_Batch/2407/display/redirect>

Changes:


------------------------------------------
[...truncated 44.96 KB...]
#10 exporting to image
#10 exporting layers done
#10 writing image sha256:189422eb5926b6778c083b3bdd4965c7f5044ef8d15287102029f058a9da1f69 done
#10 naming to docker.io/library/golicenses-java done
#10 DONE 0.0s

> Task :sdks:java:container:pullLicenses
Collecting setuptools
  Using cached setuptools-68.1.2-py3-none-any.whl (805 kB)
Collecting wheel
  Using cached wheel-0.41.1-py3-none-any.whl (64 kB)
Installing collected packages: pip, setuptools, wheel
  Attempting uninstall: pip
    Found existing installation: pip 20.0.2
    Uninstalling pip-20.0.2:
      Successfully uninstalled pip-20.0.2
  Attempting uninstall: setuptools
    Found existing installation: setuptools 44.0.0
    Uninstalling setuptools-44.0.0:
      Successfully uninstalled setuptools-44.0.0
Successfully installed pip-23.2.1 setuptools-68.1.2 wheel-0.41.1
Collecting beautifulsoup4<5.0,>=4.9.0 (from -r <https://ci-beam.apache.org/job/beam_PostCommit_Java_PVR_Spark_Batch/ws/src/sdks/java/container/license_scripts/requirement.txt> (line 19))
  Using cached beautifulsoup4-4.12.2-py3-none-any.whl (142 kB)
Collecting pyyaml<7,>=6.0.1 (from -r <https://ci-beam.apache.org/job/beam_PostCommit_Java_PVR_Spark_Batch/ws/src/sdks/java/container/license_scripts/requirement.txt> (line 20))
  Obtaining dependency information for pyyaml<7,>=6.0.1 from https://files.pythonhosted.org/packages/c8/6b/6600ac24725c7388255b2f5add93f91e58a5d7efaf4af244fdbcc11a541b/PyYAML-6.0.1-cp38-cp38-manylinux_2_17_x86_64.manylinux2014_x86_64.whl.metadata
  Using cached PyYAML-6.0.1-cp38-cp38-manylinux_2_17_x86_64.manylinux2014_x86_64.whl.metadata (2.1 kB)
Collecting tenacity<9.0,>=6.1.0 (from -r <https://ci-beam.apache.org/job/beam_PostCommit_Java_PVR_Spark_Batch/ws/src/sdks/java/container/license_scripts/requirement.txt> (line 21))
  Obtaining dependency information for tenacity<9.0,>=6.1.0 from https://files.pythonhosted.org/packages/f4/f1/990741d5bb2487d529d20a433210ffa136a367751e454214013b441c4575/tenacity-8.2.3-py3-none-any.whl.metadata
  Using cached tenacity-8.2.3-py3-none-any.whl.metadata (1.0 kB)
Collecting soupsieve>1.2 (from beautifulsoup4<5.0,>=4.9.0->-r <https://ci-beam.apache.org/job/beam_PostCommit_Java_PVR_Spark_Batch/ws/src/sdks/java/container/license_scripts/requirement.txt> (line 19))
  Using cached soupsieve-2.4.1-py3-none-any.whl (36 kB)
Using cached PyYAML-6.0.1-cp38-cp38-manylinux_2_17_x86_64.manylinux2014_x86_64.whl (736 kB)
Using cached tenacity-8.2.3-py3-none-any.whl (24 kB)
Installing collected packages: tenacity, soupsieve, pyyaml, beautifulsoup4
Successfully installed beautifulsoup4-4.12.2 pyyaml-6.0.1 soupsieve-2.4.1 tenacity-8.2.3
Executing python <https://ci-beam.apache.org/job/beam_PostCommit_Java_PVR_Spark_Batch/ws/src/sdks/java/container/license_scripts/pull_licenses_java.py> --license_index=<https://ci-beam.apache.org/job/beam_PostCommit_Java_PVR_Spark_Batch/ws/src/sdks/java/container/build/reports/dependency-license/index.json>        --output_dir=<https://ci-beam.apache.org/job/beam_PostCommit_Java_PVR_Spark_Batch/ws/src/sdks/java/container/build/target/java_third_party_licenses>        --dep_url_yaml=<https://ci-beam.apache.org/job/beam_PostCommit_Java_PVR_Spark_Batch/ws/src/sdks/java/container/license_scripts/dep_urls_java.yaml>        --manual_license_path=<https://ci-beam.apache.org/job/beam_PostCommit_Java_PVR_Spark_Batch/ws/src/sdks/java/container/license_scripts/manual_licenses>
INFO:root:Pulling license for 126 dependencies using 16 threads.
INFO:root:Replaced local file URL with file://<https://ci-beam.apache.org/job/beam_PostCommit_Java_PVR_Spark_Batch/ws/src/sdks/java/container/license_scripts/manual_licenses/xz/COPYING> for xz-1.5
INFO:root:pull_licenses_java.py succeed. It took 1.466501 seconds with 16 threads.
Copying licenses from <https://ci-beam.apache.org/job/beam_PostCommit_Java_PVR_Spark_Batch/ws/src/sdks/java/container/build/target/java_third_party_licenses> to <https://ci-beam.apache.org/job/beam_PostCommit_Java_PVR_Spark_Batch/ws/src/sdks/java/container/build/target/third_party_licenses.>
Finished license_scripts.sh

> Task :release:go-licenses:java:dockerRun
+ rm -rf '/output/*'
+ go get github.com/apache/beam/sdks/v2/java/container
go: downloading github.com/apache/beam/sdks/v2 v2.49.0
go: downloading github.com/apache/beam v2.49.0+incompatible

> Task :sdks:java:container:java8:copyJavaThirdPartyLicenses

> Task :sdks:java:container:downloadCloudProfilerAgent
  % Total    % Received % Xferd  Average Speed   Time    Time     Time  Current
                                 Dload  Upload   Total   Spent    Left  Speed
  0     0    0     0    0     0      0      0 --:--:-- --:--:-- --:--:--     0version.txt
NOTICES
profiler_java_agent.so
100 4183k  100 4183k    0     0  23.0M      0 --:--:-- --:--:-- --:--:-- 23.0M

> Task :sdks:java:container:goPrepare UP-TO-DATE

> Task :release:go-licenses:java:dockerRun
go: downloading github.com/golang/protobuf v1.5.3
go: downloading google.golang.org/grpc v1.56.1
go: downloading google.golang.org/protobuf v1.31.0
go: downloading golang.org/x/sys v0.9.0
go: downloading google.golang.org/genproto/googleapis/rpc v0.0.0-20230530153820-e85fd2cbaebc
go: downloading golang.org/x/net v0.11.0
go: downloading google.golang.org/genproto v0.0.0-20230530153820-e85fd2cbaebc
go: downloading golang.org/x/text v0.10.0

> Task :sdks:java:container:goBuild
/home/jenkins/go/bin/go1.21.0 build -o ./build/target/linux_amd64/boot boot.go boot_test.go pathingjar.go pathingjar_test.go

> Task :sdks:java:container:java8:copySdkHarnessLauncher
Execution optimizations have been disabled for task ':sdks:java:container:java8:copySdkHarnessLauncher' to ensure correctness due to the following reasons:
  - Gradle detected a problem with the following location: '<https://ci-beam.apache.org/job/beam_PostCommit_Java_PVR_Spark_Batch/ws/src/sdks/java/container/build/target'.> Reason: Task ':sdks:java:container:java8:copySdkHarnessLauncher' uses this output of task ':sdks:java:container:pullLicenses' without declaring an explicit or implicit dependency. This can lead to incorrect results being produced, depending on what order the tasks are executed. Please refer to https://docs.gradle.org/7.6.2/userguide/validation_problems.html#implicit_dependency for more details about this problem.

> Task :release:go-licenses:java:dockerRun
go: added github.com/apache/beam/sdks/v2 v2.49.0
go: added github.com/golang/protobuf v1.5.3
go: added golang.org/x/net v0.11.0
go: added golang.org/x/sys v0.9.0
go: added golang.org/x/text v0.10.0
go: added google.golang.org/genproto/googleapis/rpc v0.0.0-20230530153820-e85fd2cbaebc
go: added google.golang.org/grpc v1.56.1
go: added google.golang.org/protobuf v1.31.0
+ go-licenses save github.com/apache/beam/sdks/v2/java/container --save_path=/output/licenses
W0821 22:21:11.063150      35 library.go:101] "golang.org/x/sys/unix" contains non-Go code that can't be inspected for further dependencies:
/go/pkg/mod/golang.org/x/sys@v0.9.0/unix/asm_linux_amd64.s
+ go-licenses csv github.com/apache/beam/sdks/v2/java/container
+ tee /output/licenses/list.csv
W0821 22:21:18.007678      80 library.go:101] "golang.org/x/sys/unix" contains non-Go code that can't be inspected for further dependencies:
/go/pkg/mod/golang.org/x/sys@v0.9.0/unix/asm_linux_amd64.s
github.com/apache/beam/sdks/v2/go,https://github.com/apache/beam/blob/sdks/v2.49.0/sdks/go/README.md,Apache-2.0
github.com/apache/beam/sdks/v2/java/container,https://github.com/apache/beam/blob/sdks/v2.49.0/sdks/LICENSE,Apache-2.0
github.com/golang/protobuf,https://github.com/golang/protobuf/blob/v1.5.3/LICENSE,BSD-3-Clause
golang.org/x/net,https://cs.opensource.google/go/x/net/+/v0.11.0:LICENSE,BSD-3-Clause
golang.org/x/sys/unix,https://cs.opensource.google/go/x/sys/+/v0.9.0:LICENSE,BSD-3-Clause
golang.org/x/text,https://cs.opensource.google/go/x/text/+/v0.10.0:LICENSE,BSD-3-Clause
google.golang.org/genproto/googleapis/rpc/status,https://github.com/googleapis/go-genproto/blob/e85fd2cbaebc/googleapis/rpc/LICENSE,Apache-2.0
google.golang.org/grpc,https://github.com/grpc/grpc-go/blob/v1.56.1/LICENSE,Apache-2.0
google.golang.org/protobuf,https://github.com/protocolbuffers/protobuf-go/blob/v1.31.0/LICENSE,BSD-3-Clause
+ chmod -R a+w /output/licenses

> Task :runners:spark:3:job-server:validatesPortableRunnerBatch
> Task :release:go-licenses:java:createLicenses
> Task :sdks:java:container:java8:copyGolangLicenses
> Task :sdks:java:container:java8:dockerPrepare

> Task :sdks:java:container:java8:docker
#1 [internal] load .dockerignore
#1 transferring context: 2B done
#1 DONE 1.4s

#2 [internal] load build definition from Dockerfile
#2 transferring dockerfile: 2.58kB done
#2 DONE 2.5s

#3 [internal] load metadata for docker.io/library/eclipse-temurin:8
#3 DONE 2.0s

#4 [internal] load build context
#4 DONE 0.0s

#5 [ 1/16] FROM docker.io/library/eclipse-temurin:8@sha256:2140fd8af96784eecdedaa72a18f5acb2b12359fb25db021cbdc3987a044466a
#5 resolve docker.io/library/eclipse-temurin:8@sha256:2140fd8af96784eecdedaa72a18f5acb2b12359fb25db021cbdc3987a044466a
#5 resolve docker.io/library/eclipse-temurin:8@sha256:2140fd8af96784eecdedaa72a18f5acb2b12359fb25db021cbdc3987a044466a 0.6s done
#5 CACHED

#4 [internal] load build context
#4 transferring context: 47.14MB 0.4s done
#4 DONE 0.6s

#6 [ 2/16] ADD target/slf4j-api.jar /opt/apache/beam/jars/
#6 DONE 3.3s

#7 [ 3/16] ADD target/slf4j-jdk14.jar /opt/apache/beam/jars/
#7 DONE 0.2s

#8 [ 4/16] ADD target/jcl-over-slf4j.jar /opt/apache/beam/jars/
#8 DONE 0.1s

#9 [ 5/16] ADD target/log4j-over-slf4j.jar /opt/apache/beam/jars/
#9 DONE 0.1s

#10 [ 6/16] ADD target/log4j-to-slf4j.jar /opt/apache/beam/jars/
#10 DONE 0.1s

#11 [ 7/16] ADD target/beam-sdks-java-harness.jar /opt/apache/beam/jars/
#11 DONE 0.1s

#12 [ 8/16] COPY target/jamm.jar target/open-module-agent*.jar /opt/apache/beam/jars/
#12 DONE 0.1s

#13 [ 9/16] COPY target/linux_amd64/boot /opt/apache/beam/
#13 DONE 0.2s

#14 [10/16] COPY target/LICENSE /opt/apache/beam/
#14 DONE 0.1s

#15 [11/16] COPY target/NOTICE /opt/apache/beam/
#15 DONE 0.1s

#16 [12/16] ADD target/third_party_licenses /opt/apache/beam/third_party_licenses/
#16 DONE 0.2s

#17 [13/16] COPY target/LICENSE target/options/* /opt/apache/beam/options/
#17 DONE 0.1s

#18 [14/16] COPY target/go-licenses/* /opt/apache/beam/third_party_licenses/golang/
#18 DONE 0.1s

#19 [15/16] RUN if [ "true" = "false" ] ; then     rm -rf /opt/apache/beam/third_party_licenses ;    fi
#19 DONE 0.5s

#20 [16/16] COPY target/profiler/* /opt/google_cloud_profiler/
#20 DONE 0.1s

#21 exporting to image
#21 exporting layers
#21 exporting layers 0.4s done
#21 writing image sha256:5bddbe965192e7aed1c1d25d639258cea0267e7b39cdcc839a617ea9b73edfd2 done
#21 naming to docker.io/apache/beam_java8_sdk:2.51.0.dev done
#21 DONE 0.4s

> Task :runners:spark:3:job-server:validatesPortableRunnerBatch

org.apache.beam.sdk.transforms.ParDoTest$MultipleInputsAndOutputTests > testParDoWithOnlyTaggedOutput FAILED
    java.lang.RuntimeException at ParDoTest.java:818

org.apache.beam.sdk.transforms.ParDoTest$MultipleInputsAndOutputTests > testMultiOutputParDoWithSideInputs FAILED
    java.lang.RuntimeException at ParDoTest.java:1251
[shutdown-hook-0] INFO org.apache.spark.util.ShutdownHookManager - Shutdown hook called
[shutdown-hook-0] INFO org.apache.spark.util.ShutdownHookManager - Deleting directory /tmp/spark-144ad33a-57b9-4623-80a7-44601790a76b

org.apache.beam.sdk.transforms.ParDoTest$MultipleInputsAndOutputTests > testParDoWithTaggedOutput FAILED
    java.lang.RuntimeException at ParDoTest.java:723

org.apache.beam.sdk.transforms.ParDoTest$MultipleInputsAndOutputTests > testMultiOutputParDoWithSideInputsIsCumulative FAILED
    java.lang.RuntimeException at ParDoTest.java:1289

org.apache.beam.sdk.transforms.ParDoTest$MultipleInputsAndOutputTests > testSideInputAnnotationWithMultipleSideInputs FAILED
    java.lang.RuntimeException at ParDoTest.java:1179

org.apache.beam.sdk.transforms.ParDoTest$MultipleInputsAndOutputTests > testParDoWithEmptyTaggedOutput FAILED
    java.lang.RuntimeException at ParDoTest.java:789
[shutdown-hook-0] INFO org.apache.spark.util.ShutdownHookManager - Shutdown hook called
[shutdown-hook-0] INFO org.apache.spark.util.ShutdownHookManager - Deleting directory /tmp/spark-ce3e7d77-43f6-49de-8fa5-228799ca078c
[shutdown-hook-0] INFO org.apache.spark.util.ShutdownHookManager - Shutdown hook called
[shutdown-hook-0] INFO org.apache.spark.util.ShutdownHookManager - Deleting directory /tmp/spark-33b010f9-b5ab-439e-8cec-cff6ca21169e
[shutdown-hook-0] INFO org.apache.spark.util.ShutdownHookManager - Shutdown hook called
[shutdown-hook-0] INFO org.apache.spark.util.ShutdownHookManager - Deleting directory /tmp/spark-0b535b75-f36b-47d2-9386-882f4986b071

234 tests completed, 6 failed, 1 skipped

> Task :runners:spark:3:job-server:validatesPortableRunnerBatch FAILED
> Task :runners:spark:3:job-server:validatesPortableRunnerDocker
[shutdown-hook-0] INFO org.apache.spark.util.ShutdownHookManager - Shutdown hook called
[shutdown-hook-0] INFO org.apache.spark.util.ShutdownHookManager - Deleting directory /tmp/spark-07086cec-57d2-48b4-81c4-a1312a2c2cb1

FAILURE: Build failed with an exception.

* What went wrong:
Execution failed for task ':runners:spark:3:job-server:validatesPortableRunnerBatch'.
> There were failing tests. See the report at: file://<https://ci-beam.apache.org/job/beam_PostCommit_Java_PVR_Spark_Batch/ws/src/runners/spark/3/job-server/build/reports/tests/validatesPortableRunnerBatch/index.html>

* Try:
> Run with --stacktrace option to get the stack trace.
> Run with --info or --debug option to get more log output.

* Get more help at https://help.gradle.org

Deprecated Gradle features were used in this build, making it incompatible with Gradle 8.0.

You can use '--warning-mode all' to show the individual deprecation warnings and determine if they come from your own scripts or plugins.

See https://docs.gradle.org/7.6.2/userguide/command_line_interface.html#sec:command_line_warnings

Execution optimizations have been disabled for 1 invalid unit(s) of work during this build to ensure correctness.
Please consult deprecation warnings for more details.

BUILD FAILED in 1h 42m 50s
118 actionable tasks: 73 executed, 41 from cache, 4 up-to-date

Publishing build scan...
https://ge.apache.org/s/pmpv5y5kyyig2

Build step 'Invoke Gradle script' changed build result to FAILURE
Build step 'Invoke Gradle script' marked build as failure

---------------------------------------------------------------------
To unsubscribe, e-mail: builds-unsubscribe@beam.apache.org
For additional commands, e-mail: builds-help@beam.apache.org


Jenkins build is back to normal : beam_PostCommit_Java_PVR_Spark_Batch #2409

Posted by Apache Jenkins Server <je...@builds.apache.org>.
See <https://ci-beam.apache.org/job/beam_PostCommit_Java_PVR_Spark_Batch/2409/display/redirect>


---------------------------------------------------------------------
To unsubscribe, e-mail: builds-unsubscribe@beam.apache.org
For additional commands, e-mail: builds-help@beam.apache.org


Build failed in Jenkins: beam_PostCommit_Java_PVR_Spark_Batch #2408

Posted by Apache Jenkins Server <je...@builds.apache.org>.
See <https://ci-beam.apache.org/job/beam_PostCommit_Java_PVR_Spark_Batch/2408/display/redirect>

Changes:


------------------------------------------
[...truncated 58.07 KB...]
#16 DONE 0.2s

#17 [13/16] COPY target/LICENSE target/options/* /opt/apache/beam/options/
#17 DONE 0.2s

#18 [14/16] COPY target/go-licenses/* /opt/apache/beam/third_party_licenses/golang/
#18 DONE 0.1s

#19 [15/16] RUN if [ "true" = "false" ] ; then     rm -rf /opt/apache/beam/third_party_licenses ;    fi
#19 DONE 1.0s

#20 [16/16] COPY target/profiler/* /opt/google_cloud_profiler/
#20 DONE 0.1s

#21 exporting to image
#21 exporting layers
#21 exporting layers 0.5s done
#21 writing image sha256:eed28dba12d1435c718f9667014a80fdb3671152b7063e9824b99af31cca1bb4 done
#21 naming to docker.io/apache/beam_java8_sdk:2.51.0.dev done
#21 DONE 0.5s

> Task :runners:spark:3:job-server:validatesPortableRunnerBatch

org.apache.beam.sdk.transforms.CombineTest$WindowingTests > testCombineGloballyAsSingletonView FAILED
    java.lang.RuntimeException at CombineTest.java:1359

org.apache.beam.sdk.transforms.CombineTest$WindowingTests > testSlidingWindowsCombine FAILED
    java.lang.RuntimeException at CombineTest.java:1164

org.apache.beam.sdk.transforms.CombineTest$WindowingTests > testWindowedCombineGloballyAsSingletonView FAILED
    java.lang.RuntimeException at CombineTest.java:1402

org.apache.beam.sdk.transforms.ParDoTest$MultipleInputsAndOutputTests > testParDoEmptyWithTaggedOutput FAILED
    java.lang.RuntimeException at ParDoTest.java:765
[shutdown-hook-0] INFO org.apache.spark.util.ShutdownHookManager - Shutdown hook called
[shutdown-hook-0] INFO org.apache.spark.util.ShutdownHookManager - Deleting directory /tmp/spark-150065c0-2f5a-4f8a-bc27-fd3aca171c2a

org.apache.beam.sdk.transforms.ParDoTest$MultipleInputsAndOutputTests > testParDoWithTaggedOutput FAILED
    java.lang.RuntimeException at ParDoTest.java:723

org.apache.beam.sdk.transforms.ParDoTest$MultipleInputsAndOutputTests > testMultiOutputParDoWithSideInputsIsCumulative FAILED
    java.lang.RuntimeException at ParDoTest.java:1289

org.apache.beam.sdk.transforms.ParDoTest$MultipleInputsAndOutputTests > testSideInputAnnotationWithMultipleSideInputs FAILED
    java.lang.RuntimeException at ParDoTest.java:1179

org.apache.beam.sdk.transforms.ParDoTest$MultipleInputsAndOutputTests > testSideInputAnnotation FAILED
    java.lang.RuntimeException at ParDoTest.java:1076

org.apache.beam.sdk.transforms.ParDoTest$MultipleInputsAndOutputTests > testParDoWithEmptyTaggedOutput FAILED
    java.lang.RuntimeException at ParDoTest.java:789

org.apache.beam.sdk.transforms.ParDoTest$StateTests > testBagState FAILED
    java.lang.RuntimeException at ParDoTest.java:2627

org.apache.beam.sdk.transforms.ParDoTest$StateTests > testCombiningState FAILED
    java.lang.RuntimeException at ParDoTest.java:3497

org.apache.beam.sdk.transforms.ParDoTest$StateTests > testValueStateSameId FAILED
    java.lang.RuntimeException at ParDoTest.java:2528

org.apache.beam.sdk.transforms.ParDoTest$StateTests > testValueStateSimple FAILED
    java.lang.RuntimeException at ParDoTest.java:2292

org.apache.beam.sdk.transforms.ParDoTest$StateTests > testValueStateTaggedOutput FAILED
    java.lang.RuntimeException at ParDoTest.java:2579

org.apache.beam.sdk.transforms.ParDoTest$StateTests > testBagStateSideInput FAILED
    java.lang.RuntimeException at ParDoTest.java:3583

org.apache.beam.sdk.transforms.ParDoTest$StateTests > testCombiningStateParameterSuperclass FAILED
    java.lang.RuntimeException at ParDoTest.java:3533

org.apache.beam.sdk.transforms.ParDoTest$StateTests > testCoderInferenceOfList FAILED
    java.lang.RuntimeException at ParDoTest.java:2429

org.apache.beam.sdk.transforms.ParDoTest$StateTests > testValueStateDedup FAILED
    java.lang.RuntimeException at ParDoTest.java:2342

org.apache.beam.sdk.transforms.ParDoTest$StateTests > testValueStateFixedWindows FAILED
    java.lang.RuntimeException at ParDoTest.java:2473

org.apache.beam.sdk.transforms.ParDoTest$TimestampTests > testParDoTaggedOutputWithTimestamp FAILED
    java.lang.RuntimeException at ParDoTest.java:2030
[shutdown-hook-0] INFO org.apache.spark.util.ShutdownHookManager - Shutdown hook called
[shutdown-hook-0] INFO org.apache.spark.util.ShutdownHookManager - Deleting directory /tmp/spark-51453a7e-a4af-4dfb-bb8c-de5fc2d43ed7

org.apache.beam.sdk.transforms.ParDoTest$TimestampTests > testParDoShiftTimestampUnlimited FAILED
    java.lang.RuntimeException at ParDoTest.java:2142
[shutdown-hook-0] INFO org.apache.spark.util.ShutdownHookManager - Shutdown hook called
[shutdown-hook-0] INFO org.apache.spark.util.ShutdownHookManager - Deleting directory /tmp/spark-fa3adf7d-9da2-4b27-a6f8-dafd27b02697
[shutdown-hook-0] INFO org.apache.spark.util.ShutdownHookManager - Shutdown hook called
[shutdown-hook-0] INFO org.apache.spark.util.ShutdownHookManager - Deleting directory /tmp/spark-866f4d63-ee6f-420b-8e25-d6f5337ed5f7
[pool-786-thread-2] WARN org.apache.beam.fn.harness.control.ExecutionStateSampler - Operation ongoing in bundle 1 for at least 01h24m35s without outputting or completing:
  at sun.misc.Unsafe.park(Native Method)
  at java.util.concurrent.locks.LockSupport.park(LockSupport.java:175)
  at java.util.concurrent.locks.AbstractQueuedSynchronizer$ConditionObject.await(AbstractQueuedSynchronizer.java:2039)
  at org.apache.beam.sdk.fn.CancellableQueue.take(CancellableQueue.java:95)
  at org.apache.beam.sdk.fn.data.BeamFnDataInboundObserver.awaitCompletion(BeamFnDataInboundObserver.java:122)
  at org.apache.beam.fn.harness.control.ProcessBundleHandler.processBundle(ProcessBundleHandler.java:550)
  at org.apache.beam.fn.harness.FnHarness$$Lambda$1537/2029604552.apply(Unknown Source)
  at org.apache.beam.fn.harness.control.BeamFnControlClient.delegateOnInstructionRequestType(BeamFnControlClient.java:150)
  at org.apache.beam.fn.harness.control.BeamFnControlClient$InboundObserver.lambda$onNext$0(BeamFnControlClient.java:115)
  at org.apache.beam.fn.harness.control.BeamFnControlClient$InboundObserver$$Lambda$1561/1042746376.run(Unknown Source)
  at java.util.concurrent.Executors$RunnableAdapter.call(Executors.java:511)
  at java.util.concurrent.FutureTask.run(FutureTask.java:266)
  at org.apache.beam.sdk.util.UnboundedScheduledExecutorService$ScheduledFutureTask.run(UnboundedScheduledExecutorService.java:163)
  at java.util.concurrent.ThreadPoolExecutor.runWorker(ThreadPoolExecutor.java:1149)
  at java.util.concurrent.ThreadPoolExecutor$Worker.run(ThreadPoolExecutor.java:624)
  at java.lang.Thread.run(Thread.java:750)
[pool-1029-thread-2] WARN org.apache.beam.fn.harness.control.ExecutionStateSampler - Operation ongoing in bundle 6 for at least 01h18m38s without outputting or completing:
  at sun.misc.Unsafe.park(Native Method)
  at java.util.concurrent.locks.LockSupport.park(LockSupport.java:175)
  at java.util.concurrent.locks.AbstractQueuedSynchronizer$ConditionObject.await(AbstractQueuedSynchronizer.java:2039)
  at org.apache.beam.sdk.fn.CancellableQueue.take(CancellableQueue.java:95)
  at org.apache.beam.sdk.fn.data.BeamFnDataInboundObserver.awaitCompletion(BeamFnDataInboundObserver.java:122)
  at org.apache.beam.fn.harness.control.ProcessBundleHandler.processBundle(ProcessBundleHandler.java:550)
  at org.apache.beam.fn.harness.FnHarness$$Lambda$1537/2029604552.apply(Unknown Source)
  at org.apache.beam.fn.harness.control.BeamFnControlClient.delegateOnInstructionRequestType(BeamFnControlClient.java:150)
  at org.apache.beam.fn.harness.control.BeamFnControlClient$InboundObserver.lambda$onNext$0(BeamFnControlClient.java:115)
  at org.apache.beam.fn.harness.control.BeamFnControlClient$InboundObserver$$Lambda$1561/1042746376.run(Unknown Source)
  at java.util.concurrent.Executors$RunnableAdapter.call(Executors.java:511)
  at java.util.concurrent.FutureTask.run(FutureTask.java:266)
  at org.apache.beam.sdk.util.UnboundedScheduledExecutorService$ScheduledFutureTask.run(UnboundedScheduledExecutorService.java:163)
  at java.util.concurrent.ThreadPoolExecutor.runWorker(ThreadPoolExecutor.java:1149)
  at java.util.concurrent.ThreadPoolExecutor$Worker.run(ThreadPoolExecutor.java:624)
  at java.lang.Thread.run(Thread.java:750)
[pool-975-thread-2] WARN org.apache.beam.fn.harness.control.ExecutionStateSampler - Operation ongoing in bundle 5 for at least 01h20m08s without outputting or completing:
  at sun.misc.Unsafe.park(Native Method)
  at java.util.concurrent.locks.LockSupport.park(LockSupport.java:175)
  at java.util.concurrent.locks.AbstractQueuedSynchronizer$ConditionObject.await(AbstractQueuedSynchronizer.java:2039)
  at org.apache.beam.sdk.fn.CancellableQueue.take(CancellableQueue.java:95)
  at org.apache.beam.sdk.fn.data.BeamFnDataInboundObserver.awaitCompletion(BeamFnDataInboundObserver.java:122)
  at org.apache.beam.fn.harness.control.ProcessBundleHandler.processBundle(ProcessBundleHandler.java:550)
  at org.apache.beam.fn.harness.FnHarness$$Lambda$1537/2029604552.apply(Unknown Source)
  at org.apache.beam.fn.harness.control.BeamFnControlClient.delegateOnInstructionRequestType(BeamFnControlClient.java:150)
  at org.apache.beam.fn.harness.control.BeamFnControlClient$InboundObserver.lambda$onNext$0(BeamFnControlClient.java:115)
  at org.apache.beam.fn.harness.control.BeamFnControlClient$InboundObserver$$Lambda$1561/1042746376.run(Unknown Source)
  at java.util.concurrent.Executors$RunnableAdapter.call(Executors.java:511)
  at java.util.concurrent.FutureTask.run(FutureTask.java:266)
  at org.apache.beam.sdk.util.UnboundedScheduledExecutorService$ScheduledFutureTask.run(UnboundedScheduledExecutorService.java:163)
  at java.util.concurrent.ThreadPoolExecutor.runWorker(ThreadPoolExecutor.java:1149)
  at java.util.concurrent.ThreadPoolExecutor$Worker.run(ThreadPoolExecutor.java:624)
  at java.lang.Thread.run(Thread.java:750)
[pool-894-thread-2] WARN org.apache.beam.fn.harness.control.ExecutionStateSampler - Operation ongoing in bundle 4 for at least 01h22m11s without outputting or completing:
  at sun.misc.Unsafe.park(Native Method)
  at java.util.concurrent.locks.LockSupport.park(LockSupport.java:175)
  at java.util.concurrent.locks.AbstractQueuedSynchronizer$ConditionObject.await(AbstractQueuedSynchronizer.java:2039)
  at org.apache.beam.sdk.fn.CancellableQueue.take(CancellableQueue.java:95)
  at org.apache.beam.sdk.fn.data.BeamFnDataInboundObserver.awaitCompletion(BeamFnDataInboundObserver.java:122)
  at org.apache.beam.fn.harness.control.ProcessBundleHandler.processBundle(ProcessBundleHandler.java:550)
  at org.apache.beam.fn.harness.FnHarness$$Lambda$1537/2029604552.apply(Unknown Source)
  at org.apache.beam.fn.harness.control.BeamFnControlClient.delegateOnInstructionRequestType(BeamFnControlClient.java:150)
  at org.apache.beam.fn.harness.control.BeamFnControlClient$InboundObserver.lambda$onNext$0(BeamFnControlClient.java:115)
  at org.apache.beam.fn.harness.control.BeamFnControlClient$InboundObserver$$Lambda$1561/1042746376.run(Unknown Source)
  at java.util.concurrent.Executors$RunnableAdapter.call(Executors.java:511)
  at java.util.concurrent.FutureTask.run(FutureTask.java:266)
  at org.apache.beam.sdk.util.UnboundedScheduledExecutorService$ScheduledFutureTask.run(UnboundedScheduledExecutorService.java:163)
  at java.util.concurrent.ThreadPoolExecutor.runWorker(ThreadPoolExecutor.java:1149)
  at java.util.concurrent.ThreadPoolExecutor$Worker.run(ThreadPoolExecutor.java:624)
  at java.lang.Thread.run(Thread.java:750)
[pool-786-thread-2] WARN org.apache.beam.fn.harness.control.ExecutionStateSampler - Operation ongoing in bundle 1 for at least 01h24m36s without outputting or completing:
  at sun.misc.Unsafe.park(Native Method)
  at java.util.concurrent.locks.LockSupport.park(LockSupport.java:175)
  at java.util.concurrent.locks.AbstractQueuedSynchronizer$ConditionObject.await(AbstractQueuedSynchronizer.java:2039)
  at org.apache.beam.sdk.fn.CancellableQueue.take(CancellableQueue.java:95)
  at org.apache.beam.sdk.fn.data.BeamFnDataInboundObserver.awaitCompletion(BeamFnDataInboundObserver.java:122)
  at org.apache.beam.fn.harness.control.ProcessBundleHandler.processBundle(ProcessBundleHandler.java:550)
  at org.apache.beam.fn.harness.FnHarness$$Lambda$1537/2029604552.apply(Unknown Source)
  at org.apache.beam.fn.harness.control.BeamFnControlClient.delegateOnInstructionRequestType(BeamFnControlClient.java:150)
  at org.apache.beam.fn.harness.control.BeamFnControlClient$InboundObserver.lambda$onNext$0(BeamFnControlClient.java:115)
  at org.apache.beam.fn.harness.control.BeamFnControlClient$InboundObserver$$Lambda$1561/1042746376.run(Unknown Source)
  at java.util.concurrent.Executors$RunnableAdapter.call(Executors.java:511)
  at java.util.concurrent.FutureTask.run(FutureTask.java:266)
  at org.apache.beam.sdk.util.UnboundedScheduledExecutorService$ScheduledFutureTask.run(UnboundedScheduledExecutorService.java:163)
  at java.util.concurrent.ThreadPoolExecutor.runWorker(ThreadPoolExecutor.java:1149)
  at java.util.concurrent.ThreadPoolExecutor$Worker.run(ThreadPoolExecutor.java:624)
  at java.lang.Thread.run(Thread.java:750)
[pool-1029-thread-2] WARN org.apache.beam.fn.harness.control.ExecutionStateSampler - Operation ongoing in bundle 6 for at least 01h18m38s without outputting or completing:
  at sun.misc.Unsafe.park(Native Method)
  at java.util.concurrent.locks.LockSupport.park(LockSupport.java:175)
  at java.util.concurrent.locks.AbstractQueuedSynchronizer$ConditionObject.await(AbstractQueuedSynchronizer.java:2039)
  at org.apache.beam.sdk.fn.CancellableQueue.take(CancellableQueue.java:95)
  at org.apache.beam.sdk.fn.data.BeamFnDataInboundObserver.awaitCompletion(BeamFnDataInboundObserver.java:122)
  at org.apache.beam.fn.harness.control.ProcessBundleHandler.processBundle(ProcessBundleHandler.java:550)
  at org.apache.beam.fn.harness.FnHarness$$Lambda$1537/2029604552.apply(Unknown Source)
  at org.apache.beam.fn.harness.control.BeamFnControlClient.delegateOnInstructionRequestType(BeamFnControlClient.java:150)
  at org.apache.beam.fn.harness.control.BeamFnControlClient$InboundObserver.lambda$onNext$0(BeamFnControlClient.java:115)
  at org.apache.beam.fn.harness.control.BeamFnControlClient$InboundObserver$$Lambda$1561/1042746376.run(Unknown Source)
  at java.util.concurrent.Executors$RunnableAdapter.call(Executors.java:511)
  at java.util.concurrent.FutureTask.run(FutureTask.java:266)
  at org.apache.beam.sdk.util.UnboundedScheduledExecutorService$ScheduledFutureTask.run(UnboundedScheduledExecutorService.java:163)
  at java.util.concurrent.ThreadPoolExecutor.runWorker(ThreadPoolExecutor.java:1149)
  at java.util.concurrent.ThreadPoolExecutor$Worker.run(ThreadPoolExecutor.java:624)
  at java.lang.Thread.run(Thread.java:750)
[pool-975-thread-2] WARN org.apache.beam.fn.harness.control.ExecutionStateSampler - Operation ongoing in bundle 5 for at least 01h20m08s without outputting or completing:
  at sun.misc.Unsafe.park(Native Method)
  at java.util.concurrent.locks.LockSupport.park(LockSupport.java:175)
  at java.util.concurrent.locks.AbstractQueuedSynchronizer$ConditionObject.await(AbstractQueuedSynchronizer.java:2039)
  at org.apache.beam.sdk.fn.CancellableQueue.take(CancellableQueue.java:95)
  at org.apache.beam.sdk.fn.data.BeamFnDataInboundObserver.awaitCompletion(BeamFnDataInboundObserver.java:122)
  at org.apache.beam.fn.harness.control.ProcessBundleHandler.processBundle(ProcessBundleHandler.java:550)
  at org.apache.beam.fn.harness.FnHarness$$Lambda$1537/2029604552.apply(Unknown Source)
  at org.apache.beam.fn.harness.control.BeamFnControlClient.delegateOnInstructionRequestType(BeamFnControlClient.java:150)
  at org.apache.beam.fn.harness.control.BeamFnControlClient$InboundObserver.lambda$onNext$0(BeamFnControlClient.java:115)
  at org.apache.beam.fn.harness.control.BeamFnControlClient$InboundObserver$$Lambda$1561/1042746376.run(Unknown Source)
  at java.util.concurrent.Executors$RunnableAdapter.call(Executors.java:511)
  at java.util.concurrent.FutureTask.run(FutureTask.java:266)
  at org.apache.beam.sdk.util.UnboundedScheduledExecutorService$ScheduledFutureTask.run(UnboundedScheduledExecutorService.java:163)
  at java.util.concurrent.ThreadPoolExecutor.runWorker(ThreadPoolExecutor.java:1149)
  at java.util.concurrent.ThreadPoolExecutor$Worker.run(ThreadPoolExecutor.java:624)
  at java.lang.Thread.run(Thread.java:750)

234 tests completed, 21 failed, 1 skipped

> Task :runners:spark:3:job-server:validatesPortableRunnerBatch FAILED
> Task :runners:spark:3:job-server:validatesPortableRunnerDocker
[shutdown-hook-0] INFO org.apache.spark.util.ShutdownHookManager - Shutdown hook called
[shutdown-hook-0] INFO org.apache.spark.util.ShutdownHookManager - Deleting directory /tmp/spark-914631b4-b17b-4395-bbb2-b2018825a685

FAILURE: Build failed with an exception.

* What went wrong:
Execution failed for task ':runners:spark:3:job-server:validatesPortableRunnerBatch'.
> There were failing tests. See the report at: file://<https://ci-beam.apache.org/job/beam_PostCommit_Java_PVR_Spark_Batch/ws/src/runners/spark/3/job-server/build/reports/tests/validatesPortableRunnerBatch/index.html>

* Try:
> Run with --stacktrace option to get the stack trace.
> Run with --info or --debug option to get more log output.

* Get more help at https://help.gradle.org

Deprecated Gradle features were used in this build, making it incompatible with Gradle 8.0.

You can use '--warning-mode all' to show the individual deprecation warnings and determine if they come from your own scripts or plugins.

See https://docs.gradle.org/7.6.2/userguide/command_line_interface.html#sec:command_line_warnings

Execution optimizations have been disabled for 1 invalid unit(s) of work during this build to ensure correctness.
Please consult deprecation warnings for more details.

BUILD FAILED in 1h 41m 13s
118 actionable tasks: 73 executed, 41 from cache, 4 up-to-date

Publishing build scan...
https://ge.apache.org/s/r5u6jas76ds2g

Build step 'Invoke Gradle script' changed build result to FAILURE
Build step 'Invoke Gradle script' marked build as failure

---------------------------------------------------------------------
To unsubscribe, e-mail: builds-unsubscribe@beam.apache.org
For additional commands, e-mail: builds-help@beam.apache.org