You are viewing a plain text version of this content. The canonical link for it is here.
Posted to dev@kafka.apache.org by Apache Jenkins Server <je...@builds.apache.org> on 2016/03/25 19:27:17 UTC

Build failed in Jenkins: kafka-trunk-jdk8 #481

See <https://builds.apache.org/job/kafka-trunk-jdk8/481/changes>

Changes:

[cshapi] KAFKA-3460: Remove old 0.7 KafkaMigrationTool

------------------------------------------
[...truncated 1623 lines...]

kafka.log.LogTest > testTruncateTo PASSED

kafka.log.LogTest > testCleanShutdownFile PASSED

kafka.log.OffsetIndexTest > lookupExtremeCases PASSED

kafka.log.OffsetIndexTest > appendTooMany PASSED

kafka.log.OffsetIndexTest > randomLookupTest PASSED

kafka.log.OffsetIndexTest > testReopen PASSED

kafka.log.OffsetIndexTest > appendOutOfOrder PASSED

kafka.log.OffsetIndexTest > truncate PASSED

kafka.log.LogSegmentTest > testRecoveryWithCorruptMessage PASSED

kafka.log.LogSegmentTest > testRecoveryFixesCorruptIndex PASSED

kafka.log.LogSegmentTest > testReadFromGap PASSED

kafka.log.LogSegmentTest > testTruncate PASSED

kafka.log.LogSegmentTest > testReadBeforeFirstOffset PASSED

kafka.log.LogSegmentTest > testCreateWithInitFileSizeAppendMessage PASSED

kafka.log.LogSegmentTest > testChangeFileSuffixes PASSED

kafka.log.LogSegmentTest > testMaxOffset PASSED

kafka.log.LogSegmentTest > testNextOffsetCalculation PASSED

kafka.log.LogSegmentTest > testReadOnEmptySegment PASSED

kafka.log.LogSegmentTest > testReadAfterLast PASSED

kafka.log.LogSegmentTest > testCreateWithInitFileSizeClearShutdown PASSED

kafka.log.LogSegmentTest > testTruncateFull PASSED

kafka.log.CleanerTest > testBuildOffsetMap PASSED

kafka.log.CleanerTest > testSegmentGrouping PASSED

kafka.log.CleanerTest > testCleanSegmentsWithAbort PASSED

kafka.log.CleanerTest > testSegmentGroupingWithSparseOffsets PASSED

kafka.log.CleanerTest > testRecoveryAfterCrash PASSED

kafka.log.CleanerTest > testLogToClean PASSED

kafka.log.CleanerTest > testCleaningWithDeletes PASSED

kafka.log.CleanerTest > testCleanSegments PASSED

kafka.log.CleanerTest > testCleaningWithUnkeyedMessages PASSED

kafka.log.OffsetMapTest > testClear PASSED

kafka.log.OffsetMapTest > testBasicValidation PASSED

kafka.coordinator.GroupCoordinatorResponseTest > testHeartbeatWrongCoordinator PASSED

kafka.coordinator.GroupCoordinatorResponseTest > testDescribeGroupStable PASSED

kafka.coordinator.GroupCoordinatorResponseTest > testHeartbeatIllegalGeneration PASSED

kafka.coordinator.GroupCoordinatorResponseTest > testDescribeGroupWrongCoordinator PASSED

kafka.coordinator.GroupCoordinatorResponseTest > testDescribeGroupRebalancing PASSED

kafka.coordinator.GroupCoordinatorResponseTest > testLeaderFailureInSyncGroup PASSED

kafka.coordinator.GroupCoordinatorResponseTest > testGenerationIdIncrementsOnRebalance PASSED

kafka.coordinator.GroupCoordinatorResponseTest > testSyncGroupFromIllegalGeneration PASSED

kafka.coordinator.GroupCoordinatorResponseTest > testInvalidGroupId PASSED

kafka.coordinator.GroupCoordinatorResponseTest > testHeartbeatUnknownGroup PASSED

kafka.coordinator.GroupCoordinatorResponseTest > testListGroupsIncludesStableGroups PASSED

kafka.coordinator.GroupCoordinatorResponseTest > testHeartbeatDuringRebalanceCausesRebalanceInProgress PASSED

kafka.coordinator.GroupCoordinatorResponseTest > testJoinGroupInconsistentGroupProtocol PASSED

kafka.coordinator.GroupCoordinatorResponseTest > testJoinGroupSessionTimeoutTooLarge PASSED

kafka.coordinator.GroupCoordinatorResponseTest > testJoinGroupSessionTimeoutTooSmall PASSED

kafka.coordinator.GroupCoordinatorResponseTest > testSyncGroupEmptyAssignment PASSED

kafka.coordinator.GroupCoordinatorResponseTest > testCommitOffsetWithDefaultGeneration PASSED

kafka.coordinator.GroupCoordinatorResponseTest > testJoinGroupFromUnchangedLeaderShouldRebalance PASSED

kafka.coordinator.GroupCoordinatorResponseTest > testHeartbeatRebalanceInProgress PASSED

kafka.coordinator.GroupCoordinatorResponseTest > testLeaveGroupUnknownGroup PASSED

kafka.coordinator.GroupCoordinatorResponseTest > testListGroupsIncludesRebalancingGroups PASSED

kafka.coordinator.GroupCoordinatorResponseTest > testSyncGroupFollowerAfterLeader PASSED

kafka.coordinator.GroupCoordinatorResponseTest > testCommitOffsetInAwaitingSync PASSED

kafka.coordinator.GroupCoordinatorResponseTest > testJoinGroupWrongCoordinator PASSED

kafka.coordinator.GroupCoordinatorResponseTest > testJoinGroupUnknownConsumerExistingGroup PASSED

kafka.coordinator.GroupCoordinatorResponseTest > testSyncGroupFromUnknownGroup PASSED

kafka.coordinator.GroupCoordinatorResponseTest > testJoinGroupInconsistentProtocolType PASSED

kafka.coordinator.GroupCoordinatorResponseTest > testCommitOffsetFromUnknownGroup PASSED

kafka.coordinator.GroupCoordinatorResponseTest > testLeaveGroupWrongCoordinator PASSED

kafka.coordinator.GroupCoordinatorResponseTest > testLeaveGroupUnknownConsumerExistingGroup PASSED

kafka.coordinator.GroupCoordinatorResponseTest > testJoinGroupUnknownConsumerNewGroup PASSED

kafka.coordinator.GroupCoordinatorResponseTest > testJoinGroupFromUnchangedFollowerDoesNotRebalance PASSED

kafka.coordinator.GroupCoordinatorResponseTest > testValidJoinGroup PASSED

kafka.coordinator.GroupCoordinatorResponseTest > testSyncGroupLeaderAfterFollower PASSED

kafka.coordinator.GroupCoordinatorResponseTest > testSyncGroupFromUnknownMember PASSED

kafka.coordinator.GroupCoordinatorResponseTest > testValidLeaveGroup PASSED

kafka.coordinator.GroupCoordinatorResponseTest > testDescribeGroupInactiveGroup PASSED

kafka.coordinator.GroupCoordinatorResponseTest > testSyncGroupNotCoordinator PASSED

kafka.coordinator.GroupCoordinatorResponseTest > testHeartbeatUnknownConsumerExistingGroup PASSED

kafka.coordinator.GroupCoordinatorResponseTest > testValidHeartbeat PASSED

kafka.coordinator.MemberMetadataTest > testMatchesSupportedProtocols PASSED

kafka.coordinator.MemberMetadataTest > testMetadata PASSED

kafka.coordinator.MemberMetadataTest > testMetadataRaisesOnUnsupportedProtocol PASSED

kafka.coordinator.MemberMetadataTest > testVoteForPreferredProtocol PASSED

kafka.coordinator.MemberMetadataTest > testVoteRaisesOnNoSupportedProtocols PASSED

kafka.coordinator.GroupMetadataTest > testDeadToAwaitingSyncIllegalTransition PASSED

kafka.coordinator.GroupMetadataTest > testPreparingRebalanceToStableIllegalTransition PASSED

kafka.coordinator.GroupMetadataTest > testCannotRebalanceWhenDead PASSED

kafka.coordinator.GroupMetadataTest > testSelectProtocol PASSED

kafka.coordinator.GroupMetadataTest > testCannotRebalanceWhenPreparingRebalance PASSED

kafka.coordinator.GroupMetadataTest > testDeadToPreparingRebalanceIllegalTransition PASSED

kafka.coordinator.GroupMetadataTest > testCanRebalanceWhenAwaitingSync PASSED

kafka.coordinator.GroupMetadataTest > testAwaitingSyncToPreparingRebalanceTransition PASSED

kafka.coordinator.GroupMetadataTest > testStableToAwaitingSyncIllegalTransition PASSED

kafka.coordinator.GroupMetadataTest > testDeadToDeadIllegalTransition PASSED

kafka.coordinator.GroupMetadataTest > testSelectProtocolRaisesIfNoMembers PASSED

kafka.coordinator.GroupMetadataTest > testStableToPreparingRebalanceTransition PASSED

kafka.coordinator.GroupMetadataTest > testPreparingRebalanceToDeadTransition PASSED

kafka.coordinator.GroupMetadataTest > testStableToStableIllegalTransition PASSED

kafka.coordinator.GroupMetadataTest > testAwaitingSyncToStableTransition PASSED

kafka.coordinator.GroupMetadataTest > testDeadToStableIllegalTransition PASSED

kafka.coordinator.GroupMetadataTest > testAwaitingSyncToAwaitingSyncIllegalTransition PASSED

kafka.coordinator.GroupMetadataTest > testSupportsProtocols PASSED

kafka.coordinator.GroupMetadataTest > testCanRebalanceWhenStable PASSED

kafka.coordinator.GroupMetadataTest > testPreparingRebalanceToPreparingRebalanceIllegalTransition PASSED

kafka.coordinator.GroupMetadataTest > testSelectProtocolChoosesCompatibleProtocol PASSED

kafka.javaapi.message.ByteBufferMessageSetTest > testSizeInBytesWithCompression PASSED

kafka.javaapi.message.ByteBufferMessageSetTest > testIteratorIsConsistentWithCompression PASSED

kafka.javaapi.message.ByteBufferMessageSetTest > testIteratorIsConsistent PASSED

kafka.javaapi.message.ByteBufferMessageSetTest > testEqualsWithCompression PASSED

kafka.javaapi.message.ByteBufferMessageSetTest > testWrittenEqualsRead PASSED

kafka.javaapi.message.ByteBufferMessageSetTest > testEquals PASSED

kafka.javaapi.message.ByteBufferMessageSetTest > testSizeInBytes PASSED

kafka.javaapi.consumer.ZookeeperConsumerConnectorTest > testBasic PASSED

kafka.KafkaTest > testGetKafkaConfigFromArgsWrongSetValue PASSED

kafka.KafkaTest > testKafkaSslPasswords PASSED

kafka.KafkaTest > testGetKafkaConfigFromArgs PASSED

kafka.KafkaTest > testGetKafkaConfigFromArgsNonArgsAtTheEnd PASSED

kafka.KafkaTest > testGetKafkaConfigFromArgsNonArgsOnly PASSED

kafka.KafkaTest > testGetKafkaConfigFromArgsNonArgsAtTheBegging PASSED

kafka.controller.ControllerFailoverTest > testMetadataUpdate PASSED

722 tests completed, 1 failed
:kafka-trunk-jdk8:core:test FAILED
:test_core_2_10 FAILED

FAILURE: Build failed with an exception.

* What went wrong:
Execution failed for task ':core:test'.
> There were failing tests. See the report at: file://<https://builds.apache.org/job/kafka-trunk-jdk8/ws/core/build/reports/tests/index.html>

* Try:
Run with --stacktrace option to get the stack trace. Run with --info or --debug option to get more log output.

BUILD FAILED

Total time: 1 hrs 13 mins 32.537 secs
Build step 'Execute shell' marked build as failure
Recording test results
Setting JDK1_8_0_45_HOME=/home/jenkins/jenkins-slave/tools/hudson.model.JDK/jdk1.8.0_45
Setting GRADLE_2_4_RC_2_HOME=/home/jenkins/jenkins-slave/tools/hudson.plugins.gradle.GradleInstallation/Gradle_2.4-rc-2
Setting JDK1_8_0_45_HOME=/home/jenkins/jenkins-slave/tools/hudson.model.JDK/jdk1.8.0_45
Setting GRADLE_2_4_RC_2_HOME=/home/jenkins/jenkins-slave/tools/hudson.plugins.gradle.GradleInstallation/Gradle_2.4-rc-2

Jenkins build is back to normal : kafka-trunk-jdk8 #489

Posted by Apache Jenkins Server <je...@builds.apache.org>.
See <https://builds.apache.org/job/kafka-trunk-jdk8/489/changes>


Build failed in Jenkins: kafka-trunk-jdk8 #488

Posted by Apache Jenkins Server <je...@builds.apache.org>.
See <https://builds.apache.org/job/kafka-trunk-jdk8/488/changes>

Changes:

[wangguoz] MINOR: Remove a couple of redundant `CoreUtils.rm` methods

------------------------------------------
[...truncated 2959 lines...]

kafka.admin.DeleteTopicTest > testResumeDeleteTopicWithRecoveredFollower PASSED

kafka.admin.DeleteTopicTest > testDeleteTopicAlreadyMarkedAsDeleted PASSED

kafka.admin.DeleteTopicTest > testPartitionReassignmentDuringDeleteTopic PASSED

kafka.admin.DeleteTopicTest > testDeleteNonExistingTopic PASSED

kafka.admin.DeleteTopicTest > testRecreateTopicAfterDeletion PASSED

kafka.admin.DeleteTopicTest > testAddPartitionDuringDeleteTopic PASSED

kafka.admin.DeleteTopicTest > testDeleteTopicWithAllAliveReplicas PASSED

kafka.admin.DeleteTopicTest > testDeleteTopicDuringAddPartition PASSED

kafka.admin.AdminTest > testBasicPreferredReplicaElection PASSED

kafka.admin.AdminTest > testPreferredReplicaJsonData PASSED

kafka.admin.AdminTest > testReassigningNonExistingPartition PASSED

kafka.admin.AdminTest > testGetBrokerMetadatas PASSED

kafka.admin.AdminTest > testBootstrapClientIdConfig PASSED

kafka.admin.AdminTest > testPartitionReassignmentNonOverlappingReplicas PASSED

kafka.admin.AdminTest > testReplicaAssignment PASSED

kafka.admin.AdminTest > testPartitionReassignmentWithLeaderNotInNewReplicas PASSED

kafka.admin.AdminTest > testTopicConfigChange PASSED

kafka.admin.AdminTest > testResumePartitionReassignmentThatWasCompleted PASSED

kafka.admin.AdminTest > testManualReplicaAssignment PASSED

kafka.admin.AdminTest > testPartitionReassignmentWithLeaderInNewReplicas PASSED

kafka.admin.AdminTest > testShutdownBroker PASSED

kafka.admin.AdminTest > testTopicCreationWithCollision PASSED

kafka.admin.AdminTest > testTopicCreationInZK PASSED

kafka.admin.TopicCommandTest > testCreateIfNotExists PASSED

kafka.admin.TopicCommandTest > testCreateAlterTopicWithRackAware PASSED

kafka.admin.TopicCommandTest > testTopicDeletion PASSED

kafka.admin.TopicCommandTest > testConfigPreservationAcrossPartitionAlteration PASSED

kafka.admin.TopicCommandTest > testAlterIfExists PASSED

kafka.admin.TopicCommandTest > testDeleteIfExists PASSED

kafka.admin.ConfigCommandTest > testArgumentParse PASSED

kafka.admin.AddPartitionsTest > testReplicaPlacementAllServers PASSED

kafka.admin.AddPartitionsTest > testWrongReplicaCount PASSED

kafka.admin.AddPartitionsTest > testReplicaPlacementPartialServers PASSED

kafka.admin.AddPartitionsTest > testTopicDoesNotExist PASSED

kafka.admin.AddPartitionsTest > testIncrementPartitions PASSED

kafka.admin.AddPartitionsTest > testManualAssignmentOfReplicas PASSED

kafka.admin.DeleteConsumerGroupTest > testGroupWideDeleteInZKDoesNothingForActiveConsumerGroup PASSED

kafka.admin.DeleteConsumerGroupTest > testGroupTopicWideDeleteInZKDoesNothingForActiveGroupConsumingMultipleTopics PASSED

kafka.admin.DeleteConsumerGroupTest > testConsumptionOnRecreatedTopicAfterTopicWideDeleteInZK PASSED

kafka.admin.DeleteConsumerGroupTest > testTopicWideDeleteInZK PASSED

kafka.admin.DeleteConsumerGroupTest > testGroupTopicWideDeleteInZKForGroupConsumingOneTopic PASSED

kafka.admin.DeleteConsumerGroupTest > testGroupTopicWideDeleteInZKForGroupConsumingMultipleTopics PASSED

kafka.admin.DeleteConsumerGroupTest > testGroupWideDeleteInZK PASSED

kafka.admin.AclCommandTest > testInvalidAuthorizerProperty PASSED

kafka.admin.AclCommandTest > testAclCli PASSED

kafka.admin.AclCommandTest > testProducerConsumerCli PASSED

kafka.admin.AdminRackAwareTest > testAssignmentWithRackAwareWithUnevenRacks PASSED

kafka.admin.AdminRackAwareTest > testAssignmentWith2ReplicasRackAware PASSED

kafka.admin.AdminRackAwareTest > testAssignmentWithRackAwareWithUnevenReplicas PASSED

kafka.admin.AdminRackAwareTest > testSkipBrokerWithReplicaAlreadyAssigned PASSED

kafka.admin.AdminRackAwareTest > testAssignmentWithRackAware PASSED

kafka.admin.AdminRackAwareTest > testRackAwareExpansion PASSED

kafka.admin.AdminRackAwareTest > testAssignmentWith2ReplicasRackAwareWith6Partitions PASSED

kafka.admin.AdminRackAwareTest > testAssignmentWith2ReplicasRackAwareWith6PartitionsAnd3Brokers PASSED

kafka.admin.AdminRackAwareTest > testGetRackAlternatedBrokerListAndAssignReplicasToBrokers PASSED

kafka.admin.AdminRackAwareTest > testMoreReplicasThanRacks PASSED

kafka.admin.AdminRackAwareTest > testSingleRack PASSED

kafka.admin.AdminRackAwareTest > testAssignmentWithRackAwareWithRandomStartIndex PASSED

kafka.admin.AdminRackAwareTest > testLargeNumberPartitionsAssignment PASSED

kafka.admin.AdminRackAwareTest > testLessReplicasThanRacks PASSED

kafka.admin.ReassignPartitionsCommandTest > testRackAwareReassign PASSED

kafka.cluster.BrokerEndPointTest > testEndpointFromUri PASSED

kafka.cluster.BrokerEndPointTest > testHashAndEquals PASSED

kafka.cluster.BrokerEndPointTest > testFromJsonFutureVersion PASSED

kafka.cluster.BrokerEndPointTest > testBrokerEndpointFromUri PASSED

kafka.cluster.BrokerEndPointTest > testFromJsonV1 PASSED

kafka.cluster.BrokerEndPointTest > testFromJsonV2 PASSED

kafka.common.TopicTest > testInvalidTopicNames PASSED

kafka.common.TopicTest > testTopicHasCollision PASSED

kafka.common.TopicTest > testTopicHasCollisionChars PASSED

kafka.common.ConfigTest > testInvalidGroupIds PASSED

kafka.common.ConfigTest > testInvalidClientIds PASSED

kafka.common.ZkNodeChangeNotificationListenerTest > testProcessNotification PASSED
ERROR: Could not install JDK1_8_0_45_HOME
java.lang.NullPointerException
	at hudson.plugins.toolenv.ToolEnvBuildWrapper$1.buildEnvVars(ToolEnvBuildWrapper.java:46)
	at hudson.model.AbstractBuild.getEnvironment(AbstractBuild.java:947)
	at hudson.plugins.git.GitSCM.getParamExpandedRepos(GitSCM.java:390)
	at hudson.plugins.git.GitSCM.compareRemoteRevisionWithImpl(GitSCM.java:577)
	at hudson.plugins.git.GitSCM.compareRemoteRevisionWith(GitSCM.java:527)
	at hudson.scm.SCM.compareRemoteRevisionWith(SCM.java:381)
	at hudson.scm.SCM.poll(SCM.java:398)
	at hudson.model.AbstractProject._poll(AbstractProject.java:1453)
	at hudson.model.AbstractProject.poll(AbstractProject.java:1356)
	at hudson.triggers.SCMTrigger$Runner.runPolling(SCMTrigger.java:526)
	at hudson.triggers.SCMTrigger$Runner.run(SCMTrigger.java:555)
	at hudson.util.SequentialExecutionQueue$QueueEntry.run(SequentialExecutionQueue.java:119)
	at java.util.concurrent.Executors$RunnableAdapter.call(Executors.java:471)
	at java.util.concurrent.FutureTask.run(FutureTask.java:262)
	at java.util.concurrent.ThreadPoolExecutor.runWorker(ThreadPoolExecutor.java:1145)
	at java.util.concurrent.ThreadPoolExecutor$Worker.run(ThreadPoolExecutor.java:615)
	at java.lang.Thread.run(Thread.java:745)
ERROR: Could not install GRADLE_2_4_RC_2_HOME
java.lang.NullPointerException
	at hudson.plugins.toolenv.ToolEnvBuildWrapper$1.buildEnvVars(ToolEnvBuildWrapper.java:46)
	at hudson.model.AbstractBuild.getEnvironment(AbstractBuild.java:947)
	at hudson.plugins.git.GitSCM.getParamExpandedRepos(GitSCM.java:390)
	at hudson.plugins.git.GitSCM.compareRemoteRevisionWithImpl(GitSCM.java:577)
	at hudson.plugins.git.GitSCM.compareRemoteRevisionWith(GitSCM.java:527)
	at hudson.scm.SCM.compareRemoteRevisionWith(SCM.java:381)
	at hudson.scm.SCM.poll(SCM.java:398)
	at hudson.model.AbstractProject._poll(AbstractProject.java:1453)
	at hudson.model.AbstractProject.poll(AbstractProject.java:1356)
	at hudson.triggers.SCMTrigger$Runner.runPolling(SCMTrigger.java:526)
	at hudson.triggers.SCMTrigger$Runner.run(SCMTrigger.java:555)
	at hudson.util.SequentialExecutionQueue$QueueEntry.run(SequentialExecutionQueue.java:119)
	at java.util.concurrent.Executors$RunnableAdapter.call(Executors.java:471)
	at java.util.concurrent.FutureTask.run(FutureTask.java:262)
	at java.util.concurrent.ThreadPoolExecutor.runWorker(ThreadPoolExecutor.java:1145)
	at java.util.concurrent.ThreadPoolExecutor$Worker.run(ThreadPoolExecutor.java:615)
	at java.lang.Thread.run(Thread.java:745)

kafka.consumer.PartitionAssignorTest > testRoundRobinPartitionAssignor PASSED

kafka.consumer.PartitionAssignorTest > testRangePartitionAssignor PASSED

kafka.consumer.ConsumerIteratorTest > testConsumerIteratorDeduplicationDeepIterator PASSED

kafka.consumer.ConsumerIteratorTest > testConsumerIteratorDecodingFailure PASSED

kafka.consumer.MetricsTest > testMetricsReporterAfterDeletingTopic PASSED

kafka.consumer.MetricsTest > testMetricsLeak PASSED

kafka.consumer.TopicFilterTest > testWhitelists PASSED

kafka.consumer.TopicFilterTest > testWildcardTopicCountGetTopicCountMapEscapeJson PASSED

kafka.consumer.TopicFilterTest > testBlacklists PASSED

kafka.consumer.ZookeeperConsumerConnectorTest > testBasic PASSED

kafka.consumer.ZookeeperConsumerConnectorTest > testCompressionSetConsumption PASSED

kafka.consumer.ZookeeperConsumerConnectorTest > testLeaderSelectionForPartition PASSED

kafka.consumer.ZookeeperConsumerConnectorTest > testConsumerDecoder PASSED

kafka.consumer.ZookeeperConsumerConnectorTest > testConsumerRebalanceListener PASSED

kafka.consumer.ZookeeperConsumerConnectorTest > testCompression PASSED

kafka.controller.ControllerFailoverTest > testMetadataUpdate PASSED

kafka.producer.ProducerTest > testSendToNewTopic PASSED

kafka.producer.ProducerTest > testAsyncSendCanCorrectlyFailWithTimeout PASSED

kafka.producer.ProducerTest > testSendNullMessage PASSED

kafka.producer.ProducerTest > testUpdateBrokerPartitionInfo PASSED

kafka.producer.ProducerTest > testSendWithDeadBroker PASSED

618 tests completed, 2 failed
:kafka-trunk-jdk8:core:test FAILED
:test_core_2_11 FAILED

FAILURE: Build failed with an exception.

* What went wrong:
Execution failed for task ':core:test'.
> Process 'Gradle Test Executor 2' finished with non-zero exit value 137

* Try:
Run with --stacktrace option to get the stack trace. Run with --info or --debug option to get more log output.

BUILD FAILED

Total time: 1 hrs 6 mins 44.914 secs
Build step 'Execute shell' marked build as failure
Recording test results
Setting JDK1_8_0_45_HOME=/home/jenkins/jenkins-slave/tools/hudson.model.JDK/jdk1.8.0_45
Setting GRADLE_2_4_RC_2_HOME=/home/jenkins/jenkins-slave/tools/hudson.plugins.gradle.GradleInstallation/Gradle_2.4-rc-2
Setting JDK1_8_0_45_HOME=/home/jenkins/jenkins-slave/tools/hudson.model.JDK/jdk1.8.0_45
Setting GRADLE_2_4_RC_2_HOME=/home/jenkins/jenkins-slave/tools/hudson.plugins.gradle.GradleInstallation/Gradle_2.4-rc-2

Build failed in Jenkins: kafka-trunk-jdk8 #487

Posted by Apache Jenkins Server <je...@builds.apache.org>.
See <https://builds.apache.org/job/kafka-trunk-jdk8/487/changes>

Changes:

[junrao] MINOR: Fix typo and tweak wording in `RecordAccumulator` comments

------------------------------------------
[...truncated 3454 lines...]

kafka.log.LogCleanerIntegrationTest > cleanerTest[0] PASSED

kafka.log.LogCleanerIntegrationTest > cleanerTest[1] PASSED

kafka.log.LogCleanerIntegrationTest > cleanerTest[2] PASSED

kafka.log.LogCleanerIntegrationTest > cleanerTest[3] PASSED

kafka.log.LogManagerTest > testCleanupSegmentsToMaintainSize PASSED

kafka.log.LogManagerTest > testRecoveryDirectoryMappingWithRelativeDirectory PASSED

kafka.log.LogManagerTest > testGetNonExistentLog PASSED

kafka.log.LogManagerTest > testTwoLogManagersUsingSameDirFails PASSED

kafka.log.LogManagerTest > testLeastLoadedAssignment PASSED
ERROR: Could not install JDK1_8_0_45_HOME
java.lang.NullPointerException
	at hudson.plugins.toolenv.ToolEnvBuildWrapper$1.buildEnvVars(ToolEnvBuildWrapper.java:46)
	at hudson.model.AbstractBuild.getEnvironment(AbstractBuild.java:947)
	at hudson.plugins.git.GitSCM.getParamExpandedRepos(GitSCM.java:390)
	at hudson.plugins.git.GitSCM.compareRemoteRevisionWithImpl(GitSCM.java:577)
	at hudson.plugins.git.GitSCM.compareRemoteRevisionWith(GitSCM.java:527)
	at hudson.scm.SCM.compareRemoteRevisionWith(SCM.java:381)
	at hudson.scm.SCM.poll(SCM.java:398)
	at hudson.model.AbstractProject._poll(AbstractProject.java:1453)
	at hudson.model.AbstractProject.poll(AbstractProject.java:1356)
	at hudson.triggers.SCMTrigger$Runner.runPolling(SCMTrigger.java:526)
	at hudson.triggers.SCMTrigger$Runner.run(SCMTrigger.java:555)
	at hudson.util.SequentialExecutionQueue$QueueEntry.run(SequentialExecutionQueue.java:119)
	at java.util.concurrent.Executors$RunnableAdapter.call(Executors.java:471)
	at java.util.concurrent.FutureTask.run(FutureTask.java:262)
	at java.util.concurrent.ThreadPoolExecutor.runWorker(ThreadPoolExecutor.java:1145)
	at java.util.concurrent.ThreadPoolExecutor$Worker.run(ThreadPoolExecutor.java:615)
	at java.lang.Thread.run(Thread.java:745)
ERROR: Could not install GRADLE_2_4_RC_2_HOME
java.lang.NullPointerException
	at hudson.plugins.toolenv.ToolEnvBuildWrapper$1.buildEnvVars(ToolEnvBuildWrapper.java:46)
	at hudson.model.AbstractBuild.getEnvironment(AbstractBuild.java:947)
	at hudson.plugins.git.GitSCM.getParamExpandedRepos(GitSCM.java:390)
	at hudson.plugins.git.GitSCM.compareRemoteRevisionWithImpl(GitSCM.java:577)
	at hudson.plugins.git.GitSCM.compareRemoteRevisionWith(GitSCM.java:527)
	at hudson.scm.SCM.compareRemoteRevisionWith(SCM.java:381)
	at hudson.scm.SCM.poll(SCM.java:398)
	at hudson.model.AbstractProject._poll(AbstractProject.java:1453)
	at hudson.model.AbstractProject.poll(AbstractProject.java:1356)
	at hudson.triggers.SCMTrigger$Runner.runPolling(SCMTrigger.java:526)
	at hudson.triggers.SCMTrigger$Runner.run(SCMTrigger.java:555)
	at hudson.util.SequentialExecutionQueue$QueueEntry.run(SequentialExecutionQueue.java:119)
	at java.util.concurrent.Executors$RunnableAdapter.call(Executors.java:471)
	at java.util.concurrent.FutureTask.run(FutureTask.java:262)
	at java.util.concurrent.ThreadPoolExecutor.runWorker(ThreadPoolExecutor.java:1145)
	at java.util.concurrent.ThreadPoolExecutor$Worker.run(ThreadPoolExecutor.java:615)
	at java.lang.Thread.run(Thread.java:745)

kafka.log.LogManagerTest > testCleanupExpiredSegments PASSED

kafka.log.LogManagerTest > testCheckpointRecoveryPoints PASSED

kafka.log.LogManagerTest > testTimeBasedFlush PASSED

kafka.log.LogManagerTest > testCreateLog PASSED

kafka.log.LogManagerTest > testRecoveryDirectoryMappingWithTrailingSlash PASSED

kafka.coordinator.MemberMetadataTest > testMatchesSupportedProtocols PASSED

kafka.coordinator.MemberMetadataTest > testMetadata PASSED

kafka.coordinator.MemberMetadataTest > testMetadataRaisesOnUnsupportedProtocol PASSED

kafka.coordinator.MemberMetadataTest > testVoteForPreferredProtocol PASSED

kafka.coordinator.MemberMetadataTest > testVoteRaisesOnNoSupportedProtocols PASSED

kafka.coordinator.GroupCoordinatorResponseTest > testHeartbeatWrongCoordinator PASSED

kafka.coordinator.GroupCoordinatorResponseTest > testDescribeGroupStable PASSED

kafka.coordinator.GroupCoordinatorResponseTest > testHeartbeatIllegalGeneration PASSED

kafka.coordinator.GroupCoordinatorResponseTest > testDescribeGroupWrongCoordinator PASSED

kafka.coordinator.GroupCoordinatorResponseTest > testDescribeGroupRebalancing PASSED

kafka.coordinator.GroupCoordinatorResponseTest > testLeaderFailureInSyncGroup PASSED

kafka.coordinator.GroupCoordinatorResponseTest > testGenerationIdIncrementsOnRebalance PASSED

kafka.coordinator.GroupCoordinatorResponseTest > testSyncGroupFromIllegalGeneration PASSED

kafka.coordinator.GroupCoordinatorResponseTest > testInvalidGroupId PASSED

kafka.coordinator.GroupCoordinatorResponseTest > testHeartbeatUnknownGroup PASSED

kafka.coordinator.GroupCoordinatorResponseTest > testListGroupsIncludesStableGroups PASSED

kafka.coordinator.GroupCoordinatorResponseTest > testHeartbeatDuringRebalanceCausesRebalanceInProgress PASSED

kafka.coordinator.GroupCoordinatorResponseTest > testJoinGroupInconsistentGroupProtocol PASSED

kafka.coordinator.GroupCoordinatorResponseTest > testJoinGroupSessionTimeoutTooLarge PASSED

kafka.coordinator.GroupCoordinatorResponseTest > testJoinGroupSessionTimeoutTooSmall PASSED

kafka.coordinator.GroupCoordinatorResponseTest > testSyncGroupEmptyAssignment PASSED

kafka.coordinator.GroupCoordinatorResponseTest > testCommitOffsetWithDefaultGeneration PASSED

kafka.coordinator.GroupCoordinatorResponseTest > testJoinGroupFromUnchangedLeaderShouldRebalance PASSED

kafka.coordinator.GroupCoordinatorResponseTest > testHeartbeatRebalanceInProgress PASSED

kafka.coordinator.GroupCoordinatorResponseTest > testLeaveGroupUnknownGroup PASSED

kafka.coordinator.GroupCoordinatorResponseTest > testListGroupsIncludesRebalancingGroups PASSED

kafka.coordinator.GroupCoordinatorResponseTest > testSyncGroupFollowerAfterLeader PASSED

kafka.coordinator.GroupCoordinatorResponseTest > testCommitOffsetInAwaitingSync PASSED

kafka.coordinator.GroupCoordinatorResponseTest > testJoinGroupWrongCoordinator PASSED

kafka.coordinator.GroupCoordinatorResponseTest > testJoinGroupUnknownConsumerExistingGroup PASSED

kafka.coordinator.GroupCoordinatorResponseTest > testSyncGroupFromUnknownGroup PASSED

kafka.coordinator.GroupCoordinatorResponseTest > testJoinGroupInconsistentProtocolType PASSED

kafka.coordinator.GroupCoordinatorResponseTest > testCommitOffsetFromUnknownGroup PASSED

kafka.coordinator.GroupCoordinatorResponseTest > testLeaveGroupWrongCoordinator PASSED

kafka.coordinator.GroupCoordinatorResponseTest > testLeaveGroupUnknownConsumerExistingGroup PASSED

kafka.coordinator.GroupCoordinatorResponseTest > testJoinGroupUnknownConsumerNewGroup PASSED

kafka.coordinator.GroupCoordinatorResponseTest > testJoinGroupFromUnchangedFollowerDoesNotRebalance PASSED

kafka.coordinator.GroupCoordinatorResponseTest > testValidJoinGroup PASSED

kafka.coordinator.GroupCoordinatorResponseTest > testSyncGroupLeaderAfterFollower PASSED

kafka.coordinator.GroupCoordinatorResponseTest > testSyncGroupFromUnknownMember PASSED

kafka.coordinator.GroupCoordinatorResponseTest > testValidLeaveGroup PASSED

kafka.coordinator.GroupCoordinatorResponseTest > testDescribeGroupInactiveGroup PASSED

kafka.coordinator.GroupCoordinatorResponseTest > testSyncGroupNotCoordinator PASSED

kafka.coordinator.GroupCoordinatorResponseTest > testHeartbeatUnknownConsumerExistingGroup PASSED

kafka.coordinator.GroupCoordinatorResponseTest > testValidHeartbeat PASSED

kafka.coordinator.GroupMetadataTest > testDeadToAwaitingSyncIllegalTransition PASSED

kafka.coordinator.GroupMetadataTest > testPreparingRebalanceToStableIllegalTransition PASSED

kafka.coordinator.GroupMetadataTest > testCannotRebalanceWhenDead PASSED

kafka.coordinator.GroupMetadataTest > testSelectProtocol PASSED

kafka.coordinator.GroupMetadataTest > testCannotRebalanceWhenPreparingRebalance PASSED

kafka.coordinator.GroupMetadataTest > testDeadToPreparingRebalanceIllegalTransition PASSED

kafka.coordinator.GroupMetadataTest > testCanRebalanceWhenAwaitingSync PASSED

kafka.coordinator.GroupMetadataTest > testAwaitingSyncToPreparingRebalanceTransition PASSED

kafka.coordinator.GroupMetadataTest > testStableToAwaitingSyncIllegalTransition PASSED

kafka.coordinator.GroupMetadataTest > testDeadToDeadIllegalTransition PASSED

kafka.coordinator.GroupMetadataTest > testSelectProtocolRaisesIfNoMembers PASSED

kafka.coordinator.GroupMetadataTest > testStableToPreparingRebalanceTransition PASSED

kafka.coordinator.GroupMetadataTest > testPreparingRebalanceToDeadTransition PASSED

kafka.coordinator.GroupMetadataTest > testStableToStableIllegalTransition PASSED

kafka.coordinator.GroupMetadataTest > testAwaitingSyncToStableTransition PASSED

kafka.coordinator.GroupMetadataTest > testDeadToStableIllegalTransition PASSED

kafka.coordinator.GroupMetadataTest > testAwaitingSyncToAwaitingSyncIllegalTransition PASSED

kafka.coordinator.GroupMetadataTest > testSupportsProtocols PASSED

kafka.coordinator.GroupMetadataTest > testCanRebalanceWhenStable PASSED

kafka.coordinator.GroupMetadataTest > testPreparingRebalanceToPreparingRebalanceIllegalTransition PASSED

kafka.coordinator.GroupMetadataTest > testSelectProtocolChoosesCompatibleProtocol PASSED

kafka.KafkaTest > testGetKafkaConfigFromArgsWrongSetValue PASSED

kafka.KafkaTest > testKafkaSslPasswords PASSED

kafka.KafkaTest > testGetKafkaConfigFromArgs PASSED

kafka.KafkaTest > testGetKafkaConfigFromArgsNonArgsAtTheEnd PASSED

kafka.KafkaTest > testGetKafkaConfigFromArgsNonArgsOnly PASSED

kafka.KafkaTest > testGetKafkaConfigFromArgsNonArgsAtTheBegging PASSED

kafka.tools.ConsoleProducerTest > testParseKeyProp PASSED

kafka.tools.ConsoleProducerTest > testValidConfigsOldProducer PASSED

kafka.tools.ConsoleProducerTest > testInvalidConfigs PASSED

kafka.tools.ConsoleProducerTest > testValidConfigsNewProducer PASSED

kafka.tools.ConsoleConsumerTest > shouldLimitReadsToMaxMessageLimit PASSED

kafka.tools.ConsoleConsumerTest > shouldParseValidNewConsumerValidConfig PASSED

kafka.tools.ConsoleConsumerTest > shouldParseConfigsFromFile PASSED

kafka.tools.ConsoleConsumerTest > shouldParseValidOldConsumerValidConfig PASSED

722 tests completed, 1 failed
:kafka-trunk-jdk8:core:test FAILED
:test_core_2_10 FAILED

FAILURE: Build failed with an exception.

* What went wrong:
Execution failed for task ':core:test'.
> There were failing tests. See the report at: file://<https://builds.apache.org/job/kafka-trunk-jdk8/ws/core/build/reports/tests/index.html>

* Try:
Run with --stacktrace option to get the stack trace. Run with --info or --debug option to get more log output.

BUILD FAILED

Total time: 1 hrs 0 mins 50.958 secs
Build step 'Execute shell' marked build as failure
Recording test results
Setting JDK1_8_0_45_HOME=/home/jenkins/jenkins-slave/tools/hudson.model.JDK/jdk1.8.0_45
Setting GRADLE_2_4_RC_2_HOME=/home/jenkins/jenkins-slave/tools/hudson.plugins.gradle.GradleInstallation/Gradle_2.4-rc-2
Setting JDK1_8_0_45_HOME=/home/jenkins/jenkins-slave/tools/hudson.model.JDK/jdk1.8.0_45
Setting GRADLE_2_4_RC_2_HOME=/home/jenkins/jenkins-slave/tools/hudson.plugins.gradle.GradleInstallation/Gradle_2.4-rc-2

Build failed in Jenkins: kafka-trunk-jdk8 #486

Posted by Apache Jenkins Server <je...@builds.apache.org>.
See <https://builds.apache.org/job/kafka-trunk-jdk8/486/changes>

Changes:

[junrao] KAFKA-3388; Fix expiration of batches sitting in the accumulator

------------------------------------------
[...truncated 838 lines...]
kafka.server.IsrExpirationTest > testIsrExpirationForSlowFollowers PASSED

kafka.server.IsrExpirationTest > testIsrExpirationForStuckFollowers PASSED

kafka.server.IsrExpirationTest > testIsrExpirationIfNoFetchRequestMade PASSED

kafka.server.ClientQuotaManagerTest > testQuotaViolation PASSED

kafka.server.ClientQuotaManagerTest > testExpireQuotaSensors PASSED

kafka.server.ClientQuotaManagerTest > testExpireThrottleTimeSensor PASSED

kafka.server.ClientQuotaManagerTest > testQuotaParsing PASSED

kafka.server.MetadataCacheTest > getTopicMetadataWithNonSupportedSecurityProtocol PASSED

kafka.server.MetadataCacheTest > getTopicMetadataIsrNotAvailable PASSED

kafka.server.MetadataCacheTest > getTopicMetadata PASSED

kafka.server.MetadataCacheTest > getTopicMetadataReplicaNotAvailable PASSED

kafka.server.MetadataCacheTest > getTopicMetadataPartitionLeaderNotAvailable PASSED

kafka.server.MetadataCacheTest > getAliveBrokersShouldNotBeMutatedByUpdateCache PASSED

kafka.server.MetadataCacheTest > getTopicMetadataNonExistingTopics PASSED

kafka.server.ServerGenerateBrokerIdTest > testBrokerMetadataOnIdCollision PASSED

kafka.server.ServerGenerateBrokerIdTest > testAutoGenerateBrokerId PASSED

kafka.server.ServerGenerateBrokerIdTest > testMultipleLogDirsMetaProps PASSED

kafka.server.ServerGenerateBrokerIdTest > testDisableGeneratedBrokerId PASSED

kafka.server.ServerGenerateBrokerIdTest > testUserConfigAndGeneratedBrokerId PASSED

kafka.server.ServerGenerateBrokerIdTest > testConsistentBrokerIdFromUserConfigAndMetaProps PASSED

kafka.server.LogOffsetTest > testGetOffsetsBeforeEarliestTime PASSED

kafka.server.LogOffsetTest > testGetOffsetsForUnknownTopic PASSED

kafka.server.LogOffsetTest > testEmptyLogsGetOffsets PASSED

kafka.server.LogOffsetTest > testGetOffsetsBeforeLatestTime PASSED

kafka.server.LogOffsetTest > testGetOffsetsBeforeNow PASSED

kafka.server.PlaintextReplicaFetchTest > testReplicaFetcherThread PASSED

kafka.server.AdvertiseBrokerTest > testBrokerAdvertiseToZK PASSED

kafka.server.LeaderElectionTest > testLeaderElectionWithStaleControllerEpoch PASSED

kafka.server.LeaderElectionTest > testLeaderElectionAndEpoch PASSED

kafka.server.SaslPlaintextReplicaFetchTest > testReplicaFetcherThread PASSED

kafka.server.HighwatermarkPersistenceTest > testHighWatermarkPersistenceMultiplePartitions PASSED

kafka.server.HighwatermarkPersistenceTest > testHighWatermarkPersistenceSinglePartition PASSED

kafka.coordinator.GroupMetadataTest > testDeadToAwaitingSyncIllegalTransition PASSED

kafka.coordinator.GroupMetadataTest > testPreparingRebalanceToStableIllegalTransition PASSED

kafka.coordinator.GroupMetadataTest > testCannotRebalanceWhenDead PASSED

kafka.coordinator.GroupMetadataTest > testSelectProtocol PASSED

kafka.coordinator.GroupMetadataTest > testCannotRebalanceWhenPreparingRebalance PASSED

kafka.coordinator.GroupMetadataTest > testDeadToPreparingRebalanceIllegalTransition PASSED

kafka.coordinator.GroupMetadataTest > testCanRebalanceWhenAwaitingSync PASSED

kafka.coordinator.GroupMetadataTest > testAwaitingSyncToPreparingRebalanceTransition PASSED

kafka.coordinator.GroupMetadataTest > testStableToAwaitingSyncIllegalTransition PASSED

kafka.coordinator.GroupMetadataTest > testDeadToDeadIllegalTransition PASSED

kafka.coordinator.GroupMetadataTest > testSelectProtocolRaisesIfNoMembers PASSED

kafka.coordinator.GroupMetadataTest > testStableToPreparingRebalanceTransition PASSED

kafka.coordinator.GroupMetadataTest > testPreparingRebalanceToDeadTransition PASSED

kafka.coordinator.GroupMetadataTest > testStableToStableIllegalTransition PASSED

kafka.coordinator.GroupMetadataTest > testAwaitingSyncToStableTransition PASSED

kafka.coordinator.GroupMetadataTest > testDeadToStableIllegalTransition PASSED

kafka.coordinator.GroupMetadataTest > testAwaitingSyncToAwaitingSyncIllegalTransition PASSED

kafka.coordinator.GroupMetadataTest > testSupportsProtocols PASSED

kafka.coordinator.GroupMetadataTest > testCanRebalanceWhenStable PASSED

kafka.coordinator.GroupMetadataTest > testPreparingRebalanceToPreparingRebalanceIllegalTransition PASSED

kafka.coordinator.GroupMetadataTest > testSelectProtocolChoosesCompatibleProtocol PASSED

kafka.coordinator.MemberMetadataTest > testMatchesSupportedProtocols PASSED

kafka.coordinator.MemberMetadataTest > testMetadata PASSED

kafka.coordinator.MemberMetadataTest > testMetadataRaisesOnUnsupportedProtocol PASSED

kafka.coordinator.MemberMetadataTest > testVoteForPreferredProtocol PASSED

kafka.coordinator.MemberMetadataTest > testVoteRaisesOnNoSupportedProtocols PASSED

kafka.coordinator.GroupCoordinatorResponseTest > testHeartbeatWrongCoordinator PASSED

kafka.coordinator.GroupCoordinatorResponseTest > testDescribeGroupStable PASSED

kafka.coordinator.GroupCoordinatorResponseTest > testHeartbeatIllegalGeneration PASSED

kafka.coordinator.GroupCoordinatorResponseTest > testDescribeGroupWrongCoordinator PASSED

kafka.coordinator.GroupCoordinatorResponseTest > testDescribeGroupRebalancing PASSED

kafka.coordinator.GroupCoordinatorResponseTest > testLeaderFailureInSyncGroup PASSED

kafka.coordinator.GroupCoordinatorResponseTest > testGenerationIdIncrementsOnRebalance PASSED

kafka.coordinator.GroupCoordinatorResponseTest > testSyncGroupFromIllegalGeneration PASSED

kafka.coordinator.GroupCoordinatorResponseTest > testInvalidGroupId PASSED

kafka.coordinator.GroupCoordinatorResponseTest > testHeartbeatUnknownGroup PASSED

kafka.coordinator.GroupCoordinatorResponseTest > testListGroupsIncludesStableGroups PASSED

kafka.coordinator.GroupCoordinatorResponseTest > testHeartbeatDuringRebalanceCausesRebalanceInProgress PASSED

kafka.coordinator.GroupCoordinatorResponseTest > testJoinGroupInconsistentGroupProtocol PASSED

kafka.coordinator.GroupCoordinatorResponseTest > testJoinGroupSessionTimeoutTooLarge PASSED

kafka.coordinator.GroupCoordinatorResponseTest > testJoinGroupSessionTimeoutTooSmall PASSED

kafka.coordinator.GroupCoordinatorResponseTest > testSyncGroupEmptyAssignment PASSED

kafka.coordinator.GroupCoordinatorResponseTest > testCommitOffsetWithDefaultGeneration PASSED

kafka.coordinator.GroupCoordinatorResponseTest > testJoinGroupFromUnchangedLeaderShouldRebalance PASSED

kafka.coordinator.GroupCoordinatorResponseTest > testHeartbeatRebalanceInProgress PASSED

kafka.coordinator.GroupCoordinatorResponseTest > testLeaveGroupUnknownGroup PASSED

kafka.coordinator.GroupCoordinatorResponseTest > testListGroupsIncludesRebalancingGroups PASSED

kafka.coordinator.GroupCoordinatorResponseTest > testSyncGroupFollowerAfterLeader PASSED

kafka.coordinator.GroupCoordinatorResponseTest > testCommitOffsetInAwaitingSync PASSED

kafka.coordinator.GroupCoordinatorResponseTest > testJoinGroupWrongCoordinator PASSED

kafka.coordinator.GroupCoordinatorResponseTest > testJoinGroupUnknownConsumerExistingGroup PASSED

kafka.coordinator.GroupCoordinatorResponseTest > testSyncGroupFromUnknownGroup PASSED

kafka.coordinator.GroupCoordinatorResponseTest > testJoinGroupInconsistentProtocolType PASSED

kafka.coordinator.GroupCoordinatorResponseTest > testCommitOffsetFromUnknownGroup PASSED

kafka.coordinator.GroupCoordinatorResponseTest > testLeaveGroupWrongCoordinator PASSED

kafka.coordinator.GroupCoordinatorResponseTest > testLeaveGroupUnknownConsumerExistingGroup PASSED

kafka.coordinator.GroupCoordinatorResponseTest > testJoinGroupUnknownConsumerNewGroup PASSED

kafka.coordinator.GroupCoordinatorResponseTest > testJoinGroupFromUnchangedFollowerDoesNotRebalance PASSED

kafka.coordinator.GroupCoordinatorResponseTest > testValidJoinGroup PASSED

kafka.coordinator.GroupCoordinatorResponseTest > testSyncGroupLeaderAfterFollower PASSED

kafka.coordinator.GroupCoordinatorResponseTest > testSyncGroupFromUnknownMember PASSED

kafka.coordinator.GroupCoordinatorResponseTest > testValidLeaveGroup PASSED

kafka.coordinator.GroupCoordinatorResponseTest > testDescribeGroupInactiveGroup PASSED

kafka.coordinator.GroupCoordinatorResponseTest > testSyncGroupNotCoordinator PASSED

kafka.coordinator.GroupCoordinatorResponseTest > testHeartbeatUnknownConsumerExistingGroup PASSED

kafka.coordinator.GroupCoordinatorResponseTest > testValidHeartbeat PASSED

kafka.api.ProducerBounceTest > testBrokerFailure PASSED

kafka.api.PlaintextProducerSendTest > testSerializerConstructors PASSED

kafka.api.PlaintextProducerSendTest > testWrongSerializer PASSED

kafka.api.PlaintextProducerSendTest > testSendNonCompressedMessageWithCreateTime PASSED

kafka.api.PlaintextProducerSendTest > testSendCompressedMessageWithLogAppendTime PASSED

kafka.api.PlaintextProducerSendTest > testClose PASSED

kafka.api.PlaintextProducerSendTest > testFlush PASSED

kafka.api.PlaintextProducerSendTest > testSendToPartition PASSED

kafka.api.PlaintextProducerSendTest > testSendOffset PASSED

kafka.api.PlaintextProducerSendTest > testAutoCreateTopic PASSED

kafka.api.PlaintextProducerSendTest > testSendWithInvalidCreateTime PASSED

kafka.api.PlaintextProducerSendTest > testSendCompressedMessageWithCreateTime PASSED
Java HotSpot(TM) 64-Bit Server VM warning: INFO: os::commit_memory(0x00000007ba300000, 97517568, 0) failed; error='Cannot allocate memory' (errno=12)
#
# There is insufficient memory for the Java Runtime Environment to continue.
# Native memory allocation (mmap) failed to map 97517568 bytes for committing reserved memory.
# An error report file with more information is saved as:
# <https://builds.apache.org/job/kafka-trunk-jdk8/ws/core/hs_err_pid23745.log>

347 tests completed, 1 failed
:kafka-trunk-jdk8:core:test FAILED
:test_core_2_10 FAILED

FAILURE: Build failed with an exception.

* What went wrong:
Execution failed for task ':core:test'.
> Process 'Gradle Test Executor 2' finished with non-zero exit value 1

* Try:
Run with --stacktrace option to get the stack trace. Run with --info or --debug option to get more log output.

BUILD FAILED

Total time: 12 mins 2.003 secs
Build step 'Execute shell' marked build as failure
Recording test results
Setting JDK1_8_0_45_HOME=/home/jenkins/jenkins-slave/tools/hudson.model.JDK/jdk1.8.0_45
Setting GRADLE_2_4_RC_2_HOME=/home/jenkins/jenkins-slave/tools/hudson.plugins.gradle.GradleInstallation/Gradle_2.4-rc-2
ERROR: Step ‘Publish JUnit test result report’ failed: No test report files were found. Configuration error?
Setting JDK1_8_0_45_HOME=/home/jenkins/jenkins-slave/tools/hudson.model.JDK/jdk1.8.0_45
Setting GRADLE_2_4_RC_2_HOME=/home/jenkins/jenkins-slave/tools/hudson.plugins.gradle.GradleInstallation/Gradle_2.4-rc-2

Build failed in Jenkins: kafka-trunk-jdk8 #485

Posted by Apache Jenkins Server <je...@builds.apache.org>.
See <https://builds.apache.org/job/kafka-trunk-jdk8/485/changes>

Changes:

[me] KAFKA-3316: Add REST API for listing connector plugins

------------------------------------------
[...truncated 1627 lines...]

kafka.log.LogTest > testTruncateTo PASSED

kafka.log.LogTest > testCleanShutdownFile PASSED

kafka.log.OffsetIndexTest > lookupExtremeCases PASSED

kafka.log.OffsetIndexTest > appendTooMany PASSED

kafka.log.OffsetIndexTest > randomLookupTest PASSED

kafka.log.OffsetIndexTest > testReopen PASSED

kafka.log.OffsetIndexTest > appendOutOfOrder PASSED

kafka.log.OffsetIndexTest > truncate PASSED

kafka.log.LogSegmentTest > testRecoveryWithCorruptMessage PASSED

kafka.log.LogSegmentTest > testRecoveryFixesCorruptIndex PASSED

kafka.log.LogSegmentTest > testReadFromGap PASSED

kafka.log.LogSegmentTest > testTruncate PASSED

kafka.log.LogSegmentTest > testReadBeforeFirstOffset PASSED

kafka.log.LogSegmentTest > testCreateWithInitFileSizeAppendMessage PASSED

kafka.log.LogSegmentTest > testChangeFileSuffixes PASSED

kafka.log.LogSegmentTest > testMaxOffset PASSED

kafka.log.LogSegmentTest > testNextOffsetCalculation PASSED

kafka.log.LogSegmentTest > testReadOnEmptySegment PASSED

kafka.log.LogSegmentTest > testReadAfterLast PASSED

kafka.log.LogSegmentTest > testCreateWithInitFileSizeClearShutdown PASSED

kafka.log.LogSegmentTest > testTruncateFull PASSED

kafka.log.CleanerTest > testBuildOffsetMap PASSED

kafka.log.CleanerTest > testSegmentGrouping PASSED

kafka.log.CleanerTest > testCleanSegmentsWithAbort PASSED

kafka.log.CleanerTest > testSegmentGroupingWithSparseOffsets PASSED

kafka.log.CleanerTest > testRecoveryAfterCrash PASSED

kafka.log.CleanerTest > testLogToClean PASSED

kafka.log.CleanerTest > testCleaningWithDeletes PASSED

kafka.log.CleanerTest > testCleanSegments PASSED

kafka.log.CleanerTest > testCleaningWithUnkeyedMessages PASSED

kafka.log.OffsetMapTest > testClear PASSED

kafka.log.OffsetMapTest > testBasicValidation PASSED

kafka.coordinator.GroupCoordinatorResponseTest > testHeartbeatWrongCoordinator PASSED

kafka.coordinator.GroupCoordinatorResponseTest > testDescribeGroupStable PASSED

kafka.coordinator.GroupCoordinatorResponseTest > testHeartbeatIllegalGeneration PASSED

kafka.coordinator.GroupCoordinatorResponseTest > testDescribeGroupWrongCoordinator PASSED

kafka.coordinator.GroupCoordinatorResponseTest > testDescribeGroupRebalancing PASSED

kafka.coordinator.GroupCoordinatorResponseTest > testLeaderFailureInSyncGroup PASSED

kafka.coordinator.GroupCoordinatorResponseTest > testGenerationIdIncrementsOnRebalance PASSED

kafka.coordinator.GroupCoordinatorResponseTest > testSyncGroupFromIllegalGeneration PASSED

kafka.coordinator.GroupCoordinatorResponseTest > testInvalidGroupId PASSED

kafka.coordinator.GroupCoordinatorResponseTest > testHeartbeatUnknownGroup PASSED

kafka.coordinator.GroupCoordinatorResponseTest > testListGroupsIncludesStableGroups PASSED

kafka.coordinator.GroupCoordinatorResponseTest > testHeartbeatDuringRebalanceCausesRebalanceInProgress PASSED

kafka.coordinator.GroupCoordinatorResponseTest > testJoinGroupInconsistentGroupProtocol PASSED

kafka.coordinator.GroupCoordinatorResponseTest > testJoinGroupSessionTimeoutTooLarge PASSED

kafka.coordinator.GroupCoordinatorResponseTest > testJoinGroupSessionTimeoutTooSmall PASSED

kafka.coordinator.GroupCoordinatorResponseTest > testSyncGroupEmptyAssignment PASSED

kafka.coordinator.GroupCoordinatorResponseTest > testCommitOffsetWithDefaultGeneration PASSED

kafka.coordinator.GroupCoordinatorResponseTest > testJoinGroupFromUnchangedLeaderShouldRebalance PASSED

kafka.coordinator.GroupCoordinatorResponseTest > testHeartbeatRebalanceInProgress PASSED

kafka.coordinator.GroupCoordinatorResponseTest > testLeaveGroupUnknownGroup PASSED

kafka.coordinator.GroupCoordinatorResponseTest > testListGroupsIncludesRebalancingGroups PASSED

kafka.coordinator.GroupCoordinatorResponseTest > testSyncGroupFollowerAfterLeader PASSED

kafka.coordinator.GroupCoordinatorResponseTest > testCommitOffsetInAwaitingSync PASSED

kafka.coordinator.GroupCoordinatorResponseTest > testJoinGroupWrongCoordinator PASSED

kafka.coordinator.GroupCoordinatorResponseTest > testJoinGroupUnknownConsumerExistingGroup PASSED

kafka.coordinator.GroupCoordinatorResponseTest > testSyncGroupFromUnknownGroup PASSED

kafka.coordinator.GroupCoordinatorResponseTest > testJoinGroupInconsistentProtocolType PASSED

kafka.coordinator.GroupCoordinatorResponseTest > testCommitOffsetFromUnknownGroup PASSED

kafka.coordinator.GroupCoordinatorResponseTest > testLeaveGroupWrongCoordinator PASSED

kafka.coordinator.GroupCoordinatorResponseTest > testLeaveGroupUnknownConsumerExistingGroup PASSED

kafka.coordinator.GroupCoordinatorResponseTest > testJoinGroupUnknownConsumerNewGroup PASSED

kafka.coordinator.GroupCoordinatorResponseTest > testJoinGroupFromUnchangedFollowerDoesNotRebalance PASSED

kafka.coordinator.GroupCoordinatorResponseTest > testValidJoinGroup PASSED

kafka.coordinator.GroupCoordinatorResponseTest > testSyncGroupLeaderAfterFollower PASSED

kafka.coordinator.GroupCoordinatorResponseTest > testSyncGroupFromUnknownMember PASSED

kafka.coordinator.GroupCoordinatorResponseTest > testValidLeaveGroup PASSED

kafka.coordinator.GroupCoordinatorResponseTest > testDescribeGroupInactiveGroup PASSED

kafka.coordinator.GroupCoordinatorResponseTest > testSyncGroupNotCoordinator PASSED

kafka.coordinator.GroupCoordinatorResponseTest > testHeartbeatUnknownConsumerExistingGroup PASSED

kafka.coordinator.GroupCoordinatorResponseTest > testValidHeartbeat PASSED

kafka.coordinator.MemberMetadataTest > testMatchesSupportedProtocols PASSED

kafka.coordinator.MemberMetadataTest > testMetadata PASSED

kafka.coordinator.MemberMetadataTest > testMetadataRaisesOnUnsupportedProtocol PASSED

kafka.coordinator.MemberMetadataTest > testVoteForPreferredProtocol PASSED

kafka.coordinator.MemberMetadataTest > testVoteRaisesOnNoSupportedProtocols PASSED

kafka.coordinator.GroupMetadataTest > testDeadToAwaitingSyncIllegalTransition PASSED

kafka.coordinator.GroupMetadataTest > testPreparingRebalanceToStableIllegalTransition PASSED

kafka.coordinator.GroupMetadataTest > testCannotRebalanceWhenDead PASSED

kafka.coordinator.GroupMetadataTest > testSelectProtocol PASSED

kafka.coordinator.GroupMetadataTest > testCannotRebalanceWhenPreparingRebalance PASSED

kafka.coordinator.GroupMetadataTest > testDeadToPreparingRebalanceIllegalTransition PASSED

kafka.coordinator.GroupMetadataTest > testCanRebalanceWhenAwaitingSync PASSED

kafka.coordinator.GroupMetadataTest > testAwaitingSyncToPreparingRebalanceTransition PASSED

kafka.coordinator.GroupMetadataTest > testStableToAwaitingSyncIllegalTransition PASSED

kafka.coordinator.GroupMetadataTest > testDeadToDeadIllegalTransition PASSED

kafka.coordinator.GroupMetadataTest > testSelectProtocolRaisesIfNoMembers PASSED

kafka.coordinator.GroupMetadataTest > testStableToPreparingRebalanceTransition PASSED

kafka.coordinator.GroupMetadataTest > testPreparingRebalanceToDeadTransition PASSED

kafka.coordinator.GroupMetadataTest > testStableToStableIllegalTransition PASSED

kafka.coordinator.GroupMetadataTest > testAwaitingSyncToStableTransition PASSED

kafka.coordinator.GroupMetadataTest > testDeadToStableIllegalTransition PASSED

kafka.coordinator.GroupMetadataTest > testAwaitingSyncToAwaitingSyncIllegalTransition PASSED

kafka.coordinator.GroupMetadataTest > testSupportsProtocols PASSED

kafka.coordinator.GroupMetadataTest > testCanRebalanceWhenStable PASSED

kafka.coordinator.GroupMetadataTest > testPreparingRebalanceToPreparingRebalanceIllegalTransition PASSED

kafka.coordinator.GroupMetadataTest > testSelectProtocolChoosesCompatibleProtocol PASSED

kafka.javaapi.message.ByteBufferMessageSetTest > testSizeInBytesWithCompression PASSED

kafka.javaapi.message.ByteBufferMessageSetTest > testIteratorIsConsistentWithCompression PASSED

kafka.javaapi.message.ByteBufferMessageSetTest > testIteratorIsConsistent PASSED

kafka.javaapi.message.ByteBufferMessageSetTest > testEqualsWithCompression PASSED

kafka.javaapi.message.ByteBufferMessageSetTest > testWrittenEqualsRead PASSED

kafka.javaapi.message.ByteBufferMessageSetTest > testEquals PASSED

kafka.javaapi.message.ByteBufferMessageSetTest > testSizeInBytes PASSED

kafka.javaapi.consumer.ZookeeperConsumerConnectorTest > testBasic PASSED

kafka.KafkaTest > testGetKafkaConfigFromArgsWrongSetValue PASSED

kafka.KafkaTest > testKafkaSslPasswords PASSED

kafka.KafkaTest > testGetKafkaConfigFromArgs PASSED

kafka.KafkaTest > testGetKafkaConfigFromArgsNonArgsAtTheEnd PASSED

kafka.KafkaTest > testGetKafkaConfigFromArgsNonArgsOnly PASSED

kafka.KafkaTest > testGetKafkaConfigFromArgsNonArgsAtTheBegging PASSED

kafka.controller.ControllerFailoverTest > testMetadataUpdate PASSED

722 tests completed, 3 failed
:kafka-trunk-jdk8:core:test FAILED
:test_core_2_10 FAILED

FAILURE: Build failed with an exception.

* What went wrong:
Execution failed for task ':core:test'.
> There were failing tests. See the report at: file://<https://builds.apache.org/job/kafka-trunk-jdk8/ws/core/build/reports/tests/index.html>

* Try:
Run with --stacktrace option to get the stack trace. Run with --info or --debug option to get more log output.

BUILD FAILED

Total time: 1 hrs 11 mins 18.203 secs
Build step 'Execute shell' marked build as failure
Recording test results
Setting JDK1_8_0_45_HOME=/home/jenkins/jenkins-slave/tools/hudson.model.JDK/jdk1.8.0_45
Setting GRADLE_2_4_RC_2_HOME=/home/jenkins/jenkins-slave/tools/hudson.plugins.gradle.GradleInstallation/Gradle_2.4-rc-2
Setting JDK1_8_0_45_HOME=/home/jenkins/jenkins-slave/tools/hudson.model.JDK/jdk1.8.0_45
Setting GRADLE_2_4_RC_2_HOME=/home/jenkins/jenkins-slave/tools/hudson.plugins.gradle.GradleInstallation/Gradle_2.4-rc-2

Build failed in Jenkins: kafka-trunk-jdk8 #484

Posted by Apache Jenkins Server <je...@builds.apache.org>.
See <https://builds.apache.org/job/kafka-trunk-jdk8/484/changes>

Changes:

[cshapi] KAFKA-3454: add Kafka Streams web docs

------------------------------------------
[...truncated 1626 lines...]

kafka.log.OffsetIndexTest > randomLookupTest PASSED

kafka.log.OffsetIndexTest > testReopen PASSED

kafka.log.OffsetIndexTest > appendOutOfOrder PASSED

kafka.log.OffsetIndexTest > truncate PASSED

kafka.log.LogSegmentTest > testRecoveryWithCorruptMessage PASSED

kafka.log.LogSegmentTest > testRecoveryFixesCorruptIndex PASSED

kafka.log.LogSegmentTest > testReadFromGap PASSED

kafka.log.LogSegmentTest > testTruncate PASSED

kafka.log.LogSegmentTest > testReadBeforeFirstOffset PASSED

kafka.log.LogSegmentTest > testCreateWithInitFileSizeAppendMessage PASSED

kafka.log.LogSegmentTest > testChangeFileSuffixes PASSED

kafka.log.LogSegmentTest > testMaxOffset PASSED

kafka.log.LogSegmentTest > testNextOffsetCalculation PASSED

kafka.log.LogSegmentTest > testReadOnEmptySegment PASSED

kafka.log.LogSegmentTest > testReadAfterLast PASSED

kafka.log.LogSegmentTest > testCreateWithInitFileSizeClearShutdown PASSED

kafka.log.LogSegmentTest > testTruncateFull PASSED

kafka.log.CleanerTest > testBuildOffsetMap PASSED

kafka.log.CleanerTest > testSegmentGrouping PASSED

kafka.log.CleanerTest > testCleanSegmentsWithAbort PASSED

kafka.log.CleanerTest > testSegmentGroupingWithSparseOffsets PASSED

kafka.log.CleanerTest > testRecoveryAfterCrash PASSED

kafka.log.CleanerTest > testLogToClean PASSED

kafka.log.CleanerTest > testCleaningWithDeletes PASSED

kafka.log.CleanerTest > testCleanSegments PASSED

kafka.log.CleanerTest > testCleaningWithUnkeyedMessages PASSED

kafka.log.OffsetMapTest > testClear PASSED

kafka.log.OffsetMapTest > testBasicValidation PASSED

kafka.coordinator.GroupCoordinatorResponseTest > testHeartbeatWrongCoordinator PASSED

kafka.coordinator.GroupCoordinatorResponseTest > testDescribeGroupStable PASSED

kafka.coordinator.GroupCoordinatorResponseTest > testHeartbeatIllegalGeneration PASSED

kafka.coordinator.GroupCoordinatorResponseTest > testDescribeGroupWrongCoordinator PASSED

kafka.coordinator.GroupCoordinatorResponseTest > testDescribeGroupRebalancing PASSED

kafka.coordinator.GroupCoordinatorResponseTest > testLeaderFailureInSyncGroup FAILED
    java.util.concurrent.TimeoutException: Futures timed out after [600 milliseconds]
        at scala.concurrent.impl.Promise$DefaultPromise.ready(Promise.scala:219)
        at scala.concurrent.impl.Promise$DefaultPromise.result(Promise.scala:223)
        at scala.concurrent.Await$$anonfun$result$1.apply(package.scala:107)
        at scala.concurrent.BlockContext$DefaultBlockContext$.blockOn(BlockContext.scala:53)
        at scala.concurrent.Await$.result(package.scala:107)
        at kafka.coordinator.GroupCoordinatorResponseTest.await(GroupCoordinatorResponseTest.scala:895)
        at kafka.coordinator.GroupCoordinatorResponseTest.testLeaderFailureInSyncGroup(GroupCoordinatorResponseTest.scala:463)

kafka.coordinator.GroupCoordinatorResponseTest > testGenerationIdIncrementsOnRebalance PASSED

kafka.coordinator.GroupCoordinatorResponseTest > testSyncGroupFromIllegalGeneration PASSED

kafka.coordinator.GroupCoordinatorResponseTest > testInvalidGroupId PASSED

kafka.coordinator.GroupCoordinatorResponseTest > testHeartbeatUnknownGroup PASSED

kafka.coordinator.GroupCoordinatorResponseTest > testListGroupsIncludesStableGroups PASSED

kafka.coordinator.GroupCoordinatorResponseTest > testHeartbeatDuringRebalanceCausesRebalanceInProgress PASSED

kafka.coordinator.GroupCoordinatorResponseTest > testJoinGroupInconsistentGroupProtocol PASSED

kafka.coordinator.GroupCoordinatorResponseTest > testJoinGroupSessionTimeoutTooLarge PASSED

kafka.coordinator.GroupCoordinatorResponseTest > testJoinGroupSessionTimeoutTooSmall PASSED

kafka.coordinator.GroupCoordinatorResponseTest > testSyncGroupEmptyAssignment PASSED

kafka.coordinator.GroupCoordinatorResponseTest > testCommitOffsetWithDefaultGeneration PASSED

kafka.coordinator.GroupCoordinatorResponseTest > testJoinGroupFromUnchangedLeaderShouldRebalance PASSED

kafka.coordinator.GroupCoordinatorResponseTest > testHeartbeatRebalanceInProgress PASSED

kafka.coordinator.GroupCoordinatorResponseTest > testLeaveGroupUnknownGroup PASSED

kafka.coordinator.GroupCoordinatorResponseTest > testListGroupsIncludesRebalancingGroups PASSED

kafka.coordinator.GroupCoordinatorResponseTest > testSyncGroupFollowerAfterLeader PASSED

kafka.coordinator.GroupCoordinatorResponseTest > testCommitOffsetInAwaitingSync PASSED

kafka.coordinator.GroupCoordinatorResponseTest > testJoinGroupWrongCoordinator PASSED

kafka.coordinator.GroupCoordinatorResponseTest > testJoinGroupUnknownConsumerExistingGroup PASSED

kafka.coordinator.GroupCoordinatorResponseTest > testSyncGroupFromUnknownGroup PASSED

kafka.coordinator.GroupCoordinatorResponseTest > testJoinGroupInconsistentProtocolType PASSED

kafka.coordinator.GroupCoordinatorResponseTest > testCommitOffsetFromUnknownGroup PASSED

kafka.coordinator.GroupCoordinatorResponseTest > testLeaveGroupWrongCoordinator PASSED

kafka.coordinator.GroupCoordinatorResponseTest > testLeaveGroupUnknownConsumerExistingGroup PASSED

kafka.coordinator.GroupCoordinatorResponseTest > testJoinGroupUnknownConsumerNewGroup PASSED

kafka.coordinator.GroupCoordinatorResponseTest > testJoinGroupFromUnchangedFollowerDoesNotRebalance PASSED

kafka.coordinator.GroupCoordinatorResponseTest > testValidJoinGroup PASSED

kafka.coordinator.GroupCoordinatorResponseTest > testSyncGroupLeaderAfterFollower PASSED

kafka.coordinator.GroupCoordinatorResponseTest > testSyncGroupFromUnknownMember PASSED

kafka.coordinator.GroupCoordinatorResponseTest > testValidLeaveGroup PASSED

kafka.coordinator.GroupCoordinatorResponseTest > testDescribeGroupInactiveGroup PASSED

kafka.coordinator.GroupCoordinatorResponseTest > testSyncGroupNotCoordinator PASSED

kafka.coordinator.GroupCoordinatorResponseTest > testHeartbeatUnknownConsumerExistingGroup PASSED

kafka.coordinator.GroupCoordinatorResponseTest > testValidHeartbeat PASSED

kafka.coordinator.MemberMetadataTest > testMatchesSupportedProtocols PASSED

kafka.coordinator.MemberMetadataTest > testMetadata PASSED

kafka.coordinator.MemberMetadataTest > testMetadataRaisesOnUnsupportedProtocol PASSED

kafka.coordinator.MemberMetadataTest > testVoteForPreferredProtocol PASSED

kafka.coordinator.MemberMetadataTest > testVoteRaisesOnNoSupportedProtocols PASSED

kafka.coordinator.GroupMetadataTest > testDeadToAwaitingSyncIllegalTransition PASSED

kafka.coordinator.GroupMetadataTest > testPreparingRebalanceToStableIllegalTransition PASSED

kafka.coordinator.GroupMetadataTest > testCannotRebalanceWhenDead PASSED

kafka.coordinator.GroupMetadataTest > testSelectProtocol PASSED

kafka.coordinator.GroupMetadataTest > testCannotRebalanceWhenPreparingRebalance PASSED

kafka.coordinator.GroupMetadataTest > testDeadToPreparingRebalanceIllegalTransition PASSED

kafka.coordinator.GroupMetadataTest > testCanRebalanceWhenAwaitingSync PASSED

kafka.coordinator.GroupMetadataTest > testAwaitingSyncToPreparingRebalanceTransition PASSED

kafka.coordinator.GroupMetadataTest > testStableToAwaitingSyncIllegalTransition PASSED

kafka.coordinator.GroupMetadataTest > testDeadToDeadIllegalTransition PASSED

kafka.coordinator.GroupMetadataTest > testSelectProtocolRaisesIfNoMembers PASSED

kafka.coordinator.GroupMetadataTest > testStableToPreparingRebalanceTransition PASSED

kafka.coordinator.GroupMetadataTest > testPreparingRebalanceToDeadTransition PASSED

kafka.coordinator.GroupMetadataTest > testStableToStableIllegalTransition PASSED

kafka.coordinator.GroupMetadataTest > testAwaitingSyncToStableTransition PASSED

kafka.coordinator.GroupMetadataTest > testDeadToStableIllegalTransition PASSED

kafka.coordinator.GroupMetadataTest > testAwaitingSyncToAwaitingSyncIllegalTransition PASSED

kafka.coordinator.GroupMetadataTest > testSupportsProtocols PASSED

kafka.coordinator.GroupMetadataTest > testCanRebalanceWhenStable PASSED

kafka.coordinator.GroupMetadataTest > testPreparingRebalanceToPreparingRebalanceIllegalTransition PASSED

kafka.coordinator.GroupMetadataTest > testSelectProtocolChoosesCompatibleProtocol PASSED

kafka.javaapi.message.ByteBufferMessageSetTest > testSizeInBytesWithCompression PASSED

kafka.javaapi.message.ByteBufferMessageSetTest > testIteratorIsConsistentWithCompression PASSED

kafka.javaapi.message.ByteBufferMessageSetTest > testIteratorIsConsistent PASSED

kafka.javaapi.message.ByteBufferMessageSetTest > testEqualsWithCompression PASSED

kafka.javaapi.message.ByteBufferMessageSetTest > testWrittenEqualsRead PASSED

kafka.javaapi.message.ByteBufferMessageSetTest > testEquals PASSED

kafka.javaapi.message.ByteBufferMessageSetTest > testSizeInBytes PASSED

kafka.javaapi.consumer.ZookeeperConsumerConnectorTest > testBasic PASSED

kafka.KafkaTest > testGetKafkaConfigFromArgsWrongSetValue PASSED

kafka.KafkaTest > testKafkaSslPasswords PASSED

kafka.KafkaTest > testGetKafkaConfigFromArgs PASSED

kafka.KafkaTest > testGetKafkaConfigFromArgsNonArgsAtTheEnd PASSED

kafka.KafkaTest > testGetKafkaConfigFromArgsNonArgsOnly PASSED

kafka.KafkaTest > testGetKafkaConfigFromArgsNonArgsAtTheBegging PASSED

kafka.controller.ControllerFailoverTest > testMetadataUpdate PASSED

722 tests completed, 1 failed
:kafka-trunk-jdk8:core:test FAILED
:test_core_2_10 FAILED

FAILURE: Build failed with an exception.

* What went wrong:
Execution failed for task ':core:test'.
> There were failing tests. See the report at: file://<https://builds.apache.org/job/kafka-trunk-jdk8/ws/core/build/reports/tests/index.html>

* Try:
Run with --stacktrace option to get the stack trace. Run with --info or --debug option to get more log output.

BUILD FAILED

Total time: 1 hrs 13 mins 42.889 secs
Build step 'Execute shell' marked build as failure
Recording test results
Setting JDK1_8_0_45_HOME=/home/jenkins/jenkins-slave/tools/hudson.model.JDK/jdk1.8.0_45
Setting GRADLE_2_4_RC_2_HOME=/home/jenkins/jenkins-slave/tools/hudson.plugins.gradle.GradleInstallation/Gradle_2.4-rc-2
Setting JDK1_8_0_45_HOME=/home/jenkins/jenkins-slave/tools/hudson.model.JDK/jdk1.8.0_45
Setting GRADLE_2_4_RC_2_HOME=/home/jenkins/jenkins-slave/tools/hudson.plugins.gradle.GradleInstallation/Gradle_2.4-rc-2

Build failed in Jenkins: kafka-trunk-jdk8 #483

Posted by Apache Jenkins Server <je...@builds.apache.org>.
See <https://builds.apache.org/job/kafka-trunk-jdk8/483/changes>

Changes:

[wangguoz] KAFKA-3449: Rename filterOut() to filterNot() to achieve better

------------------------------------------
[...truncated 1625 lines...]

kafka.log.LogTest > testTruncateTo PASSED

kafka.log.LogTest > testCleanShutdownFile PASSED

kafka.log.OffsetIndexTest > lookupExtremeCases PASSED

kafka.log.OffsetIndexTest > appendTooMany PASSED

kafka.log.OffsetIndexTest > randomLookupTest PASSED

kafka.log.OffsetIndexTest > testReopen PASSED

kafka.log.OffsetIndexTest > appendOutOfOrder PASSED

kafka.log.OffsetIndexTest > truncate PASSED

kafka.log.LogSegmentTest > testRecoveryWithCorruptMessage PASSED

kafka.log.LogSegmentTest > testRecoveryFixesCorruptIndex PASSED

kafka.log.LogSegmentTest > testReadFromGap PASSED

kafka.log.LogSegmentTest > testTruncate PASSED

kafka.log.LogSegmentTest > testReadBeforeFirstOffset PASSED

kafka.log.LogSegmentTest > testCreateWithInitFileSizeAppendMessage PASSED

kafka.log.LogSegmentTest > testChangeFileSuffixes PASSED

kafka.log.LogSegmentTest > testMaxOffset PASSED

kafka.log.LogSegmentTest > testNextOffsetCalculation PASSED

kafka.log.LogSegmentTest > testReadOnEmptySegment PASSED

kafka.log.LogSegmentTest > testReadAfterLast PASSED

kafka.log.LogSegmentTest > testCreateWithInitFileSizeClearShutdown PASSED

kafka.log.LogSegmentTest > testTruncateFull PASSED

kafka.log.CleanerTest > testBuildOffsetMap PASSED

kafka.log.CleanerTest > testSegmentGrouping PASSED

kafka.log.CleanerTest > testCleanSegmentsWithAbort PASSED

kafka.log.CleanerTest > testSegmentGroupingWithSparseOffsets PASSED

kafka.log.CleanerTest > testRecoveryAfterCrash PASSED

kafka.log.CleanerTest > testLogToClean PASSED

kafka.log.CleanerTest > testCleaningWithDeletes PASSED

kafka.log.CleanerTest > testCleanSegments PASSED

kafka.log.CleanerTest > testCleaningWithUnkeyedMessages PASSED

kafka.log.OffsetMapTest > testClear PASSED

kafka.log.OffsetMapTest > testBasicValidation PASSED

kafka.coordinator.GroupCoordinatorResponseTest > testHeartbeatWrongCoordinator PASSED

kafka.coordinator.GroupCoordinatorResponseTest > testDescribeGroupStable PASSED

kafka.coordinator.GroupCoordinatorResponseTest > testHeartbeatIllegalGeneration PASSED

kafka.coordinator.GroupCoordinatorResponseTest > testDescribeGroupWrongCoordinator PASSED

kafka.coordinator.GroupCoordinatorResponseTest > testDescribeGroupRebalancing PASSED

kafka.coordinator.GroupCoordinatorResponseTest > testLeaderFailureInSyncGroup PASSED

kafka.coordinator.GroupCoordinatorResponseTest > testGenerationIdIncrementsOnRebalance PASSED

kafka.coordinator.GroupCoordinatorResponseTest > testSyncGroupFromIllegalGeneration PASSED

kafka.coordinator.GroupCoordinatorResponseTest > testInvalidGroupId PASSED

kafka.coordinator.GroupCoordinatorResponseTest > testHeartbeatUnknownGroup PASSED

kafka.coordinator.GroupCoordinatorResponseTest > testListGroupsIncludesStableGroups PASSED

kafka.coordinator.GroupCoordinatorResponseTest > testHeartbeatDuringRebalanceCausesRebalanceInProgress PASSED

kafka.coordinator.GroupCoordinatorResponseTest > testJoinGroupInconsistentGroupProtocol PASSED

kafka.coordinator.GroupCoordinatorResponseTest > testJoinGroupSessionTimeoutTooLarge PASSED

kafka.coordinator.GroupCoordinatorResponseTest > testJoinGroupSessionTimeoutTooSmall PASSED

kafka.coordinator.GroupCoordinatorResponseTest > testSyncGroupEmptyAssignment PASSED

kafka.coordinator.GroupCoordinatorResponseTest > testCommitOffsetWithDefaultGeneration PASSED

kafka.coordinator.GroupCoordinatorResponseTest > testJoinGroupFromUnchangedLeaderShouldRebalance PASSED

kafka.coordinator.GroupCoordinatorResponseTest > testHeartbeatRebalanceInProgress PASSED

kafka.coordinator.GroupCoordinatorResponseTest > testLeaveGroupUnknownGroup PASSED

kafka.coordinator.GroupCoordinatorResponseTest > testListGroupsIncludesRebalancingGroups PASSED

kafka.coordinator.GroupCoordinatorResponseTest > testSyncGroupFollowerAfterLeader PASSED

kafka.coordinator.GroupCoordinatorResponseTest > testCommitOffsetInAwaitingSync PASSED

kafka.coordinator.GroupCoordinatorResponseTest > testJoinGroupWrongCoordinator PASSED

kafka.coordinator.GroupCoordinatorResponseTest > testJoinGroupUnknownConsumerExistingGroup PASSED

kafka.coordinator.GroupCoordinatorResponseTest > testSyncGroupFromUnknownGroup PASSED

kafka.coordinator.GroupCoordinatorResponseTest > testJoinGroupInconsistentProtocolType PASSED

kafka.coordinator.GroupCoordinatorResponseTest > testCommitOffsetFromUnknownGroup PASSED

kafka.coordinator.GroupCoordinatorResponseTest > testLeaveGroupWrongCoordinator PASSED

kafka.coordinator.GroupCoordinatorResponseTest > testLeaveGroupUnknownConsumerExistingGroup PASSED

kafka.coordinator.GroupCoordinatorResponseTest > testJoinGroupUnknownConsumerNewGroup PASSED

kafka.coordinator.GroupCoordinatorResponseTest > testJoinGroupFromUnchangedFollowerDoesNotRebalance PASSED

kafka.coordinator.GroupCoordinatorResponseTest > testValidJoinGroup PASSED

kafka.coordinator.GroupCoordinatorResponseTest > testSyncGroupLeaderAfterFollower PASSED

kafka.coordinator.GroupCoordinatorResponseTest > testSyncGroupFromUnknownMember PASSED

kafka.coordinator.GroupCoordinatorResponseTest > testValidLeaveGroup PASSED

kafka.coordinator.GroupCoordinatorResponseTest > testDescribeGroupInactiveGroup PASSED

kafka.coordinator.GroupCoordinatorResponseTest > testSyncGroupNotCoordinator PASSED

kafka.coordinator.GroupCoordinatorResponseTest > testHeartbeatUnknownConsumerExistingGroup PASSED

kafka.coordinator.GroupCoordinatorResponseTest > testValidHeartbeat PASSED

kafka.coordinator.MemberMetadataTest > testMatchesSupportedProtocols PASSED

kafka.coordinator.MemberMetadataTest > testMetadata PASSED

kafka.coordinator.MemberMetadataTest > testMetadataRaisesOnUnsupportedProtocol PASSED

kafka.coordinator.MemberMetadataTest > testVoteForPreferredProtocol PASSED

kafka.coordinator.MemberMetadataTest > testVoteRaisesOnNoSupportedProtocols PASSED

kafka.coordinator.GroupMetadataTest > testDeadToAwaitingSyncIllegalTransition PASSED

kafka.coordinator.GroupMetadataTest > testPreparingRebalanceToStableIllegalTransition PASSED

kafka.coordinator.GroupMetadataTest > testCannotRebalanceWhenDead PASSED

kafka.coordinator.GroupMetadataTest > testSelectProtocol PASSED

kafka.coordinator.GroupMetadataTest > testCannotRebalanceWhenPreparingRebalance PASSED

kafka.coordinator.GroupMetadataTest > testDeadToPreparingRebalanceIllegalTransition PASSED

kafka.coordinator.GroupMetadataTest > testCanRebalanceWhenAwaitingSync PASSED

kafka.coordinator.GroupMetadataTest > testAwaitingSyncToPreparingRebalanceTransition PASSED

kafka.coordinator.GroupMetadataTest > testStableToAwaitingSyncIllegalTransition PASSED

kafka.coordinator.GroupMetadataTest > testDeadToDeadIllegalTransition PASSED

kafka.coordinator.GroupMetadataTest > testSelectProtocolRaisesIfNoMembers PASSED

kafka.coordinator.GroupMetadataTest > testStableToPreparingRebalanceTransition PASSED

kafka.coordinator.GroupMetadataTest > testPreparingRebalanceToDeadTransition PASSED

kafka.coordinator.GroupMetadataTest > testStableToStableIllegalTransition PASSED

kafka.coordinator.GroupMetadataTest > testAwaitingSyncToStableTransition PASSED

kafka.coordinator.GroupMetadataTest > testDeadToStableIllegalTransition PASSED

kafka.coordinator.GroupMetadataTest > testAwaitingSyncToAwaitingSyncIllegalTransition PASSED

kafka.coordinator.GroupMetadataTest > testSupportsProtocols PASSED

kafka.coordinator.GroupMetadataTest > testCanRebalanceWhenStable PASSED

kafka.coordinator.GroupMetadataTest > testPreparingRebalanceToPreparingRebalanceIllegalTransition PASSED

kafka.coordinator.GroupMetadataTest > testSelectProtocolChoosesCompatibleProtocol PASSED

kafka.javaapi.message.ByteBufferMessageSetTest > testSizeInBytesWithCompression PASSED

kafka.javaapi.message.ByteBufferMessageSetTest > testIteratorIsConsistentWithCompression PASSED

kafka.javaapi.message.ByteBufferMessageSetTest > testIteratorIsConsistent PASSED

kafka.javaapi.message.ByteBufferMessageSetTest > testEqualsWithCompression PASSED

kafka.javaapi.message.ByteBufferMessageSetTest > testWrittenEqualsRead PASSED

kafka.javaapi.message.ByteBufferMessageSetTest > testEquals PASSED

kafka.javaapi.message.ByteBufferMessageSetTest > testSizeInBytes PASSED

kafka.javaapi.consumer.ZookeeperConsumerConnectorTest > testBasic PASSED

kafka.KafkaTest > testGetKafkaConfigFromArgsWrongSetValue PASSED

kafka.KafkaTest > testKafkaSslPasswords PASSED

kafka.KafkaTest > testGetKafkaConfigFromArgs PASSED

kafka.KafkaTest > testGetKafkaConfigFromArgsNonArgsAtTheEnd PASSED

kafka.KafkaTest > testGetKafkaConfigFromArgsNonArgsOnly PASSED

kafka.KafkaTest > testGetKafkaConfigFromArgsNonArgsAtTheBegging PASSED

kafka.controller.ControllerFailoverTest > testMetadataUpdate PASSED

722 tests completed, 2 failed
:kafka-trunk-jdk8:core:test FAILED
:test_core_2_10 FAILED

FAILURE: Build failed with an exception.

* What went wrong:
Execution failed for task ':core:test'.
> There were failing tests. See the report at: file://<https://builds.apache.org/job/kafka-trunk-jdk8/ws/core/build/reports/tests/index.html>

* Try:
Run with --stacktrace option to get the stack trace. Run with --info or --debug option to get more log output.

BUILD FAILED

Total time: 1 hrs 11 mins 44.26 secs
Build step 'Execute shell' marked build as failure
Recording test results
Setting JDK1_8_0_45_HOME=/home/jenkins/jenkins-slave/tools/hudson.model.JDK/jdk1.8.0_45
Setting GRADLE_2_4_RC_2_HOME=/home/jenkins/jenkins-slave/tools/hudson.plugins.gradle.GradleInstallation/Gradle_2.4-rc-2
Setting JDK1_8_0_45_HOME=/home/jenkins/jenkins-slave/tools/hudson.model.JDK/jdk1.8.0_45
Setting GRADLE_2_4_RC_2_HOME=/home/jenkins/jenkins-slave/tools/hudson.plugins.gradle.GradleInstallation/Gradle_2.4-rc-2

Build failed in Jenkins: kafka-trunk-jdk8 #482

Posted by Apache Jenkins Server <je...@builds.apache.org>.
See <https://builds.apache.org/job/kafka-trunk-jdk8/482/changes>

Changes:

[cshapi] KAFKA-3463: change default receive buffer size for consumer to 64K

------------------------------------------
[...truncated 1634 lines...]
kafka.log.LogTest > testTruncateTo PASSED

kafka.log.LogTest > testCleanShutdownFile PASSED

kafka.log.OffsetIndexTest > lookupExtremeCases PASSED

kafka.log.OffsetIndexTest > appendTooMany PASSED

kafka.log.OffsetIndexTest > randomLookupTest PASSED

kafka.log.OffsetIndexTest > testReopen PASSED

kafka.log.OffsetIndexTest > appendOutOfOrder PASSED

kafka.log.OffsetIndexTest > truncate PASSED

kafka.log.LogSegmentTest > testRecoveryWithCorruptMessage PASSED

kafka.log.LogSegmentTest > testRecoveryFixesCorruptIndex PASSED

kafka.log.LogSegmentTest > testReadFromGap PASSED

kafka.log.LogSegmentTest > testTruncate PASSED

kafka.log.LogSegmentTest > testReadBeforeFirstOffset PASSED

kafka.log.LogSegmentTest > testCreateWithInitFileSizeAppendMessage PASSED

kafka.log.LogSegmentTest > testChangeFileSuffixes PASSED

kafka.log.LogSegmentTest > testMaxOffset PASSED

kafka.log.LogSegmentTest > testNextOffsetCalculation PASSED

kafka.log.LogSegmentTest > testReadOnEmptySegment PASSED

kafka.log.LogSegmentTest > testReadAfterLast PASSED

kafka.log.LogSegmentTest > testCreateWithInitFileSizeClearShutdown PASSED

kafka.log.LogSegmentTest > testTruncateFull PASSED

kafka.log.CleanerTest > testBuildOffsetMap PASSED

kafka.log.CleanerTest > testSegmentGrouping PASSED

kafka.log.CleanerTest > testCleanSegmentsWithAbort PASSED

kafka.log.CleanerTest > testSegmentGroupingWithSparseOffsets PASSED

kafka.log.CleanerTest > testRecoveryAfterCrash PASSED

kafka.log.CleanerTest > testLogToClean PASSED

kafka.log.CleanerTest > testCleaningWithDeletes PASSED

kafka.log.CleanerTest > testCleanSegments PASSED

kafka.log.CleanerTest > testCleaningWithUnkeyedMessages PASSED

kafka.log.OffsetMapTest > testClear PASSED

kafka.log.OffsetMapTest > testBasicValidation PASSED

kafka.coordinator.GroupCoordinatorResponseTest > testHeartbeatWrongCoordinator PASSED

kafka.coordinator.GroupCoordinatorResponseTest > testDescribeGroupStable PASSED

kafka.coordinator.GroupCoordinatorResponseTest > testHeartbeatIllegalGeneration PASSED

kafka.coordinator.GroupCoordinatorResponseTest > testDescribeGroupWrongCoordinator PASSED

kafka.coordinator.GroupCoordinatorResponseTest > testDescribeGroupRebalancing PASSED

kafka.coordinator.GroupCoordinatorResponseTest > testLeaderFailureInSyncGroup PASSED

kafka.coordinator.GroupCoordinatorResponseTest > testGenerationIdIncrementsOnRebalance PASSED

kafka.coordinator.GroupCoordinatorResponseTest > testSyncGroupFromIllegalGeneration PASSED

kafka.coordinator.GroupCoordinatorResponseTest > testInvalidGroupId PASSED

kafka.coordinator.GroupCoordinatorResponseTest > testHeartbeatUnknownGroup PASSED

kafka.coordinator.GroupCoordinatorResponseTest > testListGroupsIncludesStableGroups PASSED

kafka.coordinator.GroupCoordinatorResponseTest > testHeartbeatDuringRebalanceCausesRebalanceInProgress PASSED

kafka.coordinator.GroupCoordinatorResponseTest > testJoinGroupInconsistentGroupProtocol PASSED

kafka.coordinator.GroupCoordinatorResponseTest > testJoinGroupSessionTimeoutTooLarge PASSED

kafka.coordinator.GroupCoordinatorResponseTest > testJoinGroupSessionTimeoutTooSmall PASSED

kafka.coordinator.GroupCoordinatorResponseTest > testSyncGroupEmptyAssignment PASSED

kafka.coordinator.GroupCoordinatorResponseTest > testCommitOffsetWithDefaultGeneration PASSED

kafka.coordinator.GroupCoordinatorResponseTest > testJoinGroupFromUnchangedLeaderShouldRebalance PASSED

kafka.coordinator.GroupCoordinatorResponseTest > testHeartbeatRebalanceInProgress PASSED

kafka.coordinator.GroupCoordinatorResponseTest > testLeaveGroupUnknownGroup PASSED

kafka.coordinator.GroupCoordinatorResponseTest > testListGroupsIncludesRebalancingGroups PASSED

kafka.coordinator.GroupCoordinatorResponseTest > testSyncGroupFollowerAfterLeader PASSED

kafka.coordinator.GroupCoordinatorResponseTest > testCommitOffsetInAwaitingSync PASSED

kafka.coordinator.GroupCoordinatorResponseTest > testJoinGroupWrongCoordinator PASSED

kafka.coordinator.GroupCoordinatorResponseTest > testJoinGroupUnknownConsumerExistingGroup PASSED

kafka.coordinator.GroupCoordinatorResponseTest > testSyncGroupFromUnknownGroup PASSED

kafka.coordinator.GroupCoordinatorResponseTest > testJoinGroupInconsistentProtocolType PASSED

kafka.coordinator.GroupCoordinatorResponseTest > testCommitOffsetFromUnknownGroup PASSED

kafka.coordinator.GroupCoordinatorResponseTest > testLeaveGroupWrongCoordinator PASSED

kafka.coordinator.GroupCoordinatorResponseTest > testLeaveGroupUnknownConsumerExistingGroup PASSED

kafka.coordinator.GroupCoordinatorResponseTest > testJoinGroupUnknownConsumerNewGroup PASSED

kafka.coordinator.GroupCoordinatorResponseTest > testJoinGroupFromUnchangedFollowerDoesNotRebalance PASSED

kafka.coordinator.GroupCoordinatorResponseTest > testValidJoinGroup PASSED

kafka.coordinator.GroupCoordinatorResponseTest > testSyncGroupLeaderAfterFollower PASSED

kafka.coordinator.GroupCoordinatorResponseTest > testSyncGroupFromUnknownMember PASSED

kafka.coordinator.GroupCoordinatorResponseTest > testValidLeaveGroup PASSED

kafka.coordinator.GroupCoordinatorResponseTest > testDescribeGroupInactiveGroup PASSED

kafka.coordinator.GroupCoordinatorResponseTest > testSyncGroupNotCoordinator PASSED

kafka.coordinator.GroupCoordinatorResponseTest > testHeartbeatUnknownConsumerExistingGroup PASSED

kafka.coordinator.GroupCoordinatorResponseTest > testValidHeartbeat PASSED

kafka.coordinator.MemberMetadataTest > testMatchesSupportedProtocols PASSED

kafka.coordinator.MemberMetadataTest > testMetadata PASSED

kafka.coordinator.MemberMetadataTest > testMetadataRaisesOnUnsupportedProtocol PASSED

kafka.coordinator.MemberMetadataTest > testVoteForPreferredProtocol PASSED

kafka.coordinator.MemberMetadataTest > testVoteRaisesOnNoSupportedProtocols PASSED

kafka.coordinator.GroupMetadataTest > testDeadToAwaitingSyncIllegalTransition PASSED

kafka.coordinator.GroupMetadataTest > testPreparingRebalanceToStableIllegalTransition PASSED

kafka.coordinator.GroupMetadataTest > testCannotRebalanceWhenDead PASSED

kafka.coordinator.GroupMetadataTest > testSelectProtocol PASSED

kafka.coordinator.GroupMetadataTest > testCannotRebalanceWhenPreparingRebalance PASSED

kafka.coordinator.GroupMetadataTest > testDeadToPreparingRebalanceIllegalTransition PASSED

kafka.coordinator.GroupMetadataTest > testCanRebalanceWhenAwaitingSync PASSED

kafka.coordinator.GroupMetadataTest > testAwaitingSyncToPreparingRebalanceTransition PASSED

kafka.coordinator.GroupMetadataTest > testStableToAwaitingSyncIllegalTransition PASSED

kafka.coordinator.GroupMetadataTest > testDeadToDeadIllegalTransition PASSED

kafka.coordinator.GroupMetadataTest > testSelectProtocolRaisesIfNoMembers PASSED

kafka.coordinator.GroupMetadataTest > testStableToPreparingRebalanceTransition PASSED

kafka.coordinator.GroupMetadataTest > testPreparingRebalanceToDeadTransition PASSED

kafka.coordinator.GroupMetadataTest > testStableToStableIllegalTransition PASSED

kafka.coordinator.GroupMetadataTest > testAwaitingSyncToStableTransition PASSED

kafka.coordinator.GroupMetadataTest > testDeadToStableIllegalTransition PASSED

kafka.coordinator.GroupMetadataTest > testAwaitingSyncToAwaitingSyncIllegalTransition PASSED

kafka.coordinator.GroupMetadataTest > testSupportsProtocols PASSED

kafka.coordinator.GroupMetadataTest > testCanRebalanceWhenStable PASSED

kafka.coordinator.GroupMetadataTest > testPreparingRebalanceToPreparingRebalanceIllegalTransition PASSED

kafka.coordinator.GroupMetadataTest > testSelectProtocolChoosesCompatibleProtocol PASSED

kafka.javaapi.message.ByteBufferMessageSetTest > testSizeInBytesWithCompression PASSED

kafka.javaapi.message.ByteBufferMessageSetTest > testIteratorIsConsistentWithCompression PASSED

kafka.javaapi.message.ByteBufferMessageSetTest > testIteratorIsConsistent PASSED

kafka.javaapi.message.ByteBufferMessageSetTest > testEqualsWithCompression PASSED

kafka.javaapi.message.ByteBufferMessageSetTest > testWrittenEqualsRead PASSED

kafka.javaapi.message.ByteBufferMessageSetTest > testEquals PASSED

kafka.javaapi.message.ByteBufferMessageSetTest > testSizeInBytes PASSED

kafka.javaapi.consumer.ZookeeperConsumerConnectorTest > testBasic PASSED

kafka.KafkaTest > testGetKafkaConfigFromArgsWrongSetValue PASSED

kafka.KafkaTest > testKafkaSslPasswords PASSED

kafka.KafkaTest > testGetKafkaConfigFromArgs PASSED

kafka.KafkaTest > testGetKafkaConfigFromArgsNonArgsAtTheEnd PASSED

kafka.KafkaTest > testGetKafkaConfigFromArgsNonArgsOnly PASSED

kafka.KafkaTest > testGetKafkaConfigFromArgsNonArgsAtTheBegging PASSED

kafka.controller.ControllerFailoverTest > testMetadataUpdate PASSED

722 tests completed, 2 failed
:kafka-trunk-jdk8:core:test FAILED
:test_core_2_10 FAILED

FAILURE: Build failed with an exception.

* What went wrong:
Execution failed for task ':core:test'.
> Process 'Gradle Test Executor 2' finished with non-zero exit value 1

* Try:
Run with --stacktrace option to get the stack trace. Run with --info or --debug option to get more log output.

BUILD FAILED

Total time: 1 hrs 10 mins 51.179 secs
Build step 'Execute shell' marked build as failure
Recording test results
Setting JDK1_8_0_45_HOME=/home/jenkins/jenkins-slave/tools/hudson.model.JDK/jdk1.8.0_45
Setting GRADLE_2_4_RC_2_HOME=/home/jenkins/jenkins-slave/tools/hudson.plugins.gradle.GradleInstallation/Gradle_2.4-rc-2
ERROR: Step ?Publish JUnit test result report? failed: No test report files were found. Configuration error?
Setting JDK1_8_0_45_HOME=/home/jenkins/jenkins-slave/tools/hudson.model.JDK/jdk1.8.0_45
Setting GRADLE_2_4_RC_2_HOME=/home/jenkins/jenkins-slave/tools/hudson.plugins.gradle.GradleInstallation/Gradle_2.4-rc-2