You are viewing a plain text version of this content. The canonical link for it is here.
Posted to oak-dev@jackrabbit.apache.org by Apache Jenkins Server <je...@builds.apache.org> on 2016/11/03 10:04:17 UTC
[Oak origin/trunk] Apache Jackrabbit Oak matrix - Build # 1260 -
Still Failing
The Apache Jenkins build system has built Apache Jackrabbit Oak matrix (build #1260)
Status: Still Failing
Check console output at https://builds.apache.org/job/Apache%20Jackrabbit%20Oak%20matrix/1260/ to view the results.
Changes:
No changes
Test results:
25 tests failed.
FAILED: org.apache.jackrabbit.oak.run.BasicServerTest.testServerOk
Error Message:
Address already in use
Stack Trace:
java.net.BindException: Address already in use
at sun.nio.ch.Net.bind0(Native Method)
at sun.nio.ch.Net.bind(Net.java:463)
at sun.nio.ch.Net.bind(Net.java:455)
at sun.nio.ch.ServerSocketChannelImpl.bind(ServerSocketChannelImpl.java:223)
at sun.nio.ch.ServerSocketAdaptor.bind(ServerSocketAdaptor.java:74)
at org.eclipse.jetty.server.nio.SelectChannelConnector.open(SelectChannelConnector.java:187)
at org.eclipse.jetty.server.AbstractConnector.doStart(AbstractConnector.java:316)
at org.eclipse.jetty.server.nio.SelectChannelConnector.doStart(SelectChannelConnector.java:265)
at org.eclipse.jetty.util.component.AbstractLifeCycle.start(AbstractLifeCycle.java:64)
at org.eclipse.jetty.server.Server.doStart(Server.java:291)
at org.eclipse.jetty.util.component.AbstractLifeCycle.start(AbstractLifeCycle.java:64)
at org.apache.jackrabbit.oak.run.HttpServer.<init>(HttpServer.java:59)
at org.apache.jackrabbit.oak.run.HttpServer.<init>(HttpServer.java:46)
at org.apache.jackrabbit.oak.run.BasicServerTest.startServer(BasicServerTest.java:41)
at sun.reflect.NativeMethodAccessorImpl.invoke0(Native Method)
at sun.reflect.NativeMethodAccessorImpl.invoke(NativeMethodAccessorImpl.java:57)
at sun.reflect.DelegatingMethodAccessorImpl.invoke(DelegatingMethodAccessorImpl.java:43)
at java.lang.reflect.Method.invoke(Method.java:606)
at org.junit.runners.model.FrameworkMethod$1.runReflectiveCall(FrameworkMethod.java:50)
at org.junit.internal.runners.model.ReflectiveCallable.run(ReflectiveCallable.java:12)
at org.junit.runners.model.FrameworkMethod.invokeExplosively(FrameworkMethod.java:47)
at org.junit.internal.runners.statements.RunBefores.evaluate(RunBefores.java:24)
at org.junit.internal.runners.statements.RunAfters.evaluate(RunAfters.java:27)
at org.junit.runners.ParentRunner.runLeaf(ParentRunner.java:325)
at org.junit.runners.BlockJUnit4ClassRunner.runChild(BlockJUnit4ClassRunner.java:78)
at org.junit.runners.BlockJUnit4ClassRunner.runChild(BlockJUnit4ClassRunner.java:57)
at org.junit.runners.ParentRunner$3.run(ParentRunner.java:290)
at org.junit.runners.ParentRunner$1.schedule(ParentRunner.java:71)
at org.junit.runners.ParentRunner.runChildren(ParentRunner.java:288)
at org.junit.runners.ParentRunner.access$000(ParentRunner.java:58)
at org.junit.runners.ParentRunner$2.evaluate(ParentRunner.java:268)
at org.junit.runners.ParentRunner.run(ParentRunner.java:363)
at org.apache.maven.surefire.junit4.JUnit4Provider.execute(JUnit4Provider.java:252)
at org.apache.maven.surefire.junit4.JUnit4Provider.executeTestSet(JUnit4Provider.java:141)
at org.apache.maven.surefire.junit4.JUnit4Provider.invoke(JUnit4Provider.java:112)
at sun.reflect.NativeMethodAccessorImpl.invoke0(Native Method)
at sun.reflect.NativeMethodAccessorImpl.invoke(NativeMethodAccessorImpl.java:57)
at sun.reflect.DelegatingMethodAccessorImpl.invoke(DelegatingMethodAccessorImpl.java:43)
at java.lang.reflect.Method.invoke(Method.java:606)
at org.apache.maven.surefire.util.ReflectionUtils.invokeMethodWithArray(ReflectionUtils.java:189)
at org.apache.maven.surefire.booter.ProviderFactory$ProviderProxy.invoke(ProviderFactory.java:165)
at org.apache.maven.surefire.booter.ProviderFactory.invokeProvider(ProviderFactory.java:85)
at org.apache.maven.surefire.booter.ForkedBooter.runSuitesInProcess(ForkedBooter.java:115)
at org.apache.maven.surefire.booter.ForkedBooter.main(ForkedBooter.java:75)
FAILED: org.apache.jackrabbit.oak.run.BasicServerTest.testServerOk
Error Message:
null
Stack Trace:
java.lang.NullPointerException
at org.apache.jackrabbit.oak.run.BasicServerTest.stopServer(BasicServerTest.java:46)
at sun.reflect.NativeMethodAccessorImpl.invoke0(Native Method)
at sun.reflect.NativeMethodAccessorImpl.invoke(NativeMethodAccessorImpl.java:57)
at sun.reflect.DelegatingMethodAccessorImpl.invoke(DelegatingMethodAccessorImpl.java:43)
at java.lang.reflect.Method.invoke(Method.java:606)
at org.junit.runners.model.FrameworkMethod$1.runReflectiveCall(FrameworkMethod.java:50)
at org.junit.internal.runners.model.ReflectiveCallable.run(ReflectiveCallable.java:12)
at org.junit.runners.model.FrameworkMethod.invokeExplosively(FrameworkMethod.java:47)
at org.junit.internal.runners.statements.RunAfters.evaluate(RunAfters.java:33)
at org.junit.runners.ParentRunner.runLeaf(ParentRunner.java:325)
at org.junit.runners.BlockJUnit4ClassRunner.runChild(BlockJUnit4ClassRunner.java:78)
at org.junit.runners.BlockJUnit4ClassRunner.runChild(BlockJUnit4ClassRunner.java:57)
at org.junit.runners.ParentRunner$3.run(ParentRunner.java:290)
at org.junit.runners.ParentRunner$1.schedule(ParentRunner.java:71)
at org.junit.runners.ParentRunner.runChildren(ParentRunner.java:288)
at org.junit.runners.ParentRunner.access$000(ParentRunner.java:58)
at org.junit.runners.ParentRunner$2.evaluate(ParentRunner.java:268)
at org.junit.runners.ParentRunner.run(ParentRunner.java:363)
at org.apache.maven.surefire.junit4.JUnit4Provider.execute(JUnit4Provider.java:252)
at org.apache.maven.surefire.junit4.JUnit4Provider.executeTestSet(JUnit4Provider.java:141)
at org.apache.maven.surefire.junit4.JUnit4Provider.invoke(JUnit4Provider.java:112)
at sun.reflect.NativeMethodAccessorImpl.invoke0(Native Method)
at sun.reflect.NativeMethodAccessorImpl.invoke(NativeMethodAccessorImpl.java:57)
at sun.reflect.DelegatingMethodAccessorImpl.invoke(DelegatingMethodAccessorImpl.java:43)
at java.lang.reflect.Method.invoke(Method.java:606)
at org.apache.maven.surefire.util.ReflectionUtils.invokeMethodWithArray(ReflectionUtils.java:189)
at org.apache.maven.surefire.booter.ProviderFactory$ProviderProxy.invoke(ProviderFactory.java:165)
at org.apache.maven.surefire.booter.ProviderFactory.invokeProvider(ProviderFactory.java:85)
at org.apache.maven.surefire.booter.ForkedBooter.runSuitesInProcess(ForkedBooter.java:115)
at org.apache.maven.surefire.booter.ForkedBooter.main(ForkedBooter.java:75)
FAILED: org.apache.jackrabbit.oak.plugins.segment.standby.ExternalPrivateStoreIT.testProxyFlippedIntermediateByteChange
Error Message:
proxy not started
Stack Trace:
java.lang.Exception: proxy not started
at org.apache.jackrabbit.oak.plugins.segment.NetworkErrorProxy.reset(NetworkErrorProxy.java:87)
at org.apache.jackrabbit.oak.plugins.segment.standby.DataStoreTestBase.useProxy(DataStoreTestBase.java:216)
at org.apache.jackrabbit.oak.plugins.segment.standby.DataStoreTestBase.testProxyFlippedIntermediateByteChange(DataStoreTestBase.java:184)
at sun.reflect.NativeMethodAccessorImpl.invoke0(Native Method)
at sun.reflect.NativeMethodAccessorImpl.invoke(NativeMethodAccessorImpl.java:57)
at sun.reflect.DelegatingMethodAccessorImpl.invoke(DelegatingMethodAccessorImpl.java:43)
at java.lang.reflect.Method.invoke(Method.java:606)
at org.junit.runners.model.FrameworkMethod$1.runReflectiveCall(FrameworkMethod.java:50)
at org.junit.internal.runners.model.ReflectiveCallable.run(ReflectiveCallable.java:12)
at org.junit.runners.model.FrameworkMethod.invokeExplosively(FrameworkMethod.java:47)
at org.junit.internal.runners.statements.InvokeMethod.evaluate(InvokeMethod.java:17)
at org.junit.internal.runners.statements.RunBefores.evaluate(RunBefores.java:26)
at org.junit.internal.runners.statements.RunAfters.evaluate(RunAfters.java:27)
at org.junit.runners.ParentRunner.runLeaf(ParentRunner.java:325)
at org.junit.runners.BlockJUnit4ClassRunner.runChild(BlockJUnit4ClassRunner.java:78)
at org.junit.runners.BlockJUnit4ClassRunner.runChild(BlockJUnit4ClassRunner.java:57)
at org.junit.runners.ParentRunner$3.run(ParentRunner.java:290)
at org.junit.runners.ParentRunner$1.schedule(ParentRunner.java:71)
at org.junit.runners.ParentRunner.runChildren(ParentRunner.java:288)
at org.junit.runners.ParentRunner.access$000(ParentRunner.java:58)
at org.junit.runners.ParentRunner$2.evaluate(ParentRunner.java:268)
at org.junit.internal.runners.statements.RunBefores.evaluate(RunBefores.java:26)
at org.junit.runners.ParentRunner.run(ParentRunner.java:363)
at org.apache.maven.surefire.junit4.JUnit4Provider.execute(JUnit4Provider.java:252)
at org.apache.maven.surefire.junit4.JUnit4Provider.executeTestSet(JUnit4Provider.java:141)
at org.apache.maven.surefire.junit4.JUnit4Provider.invoke(JUnit4Provider.java:112)
at sun.reflect.NativeMethodAccessorImpl.invoke0(Native Method)
at sun.reflect.NativeMethodAccessorImpl.invoke(NativeMethodAccessorImpl.java:57)
at sun.reflect.DelegatingMethodAccessorImpl.invoke(DelegatingMethodAccessorImpl.java:43)
at java.lang.reflect.Method.invoke(Method.java:606)
at org.apache.maven.surefire.util.ReflectionUtils.invokeMethodWithArray(ReflectionUtils.java:189)
at org.apache.maven.surefire.booter.ProviderFactory$ProviderProxy.invoke(ProviderFactory.java:165)
at org.apache.maven.surefire.booter.ProviderFactory.invokeProvider(ProviderFactory.java:85)
at org.apache.maven.surefire.booter.ForkedBooter.runSuitesInProcess(ForkedBooter.java:115)
at org.apache.maven.surefire.booter.ForkedBooter.main(ForkedBooter.java:75)
FAILED: org.apache.jackrabbit.oak.plugins.segment.standby.ExternalPrivateStoreIT.testProxySkippedBytesIntermediateChange
Error Message:
proxy not started
Stack Trace:
java.lang.Exception: proxy not started
at org.apache.jackrabbit.oak.plugins.segment.NetworkErrorProxy.reset(NetworkErrorProxy.java:87)
at org.apache.jackrabbit.oak.plugins.segment.standby.DataStoreTestBase.useProxy(DataStoreTestBase.java:216)
at org.apache.jackrabbit.oak.plugins.segment.standby.DataStoreTestBase.testProxySkippedBytesIntermediateChange(DataStoreTestBase.java:164)
at sun.reflect.NativeMethodAccessorImpl.invoke0(Native Method)
at sun.reflect.NativeMethodAccessorImpl.invoke(NativeMethodAccessorImpl.java:57)
at sun.reflect.DelegatingMethodAccessorImpl.invoke(DelegatingMethodAccessorImpl.java:43)
at java.lang.reflect.Method.invoke(Method.java:606)
at org.junit.runners.model.FrameworkMethod$1.runReflectiveCall(FrameworkMethod.java:50)
at org.junit.internal.runners.model.ReflectiveCallable.run(ReflectiveCallable.java:12)
at org.junit.runners.model.FrameworkMethod.invokeExplosively(FrameworkMethod.java:47)
at org.junit.internal.runners.statements.InvokeMethod.evaluate(InvokeMethod.java:17)
at org.junit.internal.runners.statements.RunBefores.evaluate(RunBefores.java:26)
at org.junit.internal.runners.statements.RunAfters.evaluate(RunAfters.java:27)
at org.junit.runners.ParentRunner.runLeaf(ParentRunner.java:325)
at org.junit.runners.BlockJUnit4ClassRunner.runChild(BlockJUnit4ClassRunner.java:78)
at org.junit.runners.BlockJUnit4ClassRunner.runChild(BlockJUnit4ClassRunner.java:57)
at org.junit.runners.ParentRunner$3.run(ParentRunner.java:290)
at org.junit.runners.ParentRunner$1.schedule(ParentRunner.java:71)
at org.junit.runners.ParentRunner.runChildren(ParentRunner.java:288)
at org.junit.runners.ParentRunner.access$000(ParentRunner.java:58)
at org.junit.runners.ParentRunner$2.evaluate(ParentRunner.java:268)
at org.junit.internal.runners.statements.RunBefores.evaluate(RunBefores.java:26)
at org.junit.runners.ParentRunner.run(ParentRunner.java:363)
at org.apache.maven.surefire.junit4.JUnit4Provider.execute(JUnit4Provider.java:252)
at org.apache.maven.surefire.junit4.JUnit4Provider.executeTestSet(JUnit4Provider.java:141)
at org.apache.maven.surefire.junit4.JUnit4Provider.invoke(JUnit4Provider.java:112)
at sun.reflect.NativeMethodAccessorImpl.invoke0(Native Method)
at sun.reflect.NativeMethodAccessorImpl.invoke(NativeMethodAccessorImpl.java:57)
at sun.reflect.DelegatingMethodAccessorImpl.invoke(DelegatingMethodAccessorImpl.java:43)
at java.lang.reflect.Method.invoke(Method.java:606)
at org.apache.maven.surefire.util.ReflectionUtils.invokeMethodWithArray(ReflectionUtils.java:189)
at org.apache.maven.surefire.booter.ProviderFactory$ProviderProxy.invoke(ProviderFactory.java:165)
at org.apache.maven.surefire.booter.ProviderFactory.invokeProvider(ProviderFactory.java:85)
at org.apache.maven.surefire.booter.ForkedBooter.runSuitesInProcess(ForkedBooter.java:115)
at org.apache.maven.surefire.booter.ForkedBooter.main(ForkedBooter.java:75)
FAILED: org.apache.jackrabbit.oak.plugins.segment.standby.ExternalPrivateStoreIT.testProxyFlippedIntermediateByte
Error Message:
proxy not started
Stack Trace:
java.lang.Exception: proxy not started
at org.apache.jackrabbit.oak.plugins.segment.NetworkErrorProxy.reset(NetworkErrorProxy.java:87)
at org.apache.jackrabbit.oak.plugins.segment.standby.DataStoreTestBase.useProxy(DataStoreTestBase.java:216)
at org.apache.jackrabbit.oak.plugins.segment.standby.DataStoreTestBase.testProxyFlippedIntermediateByte(DataStoreTestBase.java:174)
at sun.reflect.NativeMethodAccessorImpl.invoke0(Native Method)
at sun.reflect.NativeMethodAccessorImpl.invoke(NativeMethodAccessorImpl.java:57)
at sun.reflect.DelegatingMethodAccessorImpl.invoke(DelegatingMethodAccessorImpl.java:43)
at java.lang.reflect.Method.invoke(Method.java:606)
at org.junit.runners.model.FrameworkMethod$1.runReflectiveCall(FrameworkMethod.java:50)
at org.junit.internal.runners.model.ReflectiveCallable.run(ReflectiveCallable.java:12)
at org.junit.runners.model.FrameworkMethod.invokeExplosively(FrameworkMethod.java:47)
at org.junit.internal.runners.statements.InvokeMethod.evaluate(InvokeMethod.java:17)
at org.junit.internal.runners.statements.RunBefores.evaluate(RunBefores.java:26)
at org.junit.internal.runners.statements.RunAfters.evaluate(RunAfters.java:27)
at org.junit.runners.ParentRunner.runLeaf(ParentRunner.java:325)
at org.junit.runners.BlockJUnit4ClassRunner.runChild(BlockJUnit4ClassRunner.java:78)
at org.junit.runners.BlockJUnit4ClassRunner.runChild(BlockJUnit4ClassRunner.java:57)
at org.junit.runners.ParentRunner$3.run(ParentRunner.java:290)
at org.junit.runners.ParentRunner$1.schedule(ParentRunner.java:71)
at org.junit.runners.ParentRunner.runChildren(ParentRunner.java:288)
at org.junit.runners.ParentRunner.access$000(ParentRunner.java:58)
at org.junit.runners.ParentRunner$2.evaluate(ParentRunner.java:268)
at org.junit.internal.runners.statements.RunBefores.evaluate(RunBefores.java:26)
at org.junit.runners.ParentRunner.run(ParentRunner.java:363)
at org.apache.maven.surefire.junit4.JUnit4Provider.execute(JUnit4Provider.java:252)
at org.apache.maven.surefire.junit4.JUnit4Provider.executeTestSet(JUnit4Provider.java:141)
at org.apache.maven.surefire.junit4.JUnit4Provider.invoke(JUnit4Provider.java:112)
at sun.reflect.NativeMethodAccessorImpl.invoke0(Native Method)
at sun.reflect.NativeMethodAccessorImpl.invoke(NativeMethodAccessorImpl.java:57)
at sun.reflect.DelegatingMethodAccessorImpl.invoke(DelegatingMethodAccessorImpl.java:43)
at java.lang.reflect.Method.invoke(Method.java:606)
at org.apache.maven.surefire.util.ReflectionUtils.invokeMethodWithArray(ReflectionUtils.java:189)
at org.apache.maven.surefire.booter.ProviderFactory$ProviderProxy.invoke(ProviderFactory.java:165)
at org.apache.maven.surefire.booter.ProviderFactory.invokeProvider(ProviderFactory.java:85)
at org.apache.maven.surefire.booter.ForkedBooter.runSuitesInProcess(ForkedBooter.java:115)
at org.apache.maven.surefire.booter.ForkedBooter.main(ForkedBooter.java:75)
FAILED: org.apache.jackrabbit.oak.plugins.segment.standby.ExternalPrivateStoreIT.testProxyFlippedIntermediateByte2
Error Message:
proxy not started
Stack Trace:
java.lang.Exception: proxy not started
at org.apache.jackrabbit.oak.plugins.segment.NetworkErrorProxy.reset(NetworkErrorProxy.java:87)
at org.apache.jackrabbit.oak.plugins.segment.standby.DataStoreTestBase.useProxy(DataStoreTestBase.java:216)
at org.apache.jackrabbit.oak.plugins.segment.standby.DataStoreTestBase.testProxyFlippedIntermediateByte2(DataStoreTestBase.java:179)
at sun.reflect.NativeMethodAccessorImpl.invoke0(Native Method)
at sun.reflect.NativeMethodAccessorImpl.invoke(NativeMethodAccessorImpl.java:57)
at sun.reflect.DelegatingMethodAccessorImpl.invoke(DelegatingMethodAccessorImpl.java:43)
at java.lang.reflect.Method.invoke(Method.java:606)
at org.junit.runners.model.FrameworkMethod$1.runReflectiveCall(FrameworkMethod.java:50)
at org.junit.internal.runners.model.ReflectiveCallable.run(ReflectiveCallable.java:12)
at org.junit.runners.model.FrameworkMethod.invokeExplosively(FrameworkMethod.java:47)
at org.junit.internal.runners.statements.InvokeMethod.evaluate(InvokeMethod.java:17)
at org.junit.internal.runners.statements.RunBefores.evaluate(RunBefores.java:26)
at org.junit.internal.runners.statements.RunAfters.evaluate(RunAfters.java:27)
at org.junit.runners.ParentRunner.runLeaf(ParentRunner.java:325)
at org.junit.runners.BlockJUnit4ClassRunner.runChild(BlockJUnit4ClassRunner.java:78)
at org.junit.runners.BlockJUnit4ClassRunner.runChild(BlockJUnit4ClassRunner.java:57)
at org.junit.runners.ParentRunner$3.run(ParentRunner.java:290)
at org.junit.runners.ParentRunner$1.schedule(ParentRunner.java:71)
at org.junit.runners.ParentRunner.runChildren(ParentRunner.java:288)
at org.junit.runners.ParentRunner.access$000(ParentRunner.java:58)
at org.junit.runners.ParentRunner$2.evaluate(ParentRunner.java:268)
at org.junit.internal.runners.statements.RunBefores.evaluate(RunBefores.java:26)
at org.junit.runners.ParentRunner.run(ParentRunner.java:363)
at org.apache.maven.surefire.junit4.JUnit4Provider.execute(JUnit4Provider.java:252)
at org.apache.maven.surefire.junit4.JUnit4Provider.executeTestSet(JUnit4Provider.java:141)
at org.apache.maven.surefire.junit4.JUnit4Provider.invoke(JUnit4Provider.java:112)
at sun.reflect.NativeMethodAccessorImpl.invoke0(Native Method)
at sun.reflect.NativeMethodAccessorImpl.invoke(NativeMethodAccessorImpl.java:57)
at sun.reflect.DelegatingMethodAccessorImpl.invoke(DelegatingMethodAccessorImpl.java:43)
at java.lang.reflect.Method.invoke(Method.java:606)
at org.apache.maven.surefire.util.ReflectionUtils.invokeMethodWithArray(ReflectionUtils.java:189)
at org.apache.maven.surefire.booter.ProviderFactory$ProviderProxy.invoke(ProviderFactory.java:165)
at org.apache.maven.surefire.booter.ProviderFactory.invokeProvider(ProviderFactory.java:85)
at org.apache.maven.surefire.booter.ForkedBooter.runSuitesInProcess(ForkedBooter.java:115)
at org.apache.maven.surefire.booter.ForkedBooter.main(ForkedBooter.java:75)
FAILED: org.apache.jackrabbit.oak.plugins.segment.standby.ExternalPrivateStoreIT.testProxyFlippedStartByte
Error Message:
proxy not started
Stack Trace:
java.lang.Exception: proxy not started
at org.apache.jackrabbit.oak.plugins.segment.NetworkErrorProxy.reset(NetworkErrorProxy.java:87)
at org.apache.jackrabbit.oak.plugins.segment.standby.DataStoreTestBase.useProxy(DataStoreTestBase.java:216)
at org.apache.jackrabbit.oak.plugins.segment.standby.DataStoreTestBase.testProxyFlippedStartByte(DataStoreTestBase.java:169)
at sun.reflect.NativeMethodAccessorImpl.invoke0(Native Method)
at sun.reflect.NativeMethodAccessorImpl.invoke(NativeMethodAccessorImpl.java:57)
at sun.reflect.DelegatingMethodAccessorImpl.invoke(DelegatingMethodAccessorImpl.java:43)
at java.lang.reflect.Method.invoke(Method.java:606)
at org.junit.runners.model.FrameworkMethod$1.runReflectiveCall(FrameworkMethod.java:50)
at org.junit.internal.runners.model.ReflectiveCallable.run(ReflectiveCallable.java:12)
at org.junit.runners.model.FrameworkMethod.invokeExplosively(FrameworkMethod.java:47)
at org.junit.internal.runners.statements.InvokeMethod.evaluate(InvokeMethod.java:17)
at org.junit.internal.runners.statements.RunBefores.evaluate(RunBefores.java:26)
at org.junit.internal.runners.statements.RunAfters.evaluate(RunAfters.java:27)
at org.junit.runners.ParentRunner.runLeaf(ParentRunner.java:325)
at org.junit.runners.BlockJUnit4ClassRunner.runChild(BlockJUnit4ClassRunner.java:78)
at org.junit.runners.BlockJUnit4ClassRunner.runChild(BlockJUnit4ClassRunner.java:57)
at org.junit.runners.ParentRunner$3.run(ParentRunner.java:290)
at org.junit.runners.ParentRunner$1.schedule(ParentRunner.java:71)
at org.junit.runners.ParentRunner.runChildren(ParentRunner.java:288)
at org.junit.runners.ParentRunner.access$000(ParentRunner.java:58)
at org.junit.runners.ParentRunner$2.evaluate(ParentRunner.java:268)
at org.junit.internal.runners.statements.RunBefores.evaluate(RunBefores.java:26)
at org.junit.runners.ParentRunner.run(ParentRunner.java:363)
at org.apache.maven.surefire.junit4.JUnit4Provider.execute(JUnit4Provider.java:252)
at org.apache.maven.surefire.junit4.JUnit4Provider.executeTestSet(JUnit4Provider.java:141)
at org.apache.maven.surefire.junit4.JUnit4Provider.invoke(JUnit4Provider.java:112)
at sun.reflect.NativeMethodAccessorImpl.invoke0(Native Method)
at sun.reflect.NativeMethodAccessorImpl.invoke(NativeMethodAccessorImpl.java:57)
at sun.reflect.DelegatingMethodAccessorImpl.invoke(DelegatingMethodAccessorImpl.java:43)
at java.lang.reflect.Method.invoke(Method.java:606)
at org.apache.maven.surefire.util.ReflectionUtils.invokeMethodWithArray(ReflectionUtils.java:189)
at org.apache.maven.surefire.booter.ProviderFactory$ProviderProxy.invoke(ProviderFactory.java:165)
at org.apache.maven.surefire.booter.ProviderFactory.invokeProvider(ProviderFactory.java:85)
at org.apache.maven.surefire.booter.ForkedBooter.runSuitesInProcess(ForkedBooter.java:115)
at org.apache.maven.surefire.booter.ForkedBooter.main(ForkedBooter.java:75)
FAILED: org.apache.jackrabbit.oak.segment.standby.ExternalPrivateStoreIT.testProxySkippedBytes
Error Message:
expected:<{ root = { ... } }> but was:<{ root : { } }>
Stack Trace:
java.lang.AssertionError: expected:<{ root = { ... } }> but was:<{ root : { } }>
FAILED: org.apache.jackrabbit.oak.segment.standby.ExternalPrivateStoreIT.testSyncUpdatedBinaryProperty
Error Message:
expected:<{ root = { ... } }> but was:<{ root : { } }>
Stack Trace:
java.lang.AssertionError: expected:<{ root = { ... } }> but was:<{ root : { } }>
FAILED: org.apache.jackrabbit.oak.segment.standby.ExternalPrivateStoreIT.testSync
Error Message:
expected:<{ root = { ... } }> but was:<{ root : { } }>
Stack Trace:
java.lang.AssertionError: expected:<{ root = { ... } }> but was:<{ root : { } }>
FAILED: org.apache.jackrabbit.oak.segment.standby.ExternalSharedStoreIT.testProxySkippedBytes
Error Message:
expected:<{ root = { ... } }> but was:<{ root : { } }>
Stack Trace:
java.lang.AssertionError: expected:<{ root = { ... } }> but was:<{ root : { } }>
FAILED: org.apache.jackrabbit.oak.segment.standby.ExternalSharedStoreIT.testSyncUpdatedBinaryProperty
Error Message:
expected:<{ root = { ... } }> but was:<{ root : { } }>
Stack Trace:
java.lang.AssertionError: expected:<{ root = { ... } }> but was:<{ root : { } }>
FAILED: org.apache.jackrabbit.oak.segment.standby.ExternalSharedStoreIT.testSync
Error Message:
expected:<{ root = { ... } }> but was:<{ root : { } }>
Stack Trace:
java.lang.AssertionError: expected:<{ root = { ... } }> but was:<{ root : { } }>
FAILED: org.apache.jackrabbit.oak.segment.standby.ExternalSharedStoreIT.testProxyFlippedIntermediateByteChange2
Error Message:
expected:<{ root = { ... } }> but was:<{ root : { } }>
Stack Trace:
java.lang.AssertionError: expected:<{ root = { ... } }> but was:<{ root : { } }>
FAILED: org.apache.jackrabbit.oak.segment.standby.ExternalSharedStoreIT.testProxyFlippedIntermediateByteChange
Error Message:
expected:<{ root = { ... } }> but was:<{ root : { } }>
Stack Trace:
java.lang.AssertionError: expected:<{ root = { ... } }> but was:<{ root : { } }>
FAILED: org.apache.jackrabbit.oak.segment.standby.ExternalSharedStoreIT.testProxySkippedBytesIntermediateChange
Error Message:
expected:<{ root = { ... } }> but was:<{ root : { } }>
Stack Trace:
java.lang.AssertionError: expected:<{ root = { ... } }> but was:<{ root : { } }>
FAILED: org.apache.jackrabbit.oak.segment.standby.ExternalSharedStoreIT.testProxyFlippedIntermediateByte
Error Message:
expected:<{ root = { ... } }> but was:<{ root : { } }>
Stack Trace:
java.lang.AssertionError: expected:<{ root = { ... } }> but was:<{ root : { } }>
FAILED: org.apache.jackrabbit.oak.segment.standby.ExternalSharedStoreIT.testProxyFlippedIntermediateByte2
Error Message:
expected:<{ root = { ... } }> but was:<{ root : { } }>
Stack Trace:
java.lang.AssertionError: expected:<{ root = { ... } }> but was:<{ root : { } }>
FAILED: org.apache.jackrabbit.oak.segment.standby.ExternalSharedStoreIT.testProxyFlippedStartByte
Error Message:
expected:<{ root = { ... } }> but was:<{ root : { } }>
Stack Trace:
java.lang.AssertionError: expected:<{ root = { ... } }> but was:<{ root : { } }>
FAILED: org.apache.jackrabbit.oak.segment.standby.FailoverSslTestIT.testFailoverSecure
Error Message:
null
Stack Trace:
java.lang.AssertionError
at org.apache.jackrabbit.oak.segment.standby.FailoverSslTestIT.testFailoverSecure(FailoverSslTestIT.java:60)
FAILED: org.apache.jackrabbit.oak.segment.standby.RecoverTestIT.testLocalChanges
Error Message:
expected: org.apache.jackrabbit.oak.segment.SegmentNodeState<{ root = { ... } }> but was: org.apache.jackrabbit.oak.segment.SegmentNodeState<{ root = { ... } }>
Stack Trace:
java.lang.AssertionError: expected: org.apache.jackrabbit.oak.segment.SegmentNodeState<{ root = { ... } }> but was: org.apache.jackrabbit.oak.segment.SegmentNodeState<{ root = { ... } }>
at org.apache.jackrabbit.oak.segment.standby.RecoverTestIT.testLocalChanges(RecoverTestIT.java:71)
FAILED: org.apache.jackrabbit.oak.jcr.observation.ObservationTest.applyNodeTypeOnSelf[SegmentTar]
Error Message:
Unexpected events: [Event{type=2, path=/test_node/a/b, identifier=/test_node/a/b, info={jcr:primaryType=oak:Unstructured}, userID=admin, userData=null, date=1478163253518, external=false}]
Stack Trace:
java.lang.AssertionError: Unexpected events: [Event{type=2, path=/test_node/a/b, identifier=/test_node/a/b, info={jcr:primaryType=oak:Unstructured}, userID=admin, userData=null, date=1478163253518, external=false}]
at org.junit.Assert.fail(Assert.java:88)
at org.junit.Assert.assertTrue(Assert.java:41)
at org.apache.jackrabbit.oak.jcr.observation.ObservationTest.applyNodeTypeOnSelf(ObservationTest.java:1299)
at sun.reflect.NativeMethodAccessorImpl.invoke0(Native Method)
at sun.reflect.NativeMethodAccessorImpl.invoke(NativeMethodAccessorImpl.java:62)
at sun.reflect.DelegatingMethodAccessorImpl.invoke(DelegatingMethodAccessorImpl.java:43)
at java.lang.reflect.Method.invoke(Method.java:498)
at org.junit.runners.model.FrameworkMethod$1.runReflectiveCall(FrameworkMethod.java:50)
at org.junit.internal.runners.model.ReflectiveCallable.run(ReflectiveCallable.java:12)
at org.junit.runners.model.FrameworkMethod.invokeExplosively(FrameworkMethod.java:47)
at org.junit.internal.runners.statements.InvokeMethod.evaluate(InvokeMethod.java:17)
at org.junit.internal.runners.statements.RunBefores.evaluate(RunBefores.java:26)
at org.junit.internal.runners.statements.RunAfters.evaluate(RunAfters.java:27)
at org.junit.runners.ParentRunner.runLeaf(ParentRunner.java:325)
at org.junit.runners.BlockJUnit4ClassRunner.runChild(BlockJUnit4ClassRunner.java:78)
at org.junit.runners.BlockJUnit4ClassRunner.runChild(BlockJUnit4ClassRunner.java:57)
at org.junit.runners.ParentRunner$3.run(ParentRunner.java:290)
at org.junit.runners.ParentRunner$1.schedule(ParentRunner.java:71)
at org.junit.runners.ParentRunner.runChildren(ParentRunner.java:288)
at org.junit.runners.ParentRunner.access$000(ParentRunner.java:58)
at org.junit.runners.ParentRunner$2.evaluate(ParentRunner.java:268)
at org.junit.runners.ParentRunner.run(ParentRunner.java:363)
at org.junit.runners.Suite.runChild(Suite.java:128)
at org.junit.runners.Suite.runChild(Suite.java:27)
at org.junit.runners.ParentRunner$3.run(ParentRunner.java:290)
at org.junit.runners.ParentRunner$1.schedule(ParentRunner.java:71)
at org.junit.runners.ParentRunner.runChildren(ParentRunner.java:288)
at org.junit.runners.ParentRunner.access$000(ParentRunner.java:58)
at org.junit.runners.ParentRunner$2.evaluate(ParentRunner.java:268)
at org.junit.runners.ParentRunner.run(ParentRunner.java:363)
at org.apache.maven.surefire.junit4.JUnit4Provider.execute(JUnit4Provider.java:252)
at org.apache.maven.surefire.junit4.JUnit4Provider.executeTestSet(JUnit4Provider.java:141)
at org.apache.maven.surefire.junit4.JUnit4Provider.invoke(JUnit4Provider.java:112)
at sun.reflect.NativeMethodAccessorImpl.invoke0(Native Method)
at sun.reflect.NativeMethodAccessorImpl.invoke(NativeMethodAccessorImpl.java:62)
at sun.reflect.DelegatingMethodAccessorImpl.invoke(DelegatingMethodAccessorImpl.java:43)
at java.lang.reflect.Method.invoke(Method.java:498)
at org.apache.maven.surefire.util.ReflectionUtils.invokeMethodWithArray(ReflectionUtils.java:189)
at org.apache.maven.surefire.booter.ProviderFactory$ProviderProxy.invoke(ProviderFactory.java:165)
at org.apache.maven.surefire.booter.ProviderFactory.invokeProvider(ProviderFactory.java:85)
at org.apache.maven.surefire.booter.ForkedBooter.runSuitesInProcess(ForkedBooter.java:115)
at org.apache.maven.surefire.booter.ForkedBooter.main(ForkedBooter.java:75)
FAILED: org.apache.jackrabbit.oak.jcr.query.QueryTest.nodeType[SegmentTar]
Error Message:
Unexpected plan: [oak:Unstructured] as [a] /* traverse "//*" where ([a].[xyz/jcr:primaryType] is not null) and (isdescendantnode([a], [/])) */
Stack Trace:
java.lang.AssertionError: Unexpected plan: [oak:Unstructured] as [a] /* traverse "//*" where ([a].[xyz/jcr:primaryType] is not null) and (isdescendantnode([a], [/])) */
at org.junit.Assert.fail(Assert.java:88)
at org.junit.Assert.assertTrue(Assert.java:41)
at org.apache.jackrabbit.oak.jcr.query.QueryTest.assertPlan(QueryTest.java:852)
at org.apache.jackrabbit.oak.jcr.query.QueryTest.nodeType(QueryTest.java:846)
at sun.reflect.NativeMethodAccessorImpl.invoke0(Native Method)
at sun.reflect.NativeMethodAccessorImpl.invoke(NativeMethodAccessorImpl.java:62)
at sun.reflect.DelegatingMethodAccessorImpl.invoke(DelegatingMethodAccessorImpl.java:43)
at java.lang.reflect.Method.invoke(Method.java:498)
at org.junit.runners.model.FrameworkMethod$1.runReflectiveCall(FrameworkMethod.java:50)
at org.junit.internal.runners.model.ReflectiveCallable.run(ReflectiveCallable.java:12)
at org.junit.runners.model.FrameworkMethod.invokeExplosively(FrameworkMethod.java:47)
at org.junit.internal.runners.statements.InvokeMethod.evaluate(InvokeMethod.java:17)
at org.junit.internal.runners.statements.RunAfters.evaluate(RunAfters.java:27)
at org.junit.runners.ParentRunner.runLeaf(ParentRunner.java:325)
at org.junit.runners.BlockJUnit4ClassRunner.runChild(BlockJUnit4ClassRunner.java:78)
at org.junit.runners.BlockJUnit4ClassRunner.runChild(BlockJUnit4ClassRunner.java:57)
at org.junit.runners.ParentRunner$3.run(ParentRunner.java:290)
at org.junit.runners.ParentRunner$1.schedule(ParentRunner.java:71)
at org.junit.runners.ParentRunner.runChildren(ParentRunner.java:288)
at org.junit.runners.ParentRunner.access$000(ParentRunner.java:58)
at org.junit.runners.ParentRunner$2.evaluate(ParentRunner.java:268)
at org.junit.runners.ParentRunner.run(ParentRunner.java:363)
at org.junit.runners.Suite.runChild(Suite.java:128)
at org.junit.runners.Suite.runChild(Suite.java:27)
at org.junit.runners.ParentRunner$3.run(ParentRunner.java:290)
at java.util.concurrent.Executors$RunnableAdapter.call(Executors.java:511)
at java.util.concurrent.FutureTask.run(FutureTask.java:266)
at java.util.concurrent.ThreadPoolExecutor.runWorker(ThreadPoolExecutor.java:1142)
at java.util.concurrent.ThreadPoolExecutor$Worker.run(ThreadPoolExecutor.java:617)
at java.lang.Thread.run(Thread.java:745)
FAILED: org.apache.jackrabbit.oak.segment.standby.StandbyTestIT.testSyncLoop
Error Message:
expected: org.apache.jackrabbit.oak.segment.SegmentNodeState<{ checkpoints = { ... }, root = { ... } }> but was: org.apache.jackrabbit.oak.segment.SegmentNodeState<{ checkpoints = { ... }, root = { ... } }>
Stack Trace:
java.lang.AssertionError: expected: org.apache.jackrabbit.oak.segment.SegmentNodeState<{ checkpoints = { ... }, root = { ... } }> but was: org.apache.jackrabbit.oak.segment.SegmentNodeState<{ checkpoints = { ... }, root = { ... } }>
at org.apache.jackrabbit.oak.segment.standby.StandbyTestIT.testSyncLoop(StandbyTestIT.java:122)
FAILED: org.apache.jackrabbit.oak.segment.standby.StandbyTestIT.testSyncLoop
Error Message:
expected: org.apache.jackrabbit.oak.segment.SegmentNodeState<{ checkpoints = { ... }, root = { ... } }> but was: org.apache.jackrabbit.oak.segment.SegmentNodeState<{ checkpoints = { ... }, root = { ... } }>
Stack Trace:
java.lang.AssertionError: expected: org.apache.jackrabbit.oak.segment.SegmentNodeState<{ checkpoints = { ... }, root = { ... } }> but was: org.apache.jackrabbit.oak.segment.SegmentNodeState<{ checkpoints = { ... }, root = { ... } }>
at org.apache.jackrabbit.oak.segment.standby.StandbyTestIT.testSyncLoop(StandbyTestIT.java:122)
[Oak origin/trunk] Apache Jackrabbit Oak matrix - Build # 1264 -
Still Failing
Posted by Apache Jenkins Server <je...@builds.apache.org>.
The Apache Jenkins build system has built Apache Jackrabbit Oak matrix (build #1264)
Status: Still Failing
Check console output at https://builds.apache.org/job/Apache%20Jackrabbit%20Oak%20matrix/1264/ to view the results.
Changes:
[mreutegg] OAK-5059: DocumentCachingDataStoreStatsTest sometimes stuck
[stefanegli] OAK-5061 : added an expected event which erroneously got left out
[mduerig] OAK-5055: o.a.j.o.s.s.RevisionGC returns status that don't comply with
Test results:
2 tests failed.
FAILED: org.apache.jackrabbit.oak.segment.standby.StandbyTestIT.testSyncLoop
Error Message:
expected: org.apache.jackrabbit.oak.segment.SegmentNodeState<{ checkpoints = { ... }, root = { ... } }> but was: org.apache.jackrabbit.oak.segment.SegmentNodeState<{ checkpoints = { ... }, root = { ... } }>
Stack Trace:
java.lang.AssertionError: expected: org.apache.jackrabbit.oak.segment.SegmentNodeState<{ checkpoints = { ... }, root = { ... } }> but was: org.apache.jackrabbit.oak.segment.SegmentNodeState<{ checkpoints = { ... }, root = { ... } }>
at org.apache.jackrabbit.oak.segment.standby.StandbyTestIT.testSyncLoop(StandbyTestIT.java:122)
FAILED: org.apache.jackrabbit.oak.plugins.segment.standby.BrokenNetworkTest.testProxySSLSkippedBytes
Error Message:
expected:<{ root = { ... } }> but was:<{ root : { } }>
Stack Trace:
java.lang.AssertionError: expected:<{ root = { ... } }> but was:<{ root : { } }>
at org.junit.Assert.fail(Assert.java:88)
at org.junit.Assert.failNotEquals(Assert.java:834)
at org.junit.Assert.assertEquals(Assert.java:118)
at org.junit.Assert.assertEquals(Assert.java:144)
at org.apache.jackrabbit.oak.plugins.segment.standby.BrokenNetworkTest.useProxy(BrokenNetworkTest.java:143)
at org.apache.jackrabbit.oak.plugins.segment.standby.BrokenNetworkTest.useProxy(BrokenNetworkTest.java:113)
at org.apache.jackrabbit.oak.plugins.segment.standby.BrokenNetworkTest.testProxySSLSkippedBytes(BrokenNetworkTest.java:63)
at sun.reflect.NativeMethodAccessorImpl.invoke0(Native Method)
at sun.reflect.NativeMethodAccessorImpl.invoke(NativeMethodAccessorImpl.java:62)
at sun.reflect.DelegatingMethodAccessorImpl.invoke(DelegatingMethodAccessorImpl.java:43)
at java.lang.reflect.Method.invoke(Method.java:498)
at org.junit.runners.model.FrameworkMethod$1.runReflectiveCall(FrameworkMethod.java:50)
at org.junit.internal.runners.model.ReflectiveCallable.run(ReflectiveCallable.java:12)
at org.junit.runners.model.FrameworkMethod.invokeExplosively(FrameworkMethod.java:47)
at org.junit.internal.runners.statements.InvokeMethod.evaluate(InvokeMethod.java:17)
at org.junit.internal.runners.statements.RunBefores.evaluate(RunBefores.java:26)
at org.junit.internal.runners.statements.RunAfters.evaluate(RunAfters.java:27)
at org.junit.runners.ParentRunner.runLeaf(ParentRunner.java:325)
at org.junit.runners.BlockJUnit4ClassRunner.runChild(BlockJUnit4ClassRunner.java:78)
at org.junit.runners.BlockJUnit4ClassRunner.runChild(BlockJUnit4ClassRunner.java:57)
at org.junit.runners.ParentRunner$3.run(ParentRunner.java:290)
at org.junit.runners.ParentRunner$1.schedule(ParentRunner.java:71)
at org.junit.runners.ParentRunner.runChildren(ParentRunner.java:288)
at org.junit.runners.ParentRunner.access$000(ParentRunner.java:58)
at org.junit.runners.ParentRunner$2.evaluate(ParentRunner.java:268)
at org.junit.internal.runners.statements.RunBefores.evaluate(RunBefores.java:26)
at org.junit.runners.ParentRunner.run(ParentRunner.java:363)
at org.apache.maven.surefire.junit4.JUnit4Provider.execute(JUnit4Provider.java:252)
at org.apache.maven.surefire.junit4.JUnit4Provider.executeTestSet(JUnit4Provider.java:141)
at org.apache.maven.surefire.junit4.JUnit4Provider.invoke(JUnit4Provider.java:112)
at sun.reflect.NativeMethodAccessorImpl.invoke0(Native Method)
at sun.reflect.NativeMethodAccessorImpl.invoke(NativeMethodAccessorImpl.java:62)
at sun.reflect.DelegatingMethodAccessorImpl.invoke(DelegatingMethodAccessorImpl.java:43)
at java.lang.reflect.Method.invoke(Method.java:498)
at org.apache.maven.surefire.util.ReflectionUtils.invokeMethodWithArray(ReflectionUtils.java:189)
at org.apache.maven.surefire.booter.ProviderFactory$ProviderProxy.invoke(ProviderFactory.java:165)
at org.apache.maven.surefire.booter.ProviderFactory.invokeProvider(ProviderFactory.java:85)
at org.apache.maven.surefire.booter.ForkedBooter.runSuitesInProcess(ForkedBooter.java:115)
at org.apache.maven.surefire.booter.ForkedBooter.main(ForkedBooter.java:75)
[Oak origin/trunk] Apache Jackrabbit Oak matrix - Build # 1263 -
Still Failing
Posted by Apache Jenkins Server <je...@builds.apache.org>.
The Apache Jenkins build system has built Apache Jackrabbit Oak matrix (build #1263)
Status: Still Failing
Check console output at https://builds.apache.org/job/Apache%20Jackrabbit%20Oak%20matrix/1263/ to view the results.
Changes:
[chetanm] OAK-5045 - Support bundling of nodes present in version store
[thomasm] OAK-5057 BulkCreateOrUpdateClusterTest fails sometimes
[mreutegg] OAK-5059: DocumentCachingDataStoreStatsTest sometimes stuck
Test results:
3 tests failed.
FAILED: org.apache.jackrabbit.oak.segment.standby.StandbyTestIT.testSyncLoop
Error Message:
expected:<{ checkpoints = { ... }, root = { ... } }> but was:<{ root : { } }>
Stack Trace:
java.lang.AssertionError: expected:<{ checkpoints = { ... }, root = { ... } }> but was:<{ root : { } }>
at org.apache.jackrabbit.oak.segment.standby.StandbyTestIT.testSyncLoop(StandbyTestIT.java:122)
FAILED: org.apache.jackrabbit.oak.segment.standby.StandbyTestIT.testSyncLoop
Error Message:
expected:<{ checkpoints = { ... }, root = { ... } }> but was:<{ root : { } }>
Stack Trace:
java.lang.AssertionError: expected:<{ checkpoints = { ... }, root = { ... } }> but was:<{ root : { } }>
at org.apache.jackrabbit.oak.segment.standby.StandbyTestIT.testSyncLoop(StandbyTestIT.java:122)
FAILED: org.apache.jackrabbit.oak.jcr.observation.ObservationTest.applyNodeTypeOnSelf[DocumentNodeStore[RDB] on jdbc:h2:file:./target/oaktest]
Error Message:
Unexpected events: [Event{type=2, path=/test_node/a/b, identifier=/test_node/a/b, info={jcr:primaryType=oak:Unstructured}, userID=admin, userData=null, date=1478189437074, external=false}]
Stack Trace:
java.lang.AssertionError: Unexpected events: [Event{type=2, path=/test_node/a/b, identifier=/test_node/a/b, info={jcr:primaryType=oak:Unstructured}, userID=admin, userData=null, date=1478189437074, external=false}]
at org.junit.Assert.fail(Assert.java:88)
at org.junit.Assert.assertTrue(Assert.java:41)
at org.apache.jackrabbit.oak.jcr.observation.ObservationTest.applyNodeTypeOnSelf(ObservationTest.java:1299)
at sun.reflect.NativeMethodAccessorImpl.invoke0(Native Method)
at sun.reflect.NativeMethodAccessorImpl.invoke(NativeMethodAccessorImpl.java:62)
at sun.reflect.DelegatingMethodAccessorImpl.invoke(DelegatingMethodAccessorImpl.java:43)
at java.lang.reflect.Method.invoke(Method.java:498)
at org.junit.runners.model.FrameworkMethod$1.runReflectiveCall(FrameworkMethod.java:50)
at org.junit.internal.runners.model.ReflectiveCallable.run(ReflectiveCallable.java:12)
at org.junit.runners.model.FrameworkMethod.invokeExplosively(FrameworkMethod.java:47)
at org.junit.internal.runners.statements.InvokeMethod.evaluate(InvokeMethod.java:17)
at org.junit.internal.runners.statements.RunBefores.evaluate(RunBefores.java:26)
at org.junit.internal.runners.statements.RunAfters.evaluate(RunAfters.java:27)
at org.junit.runners.ParentRunner.runLeaf(ParentRunner.java:325)
at org.junit.runners.BlockJUnit4ClassRunner.runChild(BlockJUnit4ClassRunner.java:78)
at org.junit.runners.BlockJUnit4ClassRunner.runChild(BlockJUnit4ClassRunner.java:57)
at org.junit.runners.ParentRunner$3.run(ParentRunner.java:290)
at org.junit.runners.ParentRunner$1.schedule(ParentRunner.java:71)
at org.junit.runners.ParentRunner.runChildren(ParentRunner.java:288)
at org.junit.runners.ParentRunner.access$000(ParentRunner.java:58)
at org.junit.runners.ParentRunner$2.evaluate(ParentRunner.java:268)
at org.junit.runners.ParentRunner.run(ParentRunner.java:363)
at org.junit.runners.Suite.runChild(Suite.java:128)
at org.junit.runners.Suite.runChild(Suite.java:27)
at org.junit.runners.ParentRunner$3.run(ParentRunner.java:290)
at org.junit.runners.ParentRunner$1.schedule(ParentRunner.java:71)
at org.junit.runners.ParentRunner.runChildren(ParentRunner.java:288)
at org.junit.runners.ParentRunner.access$000(ParentRunner.java:58)
at org.junit.runners.ParentRunner$2.evaluate(ParentRunner.java:268)
at org.junit.runners.ParentRunner.run(ParentRunner.java:363)
at org.apache.maven.surefire.junit4.JUnit4Provider.execute(JUnit4Provider.java:252)
at org.apache.maven.surefire.junit4.JUnit4Provider.executeTestSet(JUnit4Provider.java:141)
at org.apache.maven.surefire.junit4.JUnit4Provider.invoke(JUnit4Provider.java:112)
at sun.reflect.NativeMethodAccessorImpl.invoke0(Native Method)
at sun.reflect.NativeMethodAccessorImpl.invoke(NativeMethodAccessorImpl.java:62)
at sun.reflect.DelegatingMethodAccessorImpl.invoke(DelegatingMethodAccessorImpl.java:43)
at java.lang.reflect.Method.invoke(Method.java:498)
at org.apache.maven.surefire.util.ReflectionUtils.invokeMethodWithArray(ReflectionUtils.java:189)
at org.apache.maven.surefire.booter.ProviderFactory$ProviderProxy.invoke(ProviderFactory.java:165)
at org.apache.maven.surefire.booter.ProviderFactory.invokeProvider(ProviderFactory.java:85)
at org.apache.maven.surefire.booter.ForkedBooter.runSuitesInProcess(ForkedBooter.java:115)
at org.apache.maven.surefire.booter.ForkedBooter.main(ForkedBooter.java:75)
[Oak origin/trunk] Apache Jackrabbit Oak matrix - Build # 1262 -
Still Failing
Posted by Apache Jenkins Server <je...@builds.apache.org>.
The Apache Jenkins build system has built Apache Jackrabbit Oak matrix (build #1262)
Status: Still Failing
Check console output at https://builds.apache.org/job/Apache%20Jackrabbit%20Oak%20matrix/1262/ to view the results.
Changes:
[chetanm] OAK-5053 - Provide support for enabling fastResultSize via OSGi config
[mduerig] @trivial: remove dangling FIXME
Test results:
3 tests failed.
FAILED: org.apache.jackrabbit.oak.run.osgi.DocumentNodeStoreConfigTest.testRDBDocumentStore_CustomBlobDataSource
Error Message:
No service found for org.apache.jackrabbit.oak.spi.state.NodeStore. Expression: sr. Values: sr = null
Stack Trace:
java.lang.AssertionError: No service found for org.apache.jackrabbit.oak.spi.state.NodeStore. Expression: sr. Values: sr = null
at org.codehaus.groovy.runtime.InvokerHelper.assertFailed(InvokerHelper.java:400)
at org.codehaus.groovy.runtime.ScriptBytecodeAdapter.assertFailed(ScriptBytecodeAdapter.java:646)
at org.apache.jackrabbit.oak.run.osgi.AbstractRepositoryFactoryTest.getServiceWithWait(AbstractRepositoryFactoryTest.groovy:100)
at sun.reflect.NativeMethodAccessorImpl.invoke0(Native Method)
at sun.reflect.NativeMethodAccessorImpl.invoke(NativeMethodAccessorImpl.java:57)
at sun.reflect.DelegatingMethodAccessorImpl.invoke(DelegatingMethodAccessorImpl.java:43)
at java.lang.reflect.Method.invoke(Method.java:606)
at org.codehaus.groovy.reflection.CachedMethod.invoke(CachedMethod.java:90)
at org.codehaus.groovy.runtime.callsite.StaticMetaMethodSite$StaticMetaMethodSiteNoUnwrapNoCoerce.invoke(StaticMetaMethodSite.java:148)
at org.codehaus.groovy.runtime.callsite.StaticMetaMethodSite.callStatic(StaticMetaMethodSite.java:99)
at org.codehaus.groovy.runtime.callsite.AbstractCallSite.callStatic(AbstractCallSite.java:169)
at org.apache.jackrabbit.oak.run.osgi.AbstractRepositoryFactoryTest.getServiceWithWait(AbstractRepositoryFactoryTest.groovy:93)
at sun.reflect.NativeMethodAccessorImpl.invoke0(Native Method)
at sun.reflect.NativeMethodAccessorImpl.invoke(NativeMethodAccessorImpl.java:57)
at sun.reflect.DelegatingMethodAccessorImpl.invoke(DelegatingMethodAccessorImpl.java:43)
at java.lang.reflect.Method.invoke(Method.java:606)
at org.codehaus.groovy.runtime.callsite.PogoMetaMethodSite$PogoCachedMethodSiteNoUnwrapNoCoerce.invoke(PogoMetaMethodSite.java:207)
at org.codehaus.groovy.runtime.callsite.PogoMetaMethodSite.callCurrent(PogoMetaMethodSite.java:56)
at org.codehaus.groovy.runtime.callsite.CallSiteArray.defaultCallCurrent(CallSiteArray.java:49)
at org.codehaus.groovy.runtime.callsite.AbstractCallSite.callCurrent(AbstractCallSite.java:133)
at org.codehaus.groovy.runtime.callsite.AbstractCallSite.callCurrent(AbstractCallSite.java:141)
at org.apache.jackrabbit.oak.run.osgi.DocumentNodeStoreConfigTest.testRDBDocumentStore_CustomBlobDataSource(DocumentNodeStoreConfigTest.groovy:152)
at sun.reflect.NativeMethodAccessorImpl.invoke0(Native Method)
at sun.reflect.NativeMethodAccessorImpl.invoke(NativeMethodAccessorImpl.java:57)
at sun.reflect.DelegatingMethodAccessorImpl.invoke(DelegatingMethodAccessorImpl.java:43)
at java.lang.reflect.Method.invoke(Method.java:606)
at org.junit.runners.model.FrameworkMethod$1.runReflectiveCall(FrameworkMethod.java:50)
at org.junit.internal.runners.model.ReflectiveCallable.run(ReflectiveCallable.java:12)
at org.junit.runners.model.FrameworkMethod.invokeExplosively(FrameworkMethod.java:47)
at org.junit.internal.runners.statements.InvokeMethod.evaluate(InvokeMethod.java:17)
at org.junit.internal.runners.statements.RunBefores.evaluate(RunBefores.java:26)
at org.junit.internal.runners.statements.RunAfters.evaluate(RunAfters.java:27)
at org.junit.rules.ExternalResource$1.evaluate(ExternalResource.java:48)
at org.junit.rules.RunRules.evaluate(RunRules.java:20)
at org.junit.runners.ParentRunner.runLeaf(ParentRunner.java:325)
at org.junit.runners.BlockJUnit4ClassRunner.runChild(BlockJUnit4ClassRunner.java:78)
at org.junit.runners.BlockJUnit4ClassRunner.runChild(BlockJUnit4ClassRunner.java:57)
at org.junit.runners.ParentRunner$3.run(ParentRunner.java:290)
at org.junit.runners.ParentRunner$1.schedule(ParentRunner.java:71)
at org.junit.runners.ParentRunner.runChildren(ParentRunner.java:288)
at org.junit.runners.ParentRunner.access$000(ParentRunner.java:58)
at org.junit.runners.ParentRunner$2.evaluate(ParentRunner.java:268)
at org.junit.runners.ParentRunner.run(ParentRunner.java:363)
at org.apache.maven.surefire.junit4.JUnit4Provider.execute(JUnit4Provider.java:252)
at org.apache.maven.surefire.junit4.JUnit4Provider.executeTestSet(JUnit4Provider.java:141)
at org.apache.maven.surefire.junit4.JUnit4Provider.invoke(JUnit4Provider.java:112)
at sun.reflect.NativeMethodAccessorImpl.invoke0(Native Method)
at sun.reflect.NativeMethodAccessorImpl.invoke(NativeMethodAccessorImpl.java:57)
at sun.reflect.DelegatingMethodAccessorImpl.invoke(DelegatingMethodAccessorImpl.java:43)
at java.lang.reflect.Method.invoke(Method.java:606)
at org.apache.maven.surefire.util.ReflectionUtils.invokeMethodWithArray(ReflectionUtils.java:189)
at org.apache.maven.surefire.booter.ProviderFactory$ProviderProxy.invoke(ProviderFactory.java:165)
at org.apache.maven.surefire.booter.ProviderFactory.invokeProvider(ProviderFactory.java:85)
at org.apache.maven.surefire.booter.ForkedBooter.runSuitesInProcess(ForkedBooter.java:115)
at org.apache.maven.surefire.booter.ForkedBooter.main(ForkedBooter.java:75)
FAILED: org.apache.jackrabbit.oak.plugins.blob.FileCacheTest.getInvalidateConcurrent
Error Message:
null
Stack Trace:
java.lang.AssertionError
at org.junit.Assert.fail(Assert.java:86)
at org.junit.Assert.assertTrue(Assert.java:41)
at org.junit.Assert.assertNotNull(Assert.java:712)
at org.junit.Assert.assertNotNull(Assert.java:722)
at org.apache.jackrabbit.oak.plugins.blob.FileCacheTest.assertCacheIfPresent(FileCacheTest.java:446)
at org.apache.jackrabbit.oak.plugins.blob.FileCacheTest.getInvalidateConcurrent(FileCacheTest.java:345)
at sun.reflect.NativeMethodAccessorImpl.invoke0(Native Method)
at sun.reflect.NativeMethodAccessorImpl.invoke(NativeMethodAccessorImpl.java:62)
at sun.reflect.DelegatingMethodAccessorImpl.invoke(DelegatingMethodAccessorImpl.java:43)
at java.lang.reflect.Method.invoke(Method.java:498)
at org.junit.runners.model.FrameworkMethod$1.runReflectiveCall(FrameworkMethod.java:50)
at org.junit.internal.runners.model.ReflectiveCallable.run(ReflectiveCallable.java:12)
at org.junit.runners.model.FrameworkMethod.invokeExplosively(FrameworkMethod.java:47)
at org.junit.internal.runners.statements.InvokeMethod.evaluate(InvokeMethod.java:17)
at org.junit.internal.runners.statements.RunBefores.evaluate(RunBefores.java:26)
at org.junit.internal.runners.statements.RunAfters.evaluate(RunAfters.java:27)
at org.junit.rules.ExternalResource$1.evaluate(ExternalResource.java:48)
at org.junit.rules.TestWatcher$1.evaluate(TestWatcher.java:55)
at org.junit.rules.RunRules.evaluate(RunRules.java:20)
at org.junit.runners.ParentRunner.runLeaf(ParentRunner.java:325)
at org.junit.runners.BlockJUnit4ClassRunner.runChild(BlockJUnit4ClassRunner.java:78)
at org.junit.runners.BlockJUnit4ClassRunner.runChild(BlockJUnit4ClassRunner.java:57)
at org.junit.runners.ParentRunner$3.run(ParentRunner.java:290)
at org.junit.runners.ParentRunner$1.schedule(ParentRunner.java:71)
at org.junit.runners.ParentRunner.runChildren(ParentRunner.java:288)
at org.junit.runners.ParentRunner.access$000(ParentRunner.java:58)
at org.junit.runners.ParentRunner$2.evaluate(ParentRunner.java:268)
at org.junit.runners.ParentRunner.run(ParentRunner.java:363)
at org.apache.maven.surefire.junit4.JUnit4Provider.execute(JUnit4Provider.java:252)
at org.apache.maven.surefire.junit4.JUnit4Provider.executeTestSet(JUnit4Provider.java:141)
at org.apache.maven.surefire.junit4.JUnit4Provider.invoke(JUnit4Provider.java:112)
at sun.reflect.NativeMethodAccessorImpl.invoke0(Native Method)
at sun.reflect.NativeMethodAccessorImpl.invoke(NativeMethodAccessorImpl.java:62)
at sun.reflect.DelegatingMethodAccessorImpl.invoke(DelegatingMethodAccessorImpl.java:43)
at java.lang.reflect.Method.invoke(Method.java:498)
at org.apache.maven.surefire.util.ReflectionUtils.invokeMethodWithArray(ReflectionUtils.java:189)
at org.apache.maven.surefire.booter.ProviderFactory$ProviderProxy.invoke(ProviderFactory.java:165)
at org.apache.maven.surefire.booter.ProviderFactory.invokeProvider(ProviderFactory.java:85)
at org.apache.maven.surefire.booter.ForkedBooter.runSuitesInProcess(ForkedBooter.java:115)
at org.apache.maven.surefire.booter.ForkedBooter.main(ForkedBooter.java:75)
FAILED: org.apache.jackrabbit.oak.segment.CompactionAndCleanupIT.compactionNoBinaryClone
Error Message:
the store should grow
Stack Trace:
java.lang.AssertionError: the store should grow
at org.apache.jackrabbit.oak.segment.CompactionAndCleanupIT.compactionNoBinaryClone(CompactionAndCleanupIT.java:142)
[Oak origin/trunk] Apache Jackrabbit Oak matrix - Build # 1261 -
Still Failing
Posted by Apache Jenkins Server <je...@builds.apache.org>.
The Apache Jenkins build system has built Apache Jackrabbit Oak matrix (build #1261)
Status: Still Failing
Check console output at https://builds.apache.org/job/Apache%20Jackrabbit%20Oak%20matrix/1261/ to view the results.
Changes:
[chetanm] OAK-5043: Very old JR2 repositories may have invalid nodetypes for
[chetanm] OAK-4981 - Config option to disable specific bundling config
[frm] OAK-5044 - Don't asynchronously flush the store if it's being shut down
Test results:
12 tests failed.
FAILED: TEST-org.apache.jackrabbit.oak.plugins.segment.CompactionAndCleanupIT.xml.[empty]
Error Message:
Stack Trace:
Test report file /home/jenkins/jenkins-slave/workspace/Apache Jackrabbit Oak matrix/jdk/JDK 1.7 (latest)/label/Ubuntu/nsfixtures/SEGMENT_MK/profile/integrationTesting/oak-segment/target/failsafe-reports/TEST-org.apache.jackrabbit.oak.plugins.segment.CompactionAndCleanupIT.xml was length 0
FAILED: TEST-org.apache.jackrabbit.oak.plugins.segment.ExternalBlobIT.xml.[empty]
Error Message:
Stack Trace:
Test report file /home/jenkins/jenkins-slave/workspace/Apache Jackrabbit Oak matrix/jdk/JDK 1.7 (latest)/label/Ubuntu/nsfixtures/SEGMENT_MK/profile/integrationTesting/oak-segment/target/failsafe-reports/TEST-org.apache.jackrabbit.oak.plugins.segment.ExternalBlobIT.xml was length 0
FAILED: TEST-org.apache.jackrabbit.oak.plugins.segment.HeavyWriteIT.xml.[empty]
Error Message:
Stack Trace:
Test report file /home/jenkins/jenkins-slave/workspace/Apache Jackrabbit Oak matrix/jdk/JDK 1.7 (latest)/label/Ubuntu/nsfixtures/SEGMENT_MK/profile/integrationTesting/oak-segment/target/failsafe-reports/TEST-org.apache.jackrabbit.oak.plugins.segment.HeavyWriteIT.xml was length 0
FAILED: TEST-org.apache.jackrabbit.oak.plugins.segment.SegmentCompactionIT.xml.[empty]
Error Message:
Stack Trace:
Test report file /home/jenkins/jenkins-slave/workspace/Apache Jackrabbit Oak matrix/jdk/JDK 1.7 (latest)/label/Ubuntu/nsfixtures/SEGMENT_MK/profile/integrationTesting/oak-segment/target/failsafe-reports/TEST-org.apache.jackrabbit.oak.plugins.segment.SegmentCompactionIT.xml was length 0
FAILED: org.apache.jackrabbit.oak.segment.standby.StandbyTestIT.testSyncLoop
Error Message:
expected:<{ checkpoints = { ... }, root = { ... } }> but was:<{ root : { } }>
Stack Trace:
java.lang.AssertionError: expected:<{ checkpoints = { ... }, root = { ... } }> but was:<{ root : { } }>
at org.apache.jackrabbit.oak.segment.standby.StandbyTestIT.testSyncLoop(StandbyTestIT.java:122)
FAILED: org.apache.jackrabbit.oak.jcr.query.QueryTest.nodeType[SegmentNodeStore]
Error Message:
Unexpected plan: [oak:Unstructured] as [a] /* traverse "//*" where ([a].[xyz/jcr:primaryType] is not null) and (isdescendantnode([a], [/])) */
Stack Trace:
java.lang.AssertionError: Unexpected plan: [oak:Unstructured] as [a] /* traverse "//*" where ([a].[xyz/jcr:primaryType] is not null) and (isdescendantnode([a], [/])) */
at org.junit.Assert.fail(Assert.java:88)
at org.junit.Assert.assertTrue(Assert.java:41)
at org.apache.jackrabbit.oak.jcr.query.QueryTest.assertPlan(QueryTest.java:852)
at org.apache.jackrabbit.oak.jcr.query.QueryTest.nodeType(QueryTest.java:846)
at sun.reflect.NativeMethodAccessorImpl.invoke0(Native Method)
at sun.reflect.NativeMethodAccessorImpl.invoke(NativeMethodAccessorImpl.java:62)
at sun.reflect.DelegatingMethodAccessorImpl.invoke(DelegatingMethodAccessorImpl.java:43)
at java.lang.reflect.Method.invoke(Method.java:498)
at org.junit.runners.model.FrameworkMethod$1.runReflectiveCall(FrameworkMethod.java:50)
at org.junit.internal.runners.model.ReflectiveCallable.run(ReflectiveCallable.java:12)
at org.junit.runners.model.FrameworkMethod.invokeExplosively(FrameworkMethod.java:47)
at org.junit.internal.runners.statements.InvokeMethod.evaluate(InvokeMethod.java:17)
at org.junit.internal.runners.statements.RunAfters.evaluate(RunAfters.java:27)
at org.junit.runners.ParentRunner.runLeaf(ParentRunner.java:325)
at org.junit.runners.BlockJUnit4ClassRunner.runChild(BlockJUnit4ClassRunner.java:78)
at org.junit.runners.BlockJUnit4ClassRunner.runChild(BlockJUnit4ClassRunner.java:57)
at org.junit.runners.ParentRunner$3.run(ParentRunner.java:290)
at org.junit.runners.ParentRunner$1.schedule(ParentRunner.java:71)
at org.junit.runners.ParentRunner.runChildren(ParentRunner.java:288)
at org.junit.runners.ParentRunner.access$000(ParentRunner.java:58)
at org.junit.runners.ParentRunner$2.evaluate(ParentRunner.java:268)
at org.junit.runners.ParentRunner.run(ParentRunner.java:363)
at org.junit.runners.Suite.runChild(Suite.java:128)
at org.junit.runners.Suite.runChild(Suite.java:27)
at org.junit.runners.ParentRunner$3.run(ParentRunner.java:290)
at java.util.concurrent.Executors$RunnableAdapter.call(Executors.java:511)
at java.util.concurrent.FutureTask.run(FutureTask.java:266)
at java.util.concurrent.ThreadPoolExecutor.runWorker(ThreadPoolExecutor.java:1142)
at java.util.concurrent.ThreadPoolExecutor$Worker.run(ThreadPoolExecutor.java:617)
at java.lang.Thread.run(Thread.java:745)
FAILED: org.apache.jackrabbit.oak.segment.standby.ExternalPrivateStoreIT.testProxySkippedBytes
Error Message:
expected:<{ root = { ... } }> but was:<{ root : { } }>
Stack Trace:
java.lang.AssertionError: expected:<{ root = { ... } }> but was:<{ root : { } }>
FAILED: org.apache.jackrabbit.oak.segment.standby.ExternalPrivateStoreIT.testProxyFlippedIntermediateByteChange2
Error Message:
expected:<{ root = { ... } }> but was:<{ root : { } }>
Stack Trace:
java.lang.AssertionError: expected:<{ root = { ... } }> but was:<{ root : { } }>
FAILED: org.apache.jackrabbit.oak.segment.standby.ExternalPrivateStoreIT.testProxyFlippedIntermediateByteChange
Error Message:
expected:<{ root = { ... } }> but was:<{ root : { } }>
Stack Trace:
java.lang.AssertionError: expected:<{ root = { ... } }> but was:<{ root : { } }>
FAILED: org.apache.jackrabbit.oak.segment.standby.ExternalSharedStoreIT.testProxySkippedBytes
Error Message:
expected:<{ root = { ... } }> but was:<{ root : { } }>
Stack Trace:
java.lang.AssertionError: expected:<{ root = { ... } }> but was:<{ root : { } }>
FAILED: org.apache.jackrabbit.oak.segment.standby.ExternalSharedStoreIT.testProxyFlippedIntermediateByteChange2
Error Message:
expected:<{ root = { ... } }> but was:<{ root : { } }>
Stack Trace:
java.lang.AssertionError: expected:<{ root = { ... } }> but was:<{ root : { } }>
FAILED: org.apache.jackrabbit.oak.jcr.query.QueryTest.nodeType[DocumentNodeStore[RDB] on jdbc:h2:file:./target/oaktest]
Error Message:
Unexpected plan: [oak:Unstructured] as [a] /* traverse "//*" where ([a].[xyz/jcr:primaryType] is not null) and (isdescendantnode([a], [/])) */
Stack Trace:
java.lang.AssertionError: Unexpected plan: [oak:Unstructured] as [a] /* traverse "//*" where ([a].[xyz/jcr:primaryType] is not null) and (isdescendantnode([a], [/])) */
at org.junit.Assert.fail(Assert.java:88)
at org.junit.Assert.assertTrue(Assert.java:41)
at org.apache.jackrabbit.oak.jcr.query.QueryTest.assertPlan(QueryTest.java:852)
at org.apache.jackrabbit.oak.jcr.query.QueryTest.nodeType(QueryTest.java:846)
at sun.reflect.NativeMethodAccessorImpl.invoke0(Native Method)
at sun.reflect.NativeMethodAccessorImpl.invoke(NativeMethodAccessorImpl.java:62)
at sun.reflect.DelegatingMethodAccessorImpl.invoke(DelegatingMethodAccessorImpl.java:43)
at java.lang.reflect.Method.invoke(Method.java:498)
at org.junit.runners.model.FrameworkMethod$1.runReflectiveCall(FrameworkMethod.java:50)
at org.junit.internal.runners.model.ReflectiveCallable.run(ReflectiveCallable.java:12)
at org.junit.runners.model.FrameworkMethod.invokeExplosively(FrameworkMethod.java:47)
at org.junit.internal.runners.statements.InvokeMethod.evaluate(InvokeMethod.java:17)
at org.junit.internal.runners.statements.RunAfters.evaluate(RunAfters.java:27)
at org.junit.runners.ParentRunner.runLeaf(ParentRunner.java:325)
at org.junit.runners.BlockJUnit4ClassRunner.runChild(BlockJUnit4ClassRunner.java:78)
at org.junit.runners.BlockJUnit4ClassRunner.runChild(BlockJUnit4ClassRunner.java:57)
at org.junit.runners.ParentRunner$3.run(ParentRunner.java:290)
at org.junit.runners.ParentRunner$1.schedule(ParentRunner.java:71)
at org.junit.runners.ParentRunner.runChildren(ParentRunner.java:288)
at org.junit.runners.ParentRunner.access$000(ParentRunner.java:58)
at org.junit.runners.ParentRunner$2.evaluate(ParentRunner.java:268)
at org.junit.runners.ParentRunner.run(ParentRunner.java:363)
at org.junit.runners.Suite.runChild(Suite.java:128)
at org.junit.runners.Suite.runChild(Suite.java:27)
at org.junit.runners.ParentRunner$3.run(ParentRunner.java:290)
at java.util.concurrent.Executors$RunnableAdapter.call(Executors.java:511)
at java.util.concurrent.FutureTask.run(FutureTask.java:266)
at java.util.concurrent.ThreadPoolExecutor.runWorker(ThreadPoolExecutor.java:1142)
at java.util.concurrent.ThreadPoolExecutor$Worker.run(ThreadPoolExecutor.java:617)
at java.lang.Thread.run(Thread.java:745)