You are viewing a plain text version of this content. The canonical link for it is here.
Posted to builds@beam.apache.org by Apache Jenkins Server <je...@builds.apache.org> on 2022/02/14 12:46:43 UTC

Build failed in Jenkins: beam_PostCommit_XVR_Spark #3365

See <https://ci-beam.apache.org/job/beam_PostCommit_XVR_Spark/3365/display/redirect?page=changes>

Changes:

[akustov] fix name project id from secreton scio deploy action

[alexander.zhuravlev] [BEAM-13775] Fixed bug with run button

[ihr] [BEAM-13836] Fix the answers placeholders locations in the Python katas

[noreply] Merge pull request #16703 from [BEAM-13804][Playground][Bugfix] Add

[noreply] Merge pull request #16611 from [BEAM-13712][Playground] Add graph for

[noreply] Merge pull request #16757 from [BEAM-13655] [Playground] Persist the


------------------------------------------
[...truncated 444.29 KB...]
  coders: <
    key: "bqDjiPFqSQSerializableCoder1"
    value: <
      spec: <
        urn: "beam:coders:javasdk:0.1"
        payload: "\202SNAPPY\000\000\000\000\001\000\000\000\001\000\000\000\312\214\002\360^\254\355\000\005sr\000,org.apache.beam.sdk.coders.SerializableCoder\010\364 \216\305ynl\002\000\001L\000\004typet\000\021Ljava/lang/Class;xr\000&ofV\000\024Custom\005P8j\260\010\235\013;\035\013\002\000\000xr\000 j\213\000\005/\034C\335\325\211\256\274~\370\001/\020pvr\000;N1\000Pio.BoundedReadFromUnb\t\021`Source$Shardd\236\240U\205\000j\363\002\000\000xp"
      >
    >
  >
  coders: <
    key: "bqDjiPFqSQTimestampedValueCoder"
    value: <
      spec: <
        urn: "beam:coders:javasdk:0.1"
        payload: "\202SNAPPY\000\000\000\000\001\000\000\000\001\000\000\001?\315\003\270\254\355\000\005sr\000Aorg.apache.beam.sdk.values.TimestampedV\001\022\000$>\021\000LCoder\364\376\202p\274iX-\002\000\001L\000\nv\001)\005\030\034t\000\"Lorg/\t]\000/\001],/sdk/coders/\005$\020;xr\000*N\202\000\t%(.Structured\005/8s\277\022\016\325\3246\021\002\000\000xr\000 j9\000\005/\034C\335\325\211\256\274~\370\001/\020psr\000,j1\000(Serializabl\t\277\034\010\364 \216\305ynl\005\327\\\004typet\000\021Ljava/lang/Class\001\300\000&jV\000\024Custom\005\215Pj\260\010\235\013;\035\013\002\000\000xq\000~\000\003vr\000;N;\000Pio.BoundedReadFromUnb\t\021`Source$Shardd\236\240U\205\000j\363\002\000\000xp"
      >
    >
  >
  coders: <
    key: "bqDjiPFqSQValueWithRecordIdCoder"
    value: <
      spec: <
        urn: "beam:coders:javasdk:0.1"
        payload: "\202SNAPPY\000\000\000\000\001\000\000\000\001\000\000\001h\364\004\320\254\355\000\005sr\000Corg.apache.beam.sdk.values.ValueWithRecordId$B\022\000LCoder{\343\376bQ\014\204>\002\000\002L\000\007i\t\025\034t\000+Lorg/\t\\\000/\001\\\024/sdk/c\0012(s/ByteArray\005B\014;L\000\n\005u\005\016\010t\000\"n;\000\005$\020;xr\000*N\274\000\t`(.Structured\005/8s\277\022\016\325\3246\021\002\000\000xr\000 j9\000\005/\034C\335\325\211\256\274~\370\001/\020psr\000)j1\0006\312\000\034\351\277\005|\263\3746\333\001:\010r\000&j8\000\024Atomic\005o\034\307\354\265\314\205tPF\0015 q\000~\000\003sr\000-N;\000$io.kafka.K\001\006\000R%\227\005B<I\320\251Y\032\341{#\002\000\001L\000\007kv\005\025\010t\000$nH\001\000K\t&\000;\025s\000\"Ns\000-P\r- j\000\275\271\035\243\3126\002!\353\010\010ke)\277\001\264\000\0022\303\001\005\022\rY$q\000~\000\006q\000~\000\016"
      >
    >
  >
  coders: <
    key: "bqDjiPFqSQVarIntCoder"
    value: <
      spec: <
        urn: "beam:coders:javasdk:0.1"
        payload: "\202SNAPPY\000\000\000\000\001\000\000\000\001\000\000\000\210\330\001\350\254\355\000\005sr\000&org.apache.beam.sdk.coders.VarIntCoder\300K2\332\251KVh\002\000\000xrr5\000\024Atomic\0055 \307\354\265\314\205tPF\002\0055\000*jj\000$Structured\0059\034s\277\022\016\325\3246\021\t9\000 j9\000\005/0C\335\325\211\256\274~\370\002\000\000xp"
      >
    >
  >
  coders: <
    key: "bqDjiPFqSQVoidCoder"
    value: <
      spec: <
        urn: "beam:coders:javasdk:0.1"
        payload: "\202SNAPPY\000\000\000\000\001\000\000\000\001\000\000\000\210\326\001\350\254\355\000\005sr\000$org.apache.beam.sdk.coders.VoidCoder\271\277U\233\350\r\257U\002\000\000xr\000&j3\000\024Atomic\0055 \307\354\265\314\205tPF\002\0055\000*j5\000$Structured\0059\034s\277\022\016\325\3246\021\t9\000 j9\000\005/0C\335\325\211\256\274~\370\002\000\000xp"
      >
    >
  >
  coders: <
    key: "c0"
    value: <
      spec: <
        urn: "beam:coder:bytes:v1"
      >
    >
  >
  coders: <
    key: "c1"
    value: <
      spec: <
        urn: "beam:coder:global_window:v1"
      >
    >
  >
  coders: <
    key: "c2"
    value: <
      spec: <
        urn: "beam:go:coder:custom:v1"
        payload: "Cgd2YXJpbnR6EgIIAhpdCklnaXRodWIuY29tL2FwYWNoZS9iZWFtL3Nka3MvdjIvZ28vcGtnL2JlYW0vY29yZS9ydW50aW1lL2NvZGVyeC5lbmNWYXJJbnRaEhAIFiIECBlADyoGCBQSAggIImkKSWdpdGh1Yi5jb20vYXBhY2hlL2JlYW0vc2Rrcy92Mi9nby9wa2cvYmVhbS9jb3JlL3J1bnRpbWUvY29kZXJ4LmRlY1ZhckludFoSHAgWIgQIGUADIgYIFBICCAgqBAgZQA8qBAgZQAE="
      >
    >
  >
  coders: <
    key: "c3"
    value: <
      spec: <
        urn: "beam:coder:length_prefix:v1"
      >
      component_coder_ids: "c2"
    >
  >
  coders: <
    key: "c4"
    value: <
      spec: <
        urn: "beam:coder:kv:v1"
      >
      component_coder_ids: "c0"
      component_coder_ids: "c0"
    >
  >
  environments: <
    key: "bqDjiPFqSQbeam:env:docker:v1"
    value: <
      urn: "beam:env:docker:v1"
      payload: "\n apache/beam_java8_sdk:2.38.0.dev"
      capabilities: "beam:coder:bytes:v1"
      capabilities: "beam:coder:bool:v1"
      capabilities: "beam:coder:varint:v1"
      capabilities: "beam:coder:string_utf8:v1"
      capabilities: "beam:coder:iterable:v1"
      capabilities: "beam:coder:timer:v1"
      capabilities: "beam:coder:kv:v1"
      capabilities: "beam:coder:length_prefix:v1"
      capabilities: "beam:coder:global_window:v1"
      capabilities: "beam:coder:interval_window:v1"
      capabilities: "beam:coder:custom_window:v1"
      capabilities: "beam:coder:windowed_value:v1"
      capabilities: "beam:coder:double:v1"
      capabilities: "beam:coder:row:v1"
      capabilities: "beam:coder:param_windowed_value:v1"
      capabilities: "beam:coder:state_backed_iterable:v1"
      capabilities: "beam:coder:sharded_key:v1"
      capabilities: "beam:protocol:multi_core_bundle_processing:v1"
      capabilities: "beam:protocol:progress_reporting:v1"
      capabilities: "beam:protocol:harness_monitoring_infos:v1"
      capabilities: "beam:protocol:control_request_elements_embedding:v1"
      capabilities: "beam:protocol:state_caching:v1"
      capabilities: "beam:version:sdk_base:apache/beam_java8_sdk:2.38.0.dev"
      capabilities: "beam:transform:sdf_truncate_sized_restrictions:v1"
      capabilities: "beam:transform:to_string:v1"
      dependencies: <
        type_urn: "beam:artifact:type:file:v1"
        type_payload: "\nL/tmp/artifacts/icedtea-sound-ebvtNFkfFXg4aaYFuDnwKpwDSjzsaZqlqv5iKxPTr-U.jar\022@79bbed34591f15783869a605b839f02a9c034a3cec699aa5aafe622b13d3afe5"
        role_urn: "beam:artifact:role:staging_to:v1"
        role_payload: "\n=icedtea-sound-ebvtNFkfFXg4aaYFuDnwKpwDSjzsaZqlqv5iKxPTr-U.jar"
      >
      dependencies: <
        type_urn: "beam:artifact:type:file:v1"
        type_payload: "\nF/tmp/artifacts/jaccess-ULFTCPsb6cLYZ0f1BG1FQfczmHNaZCx8plXuRDKpBqE.jar\022@50b15308fb1be9c2d86747f5046d4541f73398735a642c7ca655ee4432a906a1"
        role_urn: "beam:artifact:role:staging_to:v1"
        role_payload: "\n7jaccess-ULFTCPsb6cLYZ0f1BG1FQfczmHNaZCx8plXuRDKpBqE.jar"
      >
      dependencies: <
        type_urn: "beam:artifact:type:file:v1"
        type_payload: "\nI/tmp/artifacts/localedata-dUHqyGxaTVCjfTI8MckPYarZ3_mwf62udkxaHi1aKns.jar\022@7541eac86c5a4d50a37d323c31c90f61aad9dff9b07fadae764c5a1e2d5a2a7b"
        role_urn: "beam:artifact:role:staging_to:v1"
        role_payload: "\n:localedata-dUHqyGxaTVCjfTI8MckPYarZ3_mwf62udkxaHi1aKns.jar"
      >
      dependencies: <
        type_urn: "beam:artifact:type:file:v1"
        type_payload: "\nF/tmp/artifacts/nashorn-XdUndQGroXOP9NCsfITpBERYcbbGXVHLjbvNWXCh-3A.jar\022@5dd5277501aba1738ff4d0ac7c84e904445871b6c65d51cb8dbbcd5970a1fb70"
        role_urn: "beam:artifact:role:staging_to:v1"
        role_payload: "\n7nashorn-XdUndQGroXOP9NCsfITpBERYcbbGXVHLjbvNWXCh-3A.jar"
      >
      dependencies: <
        type_urn: "beam:artifact:type:file:v1"
        type_payload: "\nG/tmp/artifacts/cldrdata-YqzuKX1QnLCOo0cwjKRdBhGrip_ltIJZg-APT60tUPA.jar\022@62acee297d509cb08ea347308ca45d0611ab8a9fe5b4825983e00f4fad2d50f0"
        role_urn: "beam:artifact:role:staging_to:v1"
        role_payload: "\n8cldrdata-YqzuKX1QnLCOo0cwjKRdBhGrip_ltIJZg-APT60tUPA.jar"
      >
      dependencies: <
        type_urn: "beam:artifact:type:file:v1"
        type_payload: "\nD/tmp/artifacts/dnsns-dhEp186udEF6X6chZus-RJzWRmzlccxx1_btlXWayVI.jar\022@761129d7ceae74417a5fa72166eb3e449cd6466ce571cc71d7f6ed95759ac952"
        role_urn: "beam:artifact:role:staging_to:v1"
        role_payload: "\n5dnsns-dhEp186udEF6X6chZus-RJzWRmzlccxx1_btlXWayVI.jar"
      >
      dependencies: <
        type_urn: "beam:artifact:type:file:v1"
        type_payload: "\nr/tmp/artifacts/beam-sdks-java-io-expansion-service-2.38.0-SNAPSHOT-CgSvazBluGwdVSKlUuM4W-xGs0dXW2dEu0F_avXM790.jar\022@0a04af6b3065b86c1d5522a552e3385bec46b347575b6744bb417f6af5ccefdd"
        role_urn: "beam:artifact:role:staging_to:v1"
        role_payload: "\ncbeam-sdks-java-io-expansion-service-2.38.0-SNAPSHOT-CgSvazBluGwdVSKlUuM4W-xGs0dXW2dEu0F_avXM790.jar"
      >
    >
  >
  environments: <
    key: "go"
    value: <
      urn: "beam:env:docker:v1"
      payload: "\n\026apache/beam_go_sdk:dev"
      capabilities: "beam:protocol:progress_reporting:v0"
      capabilities: "beam:protocol:multi_core_bundle_processing:v1"
      capabilities: "beam:version:sdk_base:go"
      capabilities: "beam:coder:bytes:v1"
      capabilities: "beam:coder:bool:v1"
      capabilities: "beam:coder:varint:v1"
      capabilities: "beam:coder:double:v1"
      capabilities: "beam:coder:string_utf8:v1"
      capabilities: "beam:coder:length_prefix:v1"
      capabilities: "beam:coder:kv:v1"
      capabilities: "beam:coder:iterable:v1"
      capabilities: "beam:coder:state_backed_iterable:v1"
      capabilities: "beam:coder:windowed_value:v1"
      capabilities: "beam:coder:global_window:v1"
      capabilities: "beam:coder:interval_window:v1"
      capabilities: "beam:coder:row:v1"
      dependencies: <
        type_urn: "beam:artifact:type:file:v1"
        role_urn: "beam:artifact:role:go_worker_binary:v1"
      >
    >
  >
>
root_transform_ids: "e4"
root_transform_ids: "s1"
root_transform_ids: "e5"
root_transform_ids: "s3"
requirements: "beam:requirement:pardo:splittable_dofn:v1"
2022/02/14 12:17:28 Cross-compiling <https://ci-beam.apache.org/job/beam_PostCommit_XVR_Spark/ws/src/sdks/go/test/integration/io/xlang/kafka/kafka_test.go> as /tmp/worker-2-1644841048473115858
2022/02/14 12:17:30 Prepared job with id: go-testkafkaio_basicreadwrite_6dbc68db-cfbb-49df-a8b5-e022808c399c and staging token: go-testkafkaio_basicreadwrite_6dbc68db-cfbb-49df-a8b5-e022808c399c
2022/02/14 12:17:30 Staged binary artifact with token: 
2022/02/14 12:17:30 Submitted job: go0testkafkaio0basicreadwrite-jenkins-0214121730-b6956621_0d4c9f31-ef39-4957-96ff-3e6fdb4c7adb
2022/02/14 12:17:30 Job state: STOPPED
2022/02/14 12:17:30 Job state: STARTING
2022/02/14 12:17:30 Job state: RUNNING
2022/02/14 12:18:06 Job state: DONE
2022/02/14 12:18:06 Warning: 6 errors during metrics processing: [failed to deduce Step from MonitoringInfo: urn:"beam:metric:element_count:v1"  type:"beam:metrics:sum_int64:v1"  payload:"\x01"  labels:{key:"PCOLLECTION"  value:"bqDjiPFqSQExternal/KafkaIO.Read/KafkaIO.Read.ReadFromKafkaViaUnbounded/Read(KafkaUnboundedSource)/Create/Read(CreateSource)/ParDo(OutputSingleSource)/ParMultiDo(OutputSingleSource).output/SplitAndSize0"} failed to deduce Step from MonitoringInfo: urn:"beam:metric:sampled_byte_size:v1"  type:"beam:metrics:distribution_int64:v1"  payload:"\x01\xc9A\xc9A\xc9A"  labels:{key:"PCOLLECTION"  value:"bqDjiPFqSQExternal/KafkaIO.Read/KafkaIO.Read.ReadFromKafkaViaUnbounded/Read(KafkaUnboundedSource)/Create/Read(CreateSource)/ParDo(OutputSingleSource)/ParMultiDo(OutputSingleSource).output/SplitAndSize0"} failed to deduce Step from MonitoringInfo: urn:"beam:metric:element_count:v1"  type:"beam:metrics:sum_int64:v1"  payload:"\x01"  labels:{key:"PCOLLECTION"  value:"bqDjiPFqSQExternal/KafkaIO.Read/KafkaIO.Read.ReadFromKafkaViaUnbounded/Read(KafkaUnboundedSource)/Create/Read(CreateSource)/ParDo(OutputSingleSource)/ParMultiDo(OutputSingleSource).output/PairWithRestriction0"} failed to deduce Step from MonitoringInfo: urn:"beam:metric:element_count:v1"  type:"beam:metrics:sum_int64:v1"  payload:"\x01"  labels:{key:"PCOLLECTION"  value:"bqDjiPFqSQExternal/KafkaIO.Read/KafkaIO.Read.ReadFromKafkaViaUnbounded/Read(KafkaUnboundedSource)/Create/Read(CreateSource)/ParDo(OutputSingleSource)/ParMultiDo(OutputSingleSource).output/SplitAndSize0"} failed to deduce Step from MonitoringInfo: urn:"beam:metric:sampled_byte_size:v1"  type:"beam:metrics:distribution_int64:v1"  payload:"\x01\xbcA\xbcA\xbcA"  labels:{key:"PCOLLECTION"  value:"bqDjiPFqSQExternal/KafkaIO.Read/KafkaIO.Read.ReadFromKafkaViaUnbounded/Read(KafkaUnboundedSource)/Create/Read(CreateSource)/ParDo(OutputSingleSource)/ParMultiDo(OutputSingleSource).output/PairWithRestriction0"} failed to deduce Step from MonitoringInfo: urn:"beam:metric:sampled_byte_size:v1"  type:"beam:metrics:distribution_int64:v1"  payload:"\x01\xc9A\xc9A\xc9A"  labels:{key:"PCOLLECTION"  value:"bqDjiPFqSQExternal/KafkaIO.Read/KafkaIO.Read.ReadFromKafkaViaUnbounded/Read(KafkaUnboundedSource)/Create/Read(CreateSource)/ParDo(OutputSingleSource)/ParMultiDo(OutputSingleSource).output/SplitAndSize0"}]
--- PASS: TestKafkaIO_BasicReadWrite (59.12s)
PASS
ok  	github.com/apache/beam/sdks/v2/go/test/integration/io/xlang/kafka	62.151s

> Task :runners:spark:2:job-server:validatesCrossLanguageRunnerJavaUsingJava
> Task :runners:spark:2:job-server:validatesCrossLanguageRunnerJavaUsingPython
> Task :runners:spark:2:job-server:validatesCrossLanguageRunnerJavaUsingPythonOnly
> Task :runners:spark:2:job-server:validatesCrossLanguageRunnerPythonUsingJava
> Task :runners:spark:2:job-server:validatesCrossLanguageRunnerPythonUsingPython
> Task :runners:spark:2:job-server:validatesCrossLanguageRunnerPythonUsingSql
> Task :runners:spark:2:job-server:validatesCrossLanguageRunnerPythonUsingSql FAILED
> Task :runners:spark:2:job-server:validatesCrossLanguageRunnerCleanup
> Task :runners:spark:2:job-server:sparkJobServerCleanup

FAILURE: Build failed with an exception.

* What went wrong:
Execution failed for task ':runners:spark:2:job-server:validatesCrossLanguageRunnerPythonUsingSql'.
> Process 'command 'sh'' finished with non-zero exit value 1

* Try:
> Run with --stacktrace option to get the stack trace.
> Run with --info or --debug option to get more log output.
> Run with --scan to get full insights.

* Get more help at https://help.gradle.org

Deprecated Gradle features were used in this build, making it incompatible with Gradle 8.0.

You can use '--warning-mode all' to show the individual deprecation warnings and determine if they come from your own scripts or plugins.

See https://docs.gradle.org/7.3.2/userguide/command_line_interface.html#sec:command_line_warnings

Execution optimizations have been disabled for 1 invalid unit(s) of work during this build to ensure correctness.
Please consult deprecation warnings for more details.

BUILD FAILED in 43m 36s
250 actionable tasks: 166 executed, 73 from cache, 11 up-to-date

Publishing build scan...
https://gradle.com/s/qhpsu6t3vi6iw

Build step 'Invoke Gradle script' changed build result to FAILURE
Build step 'Invoke Gradle script' marked build as failure

---------------------------------------------------------------------
To unsubscribe, e-mail: builds-unsubscribe@beam.apache.org
For additional commands, e-mail: builds-help@beam.apache.org


Jenkins build is back to normal : beam_PostCommit_XVR_Spark #3367

Posted by Apache Jenkins Server <je...@builds.apache.org>.
See <https://ci-beam.apache.org/job/beam_PostCommit_XVR_Spark/3367/display/redirect?page=changes>


---------------------------------------------------------------------
To unsubscribe, e-mail: builds-unsubscribe@beam.apache.org
For additional commands, e-mail: builds-help@beam.apache.org


Build failed in Jenkins: beam_PostCommit_XVR_Spark #3366

Posted by Apache Jenkins Server <je...@builds.apache.org>.
See <https://ci-beam.apache.org/job/beam_PostCommit_XVR_Spark/3366/display/redirect?page=changes>

Changes:

[noreply] Update 2.36.0 blog post to mention ARM64 support

[noreply] Minor: Disable checker framework in nightly snapshot (#16829)

[artur.khanin] Updated example link

[noreply] [BEAM-13860] Make `DoFn.infer_output_type` return element type (#16788)


------------------------------------------
[...truncated 968.67 KB...]
Collecting Keras-Preprocessing==1.1.2
  Downloading Keras_Preprocessing-1.1.2-py2.py3-none-any.whl (42 kB)
Collecting libclang==13.0.0
  Downloading libclang-13.0.0-py2.py3-none-manylinux1_x86_64.whl (14.5 MB)
Collecting libcst==0.4.1
  Downloading libcst-0.4.1-cp39-cp39-manylinux_2_17_x86_64.manylinux2014_x86_64.whl (2.7 MB)
Collecting Markdown==3.3.6
  Downloading Markdown-3.3.6-py3-none-any.whl (97 kB)
Collecting mmh3==3.0.0
  Downloading mmh3-3.0.0-cp39-cp39-manylinux2010_x86_64.whl (49 kB)
Collecting mock==2.0.0
  Downloading mock-2.0.0-py2.py3-none-any.whl (56 kB)
Collecting more-itertools==8.12.0
  Downloading more_itertools-8.12.0-py3-none-any.whl (54 kB)
Collecting mypy-extensions==0.4.3
  Downloading mypy_extensions-0.4.3-py2.py3-none-any.whl (4.5 kB)
Collecting nltk==3.7
  Downloading nltk-3.7-py3-none-any.whl (1.5 MB)
Collecting nose==1.3.7
  Downloading nose-1.3.7-py3-none-any.whl (154 kB)
Collecting numpy==1.21.5
  Downloading numpy-1.21.5-cp39-cp39-manylinux_2_12_x86_64.manylinux2010_x86_64.whl (15.7 MB)
Collecting oauth2client==4.1.3
  Downloading oauth2client-4.1.3-py2.py3-none-any.whl (98 kB)
Collecting oauthlib==3.2.0
  Downloading oauthlib-3.2.0-py3-none-any.whl (151 kB)
Collecting opt-einsum==3.3.0
  Downloading opt_einsum-3.3.0-py3-none-any.whl (65 kB)

> Task :sdks:python:installGcpTest
Collecting oauthlib>=3.0.0
  Using cached oauthlib-3.2.0-py3-none-any.whl (151 kB)
Collecting mypy-extensions>=0.3.0
  Using cached mypy_extensions-0.4.3-py2.py3-none-any.whl (4.5 kB)
Building wheels for collected packages: apache-beam
  Building wheel for apache-beam (setup.py): started
  Building wheel for apache-beam (setup.py): finished with status 'done'
  Created wheel for apache-beam: filename=apache_beam-2.38.0.dev0-py3-none-any.whl size=2659514 sha256=764c084efa3bba17e139a57c5436192677a649384b0ce52a6784cdc195b28cc1
  Stored in directory: /home/jenkins/.cache/pip/wheels/d5/58/7a/334e689ce60efdb03f304ca595a2d8ab4c28870f147d59b785
Successfully built apache-beam
Installing collected packages: wcwidth, pytz, pyasn1, parameterized, mypy-extensions, docopt, crcmod, certifi, wrapt, websocket-client, urllib3, typing-utils, typing-extensions, tenacity, rsa, pyyaml, python-dateutil, pyparsing, pymysql, pymongo, pyhamcrest, pycparser, pyasn1-modules, psycopg2-binary, proto-plus, pluggy, pbr, orjson, oauthlib, numpy, more-itertools, jmespath, isodate, idna, greenlet, googleapis-common-protos, google-crc32c, fasteners, fastavro, execnet, dill, cloudpickle, charset-normalizer, cachetools, attrs, atomicwrites, typing-inspect, sqlalchemy, requests, pydot, pyarrow, pandas, overrides, mock, httplib2, grpcio-status, grpcio-gcp, google-resumable-media, google-auth, freezegun, cffi, botocore, s3transfer, requests-oauthlib, requests_mock, pytest, oauth2client, libcst, hdfs, grpc-google-iam-v1, google-api-core, docker, deprecation, cryptography, azure-core, testcontainers, pytest-timeout, pytest-forked, msrest, google-cloud-core, google-apitools, boto3, apache-beam, pytest-xdist, google-cloud-vision, google-cloud-videointelligence, google-cloud-spanner, google-cloud-recommendations-ai, google-cloud-pubsub, google-cloud-language, google-cloud-dlp, google-cloud-datastore, google-cloud-bigtable, google-cloud-bigquery-storage, google-cloud-bigquery, azure-storage-blob, google-cloud-pubsublite
  Attempting uninstall: pyparsing
    Found existing installation: pyparsing 3.0.7
    Uninstalling pyparsing-3.0.7:
      Successfully uninstalled pyparsing-3.0.7
  Attempting uninstall: pluggy
    Found existing installation: pluggy 1.0.0
    Uninstalling pluggy-1.0.0:
      Successfully uninstalled pluggy-1.0.0
Successfully installed apache-beam-2.38.0.dev0 atomicwrites-1.4.0 attrs-21.4.0 azure-core-1.22.1 azure-storage-blob-12.9.0 boto3-1.20.54 botocore-1.23.54 cachetools-4.2.4 certifi-2021.10.8 cffi-1.15.0 charset-normalizer-2.0.12 cloudpickle-2.0.0 crcmod-1.7 cryptography-36.0.1 deprecation-2.1.0 dill-0.3.1.1 docker-5.0.3 docopt-0.6.2 execnet-1.9.0 fastavro-1.4.9 fasteners-0.17.3 freezegun-1.1.0 google-api-core-1.31.5 google-apitools-0.5.31 google-auth-1.35.0 google-cloud-bigquery-2.32.0 google-cloud-bigquery-storage-2.11.0 google-cloud-bigtable-1.7.0 google-cloud-core-1.7.2 google-cloud-datastore-1.15.3 google-cloud-dlp-3.6.0 google-cloud-language-1.3.0 google-cloud-pubsub-2.9.0 google-cloud-pubsublite-1.3.0 google-cloud-recommendations-ai-0.2.0 google-cloud-spanner-1.19.1 google-cloud-videointelligence-1.16.1 google-cloud-vision-1.0.0 google-crc32c-1.3.0 google-resumable-media-2.2.1 googleapis-common-protos-1.54.0 greenlet-1.1.2 grpc-google-iam-v1-0.12.3 grpcio-gcp-0.2.2 grpcio-status-1.43.0 hdfs-2.6.0 httplib2-0.19.1 idna-3.3 isodate-0.6.1 jmespath-0.10.0 libcst-0.4.1 mock-2.0.0 more-itertools-8.12.0 msrest-0.6.21 mypy-extensions-0.4.3 numpy-1.21.5 oauth2client-4.1.3 oauthlib-3.2.0 orjson-3.6.7 overrides-6.1.0 pandas-1.4.1 parameterized-0.7.5 pbr-5.8.1 pluggy-0.13.1 proto-plus-1.20.0 psycopg2-binary-2.9.3 pyarrow-6.0.1 pyasn1-0.4.8 pyasn1-modules-0.2.8 pycparser-2.21 pydot-1.4.2 pyhamcrest-1.10.1 pymongo-3.12.3 pymysql-1.0.2 pyparsing-2.4.7 pytest-4.6.11 pytest-forked-1.4.0 pytest-timeout-1.4.2 pytest-xdist-1.34.0 python-dateutil-2.8.2 pytz-2021.3 pyyaml-6.0 requests-2.27.1 requests-oauthlib-1.3.1 requests_mock-1.9.3 rsa-4.8 s3transfer-0.5.1 sqlalchemy-1.4.31 tenacity-5.1.5 testcontainers-3.4.2 typing-extensions-4.1.1 typing-inspect-0.7.1 typing-utils-0.1.0 urllib3-1.26.8 wcwidth-0.2.5 websocket-client-1.2.3 wrapt-1.13.3

> Task :sdks:python:container:py39:docker
Collecting orjson==3.6.6
  Downloading orjson-3.6.6-cp39-cp39-manylinux_2_24_x86_64.whl (245 kB)
Collecting overrides==6.1.0
  Downloading overrides-6.1.0-py3-none-any.whl (14 kB)
Collecting packaging==21.3
  Downloading packaging-21.3-py3-none-any.whl (40 kB)
Collecting pandas==1.4.0
  Downloading pandas-1.4.0-cp39-cp39-manylinux_2_17_x86_64.manylinux2014_x86_64.whl (11.7 MB)
Collecting parameterized==0.7.5
  Downloading parameterized-0.7.5-py2.py3-none-any.whl (17 kB)
Collecting pbr==5.8.1
  Downloading pbr-5.8.1-py2.py3-none-any.whl (113 kB)
Collecting pluggy==0.13.1
  Downloading pluggy-0.13.1-py2.py3-none-any.whl (18 kB)
Collecting proto-plus==1.20.0
  Downloading proto_plus-1.20.0-py3-none-any.whl (45 kB)
Collecting protobuf==3.19.4
  Downloading protobuf-3.19.4-cp39-cp39-manylinux_2_17_x86_64.manylinux2014_x86_64.whl (1.1 MB)
Collecting psycopg2-binary==2.9.3
  Downloading psycopg2_binary-2.9.3-cp39-cp39-manylinux_2_17_x86_64.manylinux2014_x86_64.whl (3.0 MB)
Collecting py==1.11.0
  Downloading py-1.11.0-py2.py3-none-any.whl (98 kB)
Collecting pyarrow==6.0.1
  Downloading pyarrow-6.0.1-cp39-cp39-manylinux_2_17_x86_64.manylinux2014_x86_64.whl (25.6 MB)
Collecting pyasn1==0.4.8
  Downloading pyasn1-0.4.8-py2.py3-none-any.whl (77 kB)
Collecting pyasn1-modules==0.2.8
  Downloading pyasn1_modules-0.2.8-py2.py3-none-any.whl (155 kB)
Collecting pycparser==2.21
  Downloading pycparser-2.21-py2.py3-none-any.whl (118 kB)
Collecting pydot==1.4.2
  Downloading pydot-1.4.2-py2.py3-none-any.whl (21 kB)
Collecting PyHamcrest==1.10.1
  Downloading PyHamcrest-1.10.1-py3-none-any.whl (48 kB)
Collecting pymongo==3.12.3
  Downloading pymongo-3.12.3-cp39-cp39-manylinux_2_17_x86_64.manylinux2014_x86_64.whl (516 kB)
Collecting PyMySQL==1.0.2
  Downloading PyMySQL-1.0.2-py3-none-any.whl (43 kB)
Collecting pyparsing==2.4.7
  Downloading pyparsing-2.4.7-py2.py3-none-any.whl (67 kB)
Collecting pytest==4.6.11
  Downloading pytest-4.6.11-py2.py3-none-any.whl (231 kB)
Collecting pytest-forked==1.4.0
  Downloading pytest_forked-1.4.0-py3-none-any.whl (4.9 kB)
Collecting pytest-timeout==1.4.2
  Downloading pytest_timeout-1.4.2-py2.py3-none-any.whl (10 kB)
Collecting pytest-xdist==1.34.0
  Downloading pytest_xdist-1.34.0-py2.py3-none-any.whl (36 kB)
Collecting python-dateutil==2.8.2
  Downloading python_dateutil-2.8.2-py2.py3-none-any.whl (247 kB)
Collecting python-snappy==0.6.0
  Downloading python_snappy-0.6.0-cp39-cp39-manylinux2010_x86_64.whl (54 kB)
Collecting pytz==2021.3
  Downloading pytz-2021.3-py2.py3-none-any.whl (503 kB)
Collecting PyYAML==6.0
  Downloading PyYAML-6.0-cp39-cp39-manylinux_2_5_x86_64.manylinux1_x86_64.manylinux_2_12_x86_64.manylinux2010_x86_64.whl (661 kB)
Collecting regex==2022.1.18
  Downloading regex-2022.1.18-cp39-cp39-manylinux_2_17_x86_64.manylinux2014_x86_64.whl (763 kB)
Collecting requests==2.27.1
  Downloading requests-2.27.1-py2.py3-none-any.whl (63 kB)
Collecting requests-mock==1.9.3
  Downloading requests_mock-1.9.3-py2.py3-none-any.whl (27 kB)
Collecting requests-oauthlib==1.3.1
  Downloading requests_oauthlib-1.3.1-py2.py3-none-any.whl (23 kB)
Collecting rsa==4.8
  Downloading rsa-4.8-py3-none-any.whl (39 kB)
Collecting scikit-learn==1.0.2
  Downloading scikit_learn-1.0.2-cp39-cp39-manylinux_2_17_x86_64.manylinux2014_x86_64.whl (26.4 MB)
Collecting scipy==1.8.0
  Downloading scipy-1.8.0-cp39-cp39-manylinux_2_17_x86_64.manylinux2014_x86_64.whl (42.1 MB)
Collecting six==1.16.0
  Downloading six-1.16.0-py2.py3-none-any.whl (11 kB)
Collecting soupsieve==2.3.1
  Downloading soupsieve-2.3.1-py3-none-any.whl (37 kB)
Collecting SQLAlchemy==1.4.31
  Downloading SQLAlchemy-1.4.31-cp39-cp39-manylinux_2_5_x86_64.manylinux1_x86_64.manylinux_2_17_x86_64.manylinux2014_x86_64.whl (1.6 MB)
Collecting tenacity==5.1.5
  Downloading tenacity-5.1.5-py2.py3-none-any.whl (34 kB)
Collecting tensorboard==2.8.0
  Downloading tensorboard-2.8.0-py3-none-any.whl (5.8 MB)
Collecting tensorboard-data-server==0.6.1
  Downloading tensorboard_data_server-0.6.1-py3-none-manylinux2010_x86_64.whl (4.9 MB)
Collecting tensorboard-plugin-wit==1.8.1
  Downloading tensorboard_plugin_wit-1.8.1-py3-none-any.whl (781 kB)
Collecting tensorflow==2.8.0
  Downloading tensorflow-2.8.0-cp39-cp39-manylinux2010_x86_64.whl (497.6 MB)
Collecting tensorflow-io-gcs-filesystem==0.24.0
  Downloading tensorflow_io_gcs_filesystem-0.24.0-cp39-cp39-manylinux_2_12_x86_64.manylinux2010_x86_64.whl (2.1 MB)
Collecting termcolor==1.1.0
  Downloading termcolor-1.1.0.tar.gz (3.9 kB)
Collecting testcontainers==3.4.2
  Downloading testcontainers-3.4.2-py2.py3-none-any.whl (31 kB)
Collecting tf-estimator-nightly==2.8.0.dev2021122109
  Downloading tf_estimator_nightly-2.8.0.dev2021122109-py2.py3-none-any.whl (462 kB)
Collecting threadpoolctl==3.1.0
  Downloading threadpoolctl-3.1.0-py3-none-any.whl (14 kB)
Collecting tqdm==4.62.3
  Downloading tqdm-4.62.3-py2.py3-none-any.whl (76 kB)
Collecting typing-inspect==0.7.1
  Downloading typing_inspect-0.7.1-py3-none-any.whl (8.4 kB)
Collecting typing-utils==0.1.0
  Downloading typing_utils-0.1.0-py3-none-any.whl (10 kB)
Collecting typing_extensions==4.0.1
  Downloading typing_extensions-4.0.1-py3-none-any.whl (22 kB)
Collecting uritemplate==4.1.1
  Downloading uritemplate-4.1.1-py2.py3-none-any.whl (10 kB)
Collecting urllib3==1.26.8
  Downloading urllib3-1.26.8-py2.py3-none-any.whl (138 kB)
Collecting wcwidth==0.2.5
  Downloading wcwidth-0.2.5-py2.py3-none-any.whl (30 kB)
Collecting websocket-client==1.2.3
  Downloading websocket_client-1.2.3-py3-none-any.whl (53 kB)
Collecting Werkzeug==2.0.3
  Downloading Werkzeug-2.0.3-py3-none-any.whl (289 kB)
Collecting wrapt==1.13.3
  Downloading wrapt-1.13.3-cp39-cp39-manylinux_2_5_x86_64.manylinux1_x86_64.manylinux_2_12_x86_64.manylinux2010_x86_64.whl (81 kB)
Collecting zipp==3.7.0
  Downloading zipp-3.7.0-py3-none-any.whl (5.3 kB)
Building wheels for collected packages: bs4, crcmod, dill, docopt, future, google-apitools, google-cloud-profiler, grpc-google-iam-v1, termcolor
  Building wheel for bs4 (setup.py): started
  Building wheel for bs4 (setup.py): finished with status 'done'
  Created wheel for bs4: filename=bs4-0.0.1-py3-none-any.whl size=1272 sha256=d54508f5e360cd5bd0b5c7654c79af71c06d76039ad3d1222fc3b60f051aa2d3
  Stored in directory: /root/.cache/pip/wheels/73/2b/cb/099980278a0c9a3e57ff1a89875ec07bfa0b6fcbebb9a8cad3
  Building wheel for crcmod (setup.py): started
  Building wheel for crcmod (setup.py): finished with status 'done'
  Created wheel for crcmod: filename=crcmod-1.7-cp39-cp39-linux_x86_64.whl size=30973 sha256=d7b8a832a0eef81c76cd1600f79bc2d7410e5b19410fc5be290e1d4623b90ddd
  Stored in directory: /root/.cache/pip/wheels/4a/6c/a6/ffdd136310039bf226f2707a9a8e6857be7d70a3fc061f6b36
  Building wheel for dill (setup.py): started
  Building wheel for dill (setup.py): finished with status 'done'
  Created wheel for dill: filename=dill-0.3.1.1-py3-none-any.whl size=78544 sha256=3e043b0010bd0e357cd4dc6b4f4765403d292d2e71521864a64510f62305293c
  Stored in directory: /root/.cache/pip/wheels/4f/0b/ce/75d96dd714b15e51cb66db631183ea3844e0c4a6d19741a149
  Building wheel for docopt (setup.py): started
  Building wheel for docopt (setup.py): finished with status 'done'
  Created wheel for docopt: filename=docopt-0.6.2-py2.py3-none-any.whl size=13723 sha256=c71191b9240f1a58f448850cf81bc06cbc5c415821c15d7f0fc6055b633563a2
  Stored in directory: /root/.cache/pip/wheels/70/4a/46/1309fc853b8d395e60bafaf1b6df7845bdd82c95fd59dd8d2b
  Building wheel for future (setup.py): started
  Building wheel for future (setup.py): finished with status 'done'
  Created wheel for future: filename=future-0.18.2-py3-none-any.whl size=491070 sha256=ed019365aba34162c8a85a640390ee28f4f0f4bca87107101b50338ba8b0c055
  Stored in directory: /root/.cache/pip/wheels/2f/a0/d3/4030d9f80e6b3be787f19fc911b8e7aa462986a40ab1e4bb94
  Building wheel for google-apitools (setup.py): started
  Building wheel for google-apitools (setup.py): finished with status 'done'
  Created wheel for google-apitools: filename=google_apitools-0.5.31-py3-none-any.whl size=131039 sha256=b806e39de69d256901a0d5f7f426eeb0545c0bc5e0d82daf69e11d77a25932cd
  Stored in directory: /root/.cache/pip/wheels/6c/f8/60/b9e91899dbaf25b6314047d3daee379bdd8d61b1dc3fd5ec7f
  Building wheel for google-cloud-profiler (setup.py): started
  Building wheel for google-cloud-profiler (setup.py): finished with status 'done'
  Created wheel for google-cloud-profiler: filename=google_cloud_profiler-3.0.7-cp39-cp39-linux_x86_64.whl size=733260 sha256=100a707c24f650c308b2d699c39f9a091f533ab628e6c9bd60321d3fcb3455ac
  Stored in directory: /root/.cache/pip/wheels/b2/38/9d/5dc0d3699d0ded25c0687eefa19d1f40784ea28c14b018fbb3
  Building wheel for grpc-google-iam-v1 (setup.py): started
  Building wheel for grpc-google-iam-v1 (setup.py): finished with status 'done'
  Created wheel for grpc-google-iam-v1: filename=grpc_google_iam_v1-0.12.3-py3-none-any.whl size=18515 sha256=10e9aab971c021ef0d1b9cb210648fc05143a938a68536588ed6c32832779a2f
  Stored in directory: /root/.cache/pip/wheels/a1/b4/ad/f2f4118c678bbc6496d5b7057d2508ba51f66009700b1afe8a
  Building wheel for termcolor (setup.py): started
  Building wheel for termcolor (setup.py): finished with status 'done'
  Created wheel for termcolor: filename=termcolor-1.1.0-py3-none-any.whl size=4848 sha256=8ef9b77e3263d2058a239c55ea5e24c45c77891bedddbc30996b5b7c7021b090
  Stored in directory: /root/.cache/pip/wheels/b6/0d/90/0d1bbd99855f99cb2f6c2e5ff96f8023fad8ec367695f7d72d
Successfully built bs4 crcmod dill docopt future google-apitools google-cloud-profiler grpc-google-iam-v1 termcolor
Installing collected packages: zipp, wrapt, Werkzeug, websocket-client, wcwidth, urllib3, uritemplate, typing-utils, typing-inspect, typing-extensions, tqdm, threadpoolctl, tf-estimator-nightly, testcontainers, termcolor, tensorflow-io-gcs-filesystem, tensorflow, tensorboard-plugin-wit, tensorboard-data-server, tensorboard, tenacity, SQLAlchemy, soupsieve, six, scipy, scikit-learn, rsa, requests-oauthlib, requests-mock, requests, regex, PyYAML, pytz, python-snappy, python-dateutil, pytest-xdist, pytest-timeout, pytest-forked, pytest, pyparsing, PyMySQL, pymongo, PyHamcrest, pydot, pycparser, pyasn1-modules, pyasn1, pyarrow, py, psycopg2-binary, protobuf, proto-plus, pluggy, pbr, parameterized, pandas, packaging, overrides, orjson, opt-einsum, oauthlib, oauth2client, numpy, nose, nltk, mypy-extensions, more-itertools, mock, mmh3, Markdown, libcst, libclang, Keras-Preprocessing, keras, joblib, importlib-metadata, idna, httplib2, hdfs, h5py, guppy3, grpcio-status, grpcio-gcp, grpcio, grpc-google-iam-v1, greenlet, googleapis-common-protos, google-resumable-media, google-python-cloud-debugger, google-pasta, google-crc32c, google-cloud-vision, google-cloud-videointelligence, google-cloud-spanner, google-cloud-recommendations-ai, google-cloud-pubsublite, google-cloud-pubsub, google-cloud-profiler, google-cloud-language, google-cloud-dlp, google-cloud-datastore, google-cloud-core, google-cloud-bigtable, google-cloud-bigquery-storage, google-cloud-bigquery, google-auth-oauthlib, google-auth-httplib2, google-auth, google-apitools, google-api-python-client, google-api-core, gast, future, freezegun, flatbuffers, fasteners, fastavro, execnet, docopt, docker, dill, deprecation, Cython, cryptography, crcmod, cloudpickle, click, charset-normalizer, cffi, certifi, cachetools, bs4, beautifulsoup4, attrs, atomicwrites, astunparse, absl-py
Successfully installed Cython-0.29.27 Keras-Preprocessing-1.1.2 Markdown-3.3.6 PyHamcrest-1.10.1 PyMySQL-1.0.2 PyYAML-6.0 SQLAlchemy-1.4.31 Werkzeug-2.0.3 absl-py-1.0.0 astunparse-1.6.3 atomicwrites-1.4.0 attrs-21.4.0 beautifulsoup4-4.10.0 bs4-0.0.1 cachetools-4.2.4 certifi-2021.10.8 cffi-1.15.0 charset-normalizer-2.0.11 click-8.0.3 cloudpickle-2.0.0 crcmod-1.7 cryptography-36.0.1 deprecation-2.1.0 dill-0.3.1.1 docker-5.0.3 docopt-0.6.2 execnet-1.9.0 fastavro-1.4.9 fasteners-0.17.3 flatbuffers-2.0 freezegun-1.1.0 future-0.18.2 gast-0.5.3 google-api-core-1.31.5 google-api-python-client-2.37.0 google-apitools-0.5.31 google-auth-1.35.0 google-auth-httplib2-0.1.0 google-auth-oauthlib-0.4.6 google-cloud-bigquery-2.32.0 google-cloud-bigquery-storage-2.11.0 google-cloud-bigtable-1.7.0 google-cloud-core-1.7.2 google-cloud-datastore-1.15.3 google-cloud-dlp-3.6.0 google-cloud-language-1.3.0 google-cloud-profiler-3.0.7 google-cloud-pubsub-2.9.0 google-cloud-pubsublite-1.3.0 google-cloud-recommendations-ai-0.2.0 google-cloud-spanner-1.19.1 google-cloud-videointelligence-1.16.1 google-cloud-vision-1.0.0 google-crc32c-1.3.0 google-pasta-0.2.0 google-python-cloud-debugger-2.18 google-resumable-media-2.2.1 googleapis-common-protos-1.54.0 greenlet-1.1.2 grpc-google-iam-v1-0.12.3 grpcio-1.43.0 grpcio-gcp-0.2.2 grpcio-status-1.43.0 guppy3-3.1.2 h5py-3.6.0 hdfs-2.6.0 httplib2-0.19.1 idna-3.3 importlib-metadata-4.11.0 joblib-1.1.0 keras-2.8.0 libclang-13.0.0 libcst-0.4.1 mmh3-3.0.0 mock-2.0.0 more-itertools-8.12.0 mypy-extensions-0.4.3 nltk-3.7 nose-1.3.7 numpy-1.21.5 oauth2client-4.1.3 oauthlib-3.2.0 opt-einsum-3.3.0 orjson-3.6.6 overrides-6.1.0 packaging-21.3 pandas-1.4.0 parameterized-0.7.5 pbr-5.8.1 pluggy-0.13.1 proto-plus-1.20.0 protobuf-3.19.4 psycopg2-binary-2.9.3 py-1.11.0 pyarrow-6.0.1 pyasn1-0.4.8 pyasn1-modules-0.2.8 pycparser-2.21 pydot-1.4.2 pymongo-3.12.3 pyparsing-2.4.7 pytest-4.6.11 pytest-forked-1.4.0 pytest-timeout-1.4.2 pytest-xdist-1.34.0 python-dateutil-2.8.2 python-snappy-0.6.0 pytz-2021.3 regex-2022.1.18 requests-2.27.1 requests-mock-1.9.3 requests-oauthlib-1.3.1 rsa-4.8 scikit-learn-1.0.2 scipy-1.8.0 six-1.16.0 soupsieve-2.3.1 tenacity-5.1.5 tensorboard-2.8.0 tensorboard-data-server-0.6.1 tensorboard-plugin-wit-1.8.1 tensorflow-2.8.0 tensorflow-io-gcs-filesystem-0.24.0 termcolor-1.1.0 testcontainers-3.4.2 tf-estimator-nightly-2.8.0.dev2021122109 threadpoolctl-3.1.0 tqdm-4.62.3 typing-extensions-4.0.1 typing-inspect-0.7.1 typing-utils-0.1.0 uritemplate-4.1.1 urllib3-1.26.8 wcwidth-0.2.5 websocket-client-1.2.3 wrapt-1.13.3 zipp-3.7.0
WARNING: Running pip as the 'root' user can result in broken permissions and conflicting behaviour with the system package manager. It is recommended to use a virtual environment instead: https://pip.pypa.io/warnings/venv
WARNING: You are using pip version 21.2.4; however, version 22.0.3 is available.
You should consider upgrading via the '/usr/local/bin/python -m pip install --upgrade pip' command.
[nltk_data] Downloading package stopwords to /root/nltk_data...
[nltk_data]   Unzipping corpora/stopwords.zip.
Verified fast protobuf used.
FATAL: command execution failed
java.io.IOException: Backing channel 'apache-beam-jenkins-2' is disconnected.
	at hudson.remoting.RemoteInvocationHandler.channelOrFail(RemoteInvocationHandler.java:216)
	at hudson.remoting.RemoteInvocationHandler.invoke(RemoteInvocationHandler.java:286)
	at com.sun.proxy.$Proxy133.isAlive(Unknown Source)
	at hudson.Launcher$RemoteLauncher$ProcImpl.isAlive(Launcher.java:1211)
	at hudson.Launcher$RemoteLauncher$ProcImpl.join(Launcher.java:1203)
	at hudson.Launcher$ProcStarter.join(Launcher.java:523)
	at hudson.plugins.gradle.Gradle.perform(Gradle.java:317)
	at hudson.tasks.BuildStepMonitor$1.perform(BuildStepMonitor.java:20)
	at hudson.model.AbstractBuild$AbstractBuildExecution.perform(AbstractBuild.java:803)
	at hudson.model.Build$BuildExecution.build(Build.java:197)
	at hudson.model.Build$BuildExecution.doRun(Build.java:163)
	at hudson.model.AbstractBuild$AbstractBuildExecution.run(AbstractBuild.java:513)
	at hudson.model.Run.execute(Run.java:1906)
	at hudson.model.FreeStyleBuild.run(FreeStyleBuild.java:43)
	at hudson.model.ResourceController.execute(ResourceController.java:97)
	at hudson.model.Executor.run(Executor.java:429)
Caused by: java.io.IOException: Unexpected termination of the channel
	at hudson.remoting.SynchronousCommandTransport$ReaderThread.run(SynchronousCommandTransport.java:75)
Caused by: java.io.EOFException
	at java.io.ObjectInputStream$PeekInputStream.readFully(ObjectInputStream.java:2799)
	at java.io.ObjectInputStream$BlockDataInputStream.readShort(ObjectInputStream.java:3274)
	at java.io.ObjectInputStream.readStreamHeader(ObjectInputStream.java:934)
	at java.io.ObjectInputStream.<init>(ObjectInputStream.java:396)
	at hudson.remoting.ObjectInputStreamEx.<init>(ObjectInputStreamEx.java:49)
	at hudson.remoting.Command.readFrom(Command.java:142)
	at hudson.remoting.Command.readFrom(Command.java:128)
	at hudson.remoting.AbstractSynchronousByteArrayCommandTransport.read(AbstractSynchronousByteArrayCommandTransport.java:35)
	at hudson.remoting.SynchronousCommandTransport$ReaderThread.run(SynchronousCommandTransport.java:61)
Build step 'Invoke Gradle script' changed build result to FAILURE
Build step 'Invoke Gradle script' marked build as failure
ERROR: apache-beam-jenkins-2 is offline; cannot locate jdk_1.8_latest

---------------------------------------------------------------------
To unsubscribe, e-mail: builds-unsubscribe@beam.apache.org
For additional commands, e-mail: builds-help@beam.apache.org