You are viewing a plain text version of this content. The canonical link for it is here.
Posted to builds@cassandra.apache.org by Apache Jenkins Server <je...@builds.apache.org> on 2026/08/13 02:22:39 UTC
Build complete: Cassandra-4.1 #668 [UNSTABLE] af5fb91b5e4b9ee6f189c0ff55657f34e50ad085
-------------------------------------------------------------------------------
Build Cassandra-4.1 #668 Still Unstable
URL: https://ci-cassandra.apache.org/job/Cassandra-4.1/668/
-------------------------------------------------------------------------------
Changes:
[Stefan Miklosovic] Fix regression in PasswordObfuscator for dollar-quoted passwords
-------------------------------------------------------------------------------
Failed Tests:
19 tests failed.
FAILED: dtest-large.replication_test.TestSnitchConfigurationUpdate.test_rf_expand_gossiping_property_file_snitch_multi_dc
FAILED: dtest-offheap.materialized_views_test.TestMaterializedViews.test_gcgs_validation
FAILED: dtest-offheap.materialized_views_test.TestMaterializedViews.test_drop_table
FAILED: dtest-offheap.cql_tracing_test.TestCqlTracing.test_tracing_simple
FAILED: dtest-offheap.materialized_views_test.TestMaterializedViews.test_drop_with_stopped_build
FAILED: dtest-offheap.secondary_indexes_test.TestSecondaryIndexes.test_6924_dropping_ks
FAILED: dtest-upgrade.upgrade_tests.cql_tests.TestCQLNodes3RF3_Upgrade_indev_4_0_x_To_indev_4_1_x.test_composite_index_with_pk
FAILED: dtest-upgrade.upgrade_tests.cql_tests.TestCQLNodes2RF1_Upgrade_indev_4_0_x_To_indev_4_1_x.test_composite_partition_key_validation
FAILED: dtest.materialized_views_test.TestMaterializedViews.test_drop_with_stopped_build
FAILED: dtest.secondary_indexes_test.TestSecondaryIndexes.test_6924_dropping_ks
FAILED: org.apache.cassandra.cql3.validation.entities.SecondaryIndexTest.testIndexOnNonFrozenCollectionOfFrozenUDT
FAILED: org.apache.cassandra.db.virtual.ClientsTableTest.testSelectAll-cdc
FAILED: org.apache.cassandra.db.virtual.ClientsTableTest.testSelectAll-cdc
FAILED: org.apache.cassandra.db.virtual.ClientsTableTest.testSelectAll-compression
FAILED: org.apache.cassandra.db.virtual.ClientsTableTest.testSelectAll-compression
FAILED: org.apache.cassandra.db.virtual.ClientsTableTest.testSelectAll
FAILED: org.apache.cassandra.db.virtual.ClientsTableTest.testSelectAll
FAILED: org.apache.cassandra.distributed.upgrade.MixedModeReadTest.mixedModeReadColumnSubsetDigestCheck
FAILED: org.apache.cassandra.cql3.ViewFilteringSimplePKTest.terminated successfully
-------------------------------------------------------------------------------
For complete test report and logs see https://nightlies.apache.org/cassandra/Cassandra-4.1/668/