You are viewing a plain text version of this content. The canonical link for it is here.
Posted to dev@pdfbox.apache.org by Apache Jenkins Server <je...@builds.apache.org> on 2013/01/05 08:08:41 UTC
Build failed in Jenkins: PDFBox-trunk #583
See <https://builds.apache.org/job/PDFBox-trunk/583/changes>
Changes:
[gbailleul] PDFBOX-1477 : applyed patch PDFBOX1477.patch
------------------------------------------
[...truncated 2148 lines...]
Writing: target/test-output/FANTASTICCMYK.ai-1.png
Writing: target/test-output/FANTASTICCMYK.ai-1.jpg
Writing: target/test-output/FANTASTICCMYK.ai-1.bmp
Writing: target/test-output/FANTASTICCMYK.ai-1.wbmp
Writing: target/test-output/test-landscape2.pdf-1.png
Writing: target/test-output/test-landscape2.pdf-1.jpg
Writing: target/test-output/test-landscape2.pdf-1.bmp
Writing: target/test-output/test-landscape2.pdf-1.wbmp
Writing: target/test-output/HOTRODCMYK.ai-1.png
Writing: target/test-output/HOTRODCMYK.ai-1.jpg
Writing: target/test-output/HOTRODCMYK.ai-1.bmp
Writing: target/test-output/HOTRODCMYK.ai-1.wbmp
Writing: target/test-output/ARCHIVERGB.ai-1.png
Writing: target/test-output/ARCHIVERGB.ai-1.jpg
Writing: target/test-output/ARCHIVERGB.ai-1.bmp
Writing: target/test-output/ARCHIVERGB.ai-1.wbmp
Writing: target/test-output/survey.pdf-1.png
Writing: target/test-output/survey.pdf-1.jpg
Writing: target/test-output/survey.pdf-1.bmp
Writing: target/test-output/survey.pdf-1.wbmp
Writing: target/test-output/26101_Colors.ai-1.png
Writing: target/test-output/26101_Colors.ai-1.jpg
Writing: target/test-output/26101_Colors.ai-1.bmp
Writing: target/test-output/26101_Colors.ai-1.wbmp
Writing: target/test-output/tiger-as-form-xobject.pdf-1.png
Writing: target/test-output/tiger-as-form-xobject.pdf-1.jpg
Writing: target/test-output/tiger-as-form-xobject.pdf-1.bmp
Writing: target/test-output/tiger-as-form-xobject.pdf-1.wbmp
Tests run: 123, Failures: 0, Errors: 0, Skipped: 0, Time elapsed: 24.5 sec
Running org.apache.pdfbox.util.TestTextStripper
Tests run: 1, Failures: 0, Errors: 0, Skipped: 0, Time elapsed: 2.171 sec
Results :
Tests run: 124, Failures: 0, Errors: 0, Skipped: 0
mojoSucceeded org.apache.maven.plugins:maven-surefire-plugin:2.5(default-test)
[JENKINS] Recording test results
mojoStarted org.apache.felix:maven-bundle-plugin:2.3.7(default-bundle)
[INFO]
[INFO] --- maven-bundle-plugin:2.3.7:bundle (default-bundle) @ pdfbox ---
mojoSucceeded org.apache.felix:maven-bundle-plugin:2.3.7(default-bundle)
mojoStarted org.apache.maven.plugins:maven-site-plugin:3.0(attach-descriptor)
[INFO]
[INFO] --- maven-site-plugin:3.0:attach-descriptor (attach-descriptor) @ pdfbox ---
mojoSucceeded org.apache.maven.plugins:maven-site-plugin:3.0(attach-descriptor)
mojoStarted org.apache.rat:apache-rat-plugin:0.6(default)[INFO] Exclude: src/main/resources/org/apache/pdfbox/resources/cmap/*
[INFO] Exclude: src/test/resources/input/rendering/*.ai
[INFO] Exclude: download/glyphlist.txt
[INFO] Exclude: release.properties
[INFO]
[INFO] --- apache-rat-plugin:0.6:check (default) @ pdfbox ---
mojoSucceeded org.apache.rat:apache-rat-plugin:0.6(default)
mojoStarted org.apache.maven.plugins:maven-install-plugin:2.3.1(default-install)[INFO] Installing <https://builds.apache.org/job/PDFBox-trunk/ws/trunk/pdfbox/target/pdfbox-1.8.0-SNAPSHOT.jar> to /home/jenkins/jenkins-slave/maven-repositories/0/org/apache/pdfbox/pdfbox/1.8.0-SNAPSHOT/pdfbox-1.8.0-SNAPSHOT.jar
[INFO]
[INFO] --- maven-install-plugin:2.3.1:install (default-install) @ pdfbox ---
[INFO] Installing <https://builds.apache.org/job/PDFBox-trunk/ws/trunk/pdfbox/pom.xml> to /home/jenkins/jenkins-slave/maven-repositories/0/org/apache/pdfbox/pdfbox/1.8.0-SNAPSHOT/pdfbox-1.8.0-SNAPSHOT.pom
mojoSucceeded org.apache.maven.plugins:maven-install-plugin:2.3.1(default-install)
mojoStarted org.apache.felix:maven-bundle-plugin:2.3.7(default-install)
[INFO]
[INFO] --- maven-bundle-plugin:2.3.7:install (default-install) @ pdfbox ---
[INFO] Installing org/apache/pdfbox/pdfbox/1.8.0-SNAPSHOT/pdfbox-1.8.0-SNAPSHOT.jar
[INFO] Writing OBR metadata
mojoSucceeded org.apache.felix:maven-bundle-plugin:2.3.7(default-install)
mojoStarted org.apache.maven.plugins:maven-deploy-plugin:2.6(default-deploy)
[INFO] Downloading: https://repository.apache.org/content/repositories/snapshots/org/apache/pdfbox/pdfbox/1.8.0-SNAPSHOT/maven-metadata.xml
[INFO] --- maven-deploy-plugin:2.6:deploy (default-deploy) @ pdfbox ---
Downloaded: https://repository.apache.org/content/repositories/snapshots/org/apache/pdfbox/pdfbox/1.8.0-SNAPSHOT/maven-metadata.xml (776 B at 5.6 KB/sec)
Uploading: https://repository.apache.org/content/repositories/snapshots/org/apache/pdfbox/pdfbox/1.8.0-SNAPSHOT/pdfbox-1.8.0-20130105.070830-84.jar
Uploaded: https://repository.apache.org/content/repositories/snapshots/org/apache/pdfbox/pdfbox/1.8.0-SNAPSHOT/pdfbox-1.8.0-20130105.070830-84.jar (3826 KB at 11024.7 KB/sec)
Uploading: https://repository.apache.org/content/repositories/snapshots/org/apache/pdfbox/pdfbox/1.8.0-SNAPSHOT/pdfbox-1.8.0-20130105.070830-84.pom
Uploaded: https://repository.apache.org/content/repositories/snapshots/org/apache/pdfbox/pdfbox/1.8.0-SNAPSHOT/pdfbox-1.8.0-20130105.070830-84.pom (6 KB at 104.1 KB/sec)
Downloading: https://repository.apache.org/content/repositories/snapshots/org/apache/pdfbox/pdfbox/maven-metadata.xml
Downloaded: https://repository.apache.org/content/repositories/snapshots/org/apache/pdfbox/pdfbox/maven-metadata.xml (501 B at 1.1 KB/sec)
Uploading: https://repository.apache.org/content/repositories/snapshots/org/apache/pdfbox/pdfbox/1.8.0-SNAPSHOT/maven-metadata.xml
Uploaded: https://repository.apache.org/content/repositories/snapshots/org/apache/pdfbox/pdfbox/1.8.0-SNAPSHOT/maven-metadata.xml (776 B at 9.7 KB/sec)
Uploading: https://repository.apache.org/content/repositories/snapshots/org/apache/pdfbox/pdfbox/maven-metadata.xml
Uploaded: https://repository.apache.org/content/repositories/snapshots/org/apache/pdfbox/pdfbox/maven-metadata.xml (501 B at 1.4 KB/sec)
mojoSucceeded org.apache.maven.plugins:maven-deploy-plugin:2.6(default-deploy)
mojoStarted org.apache.felix:maven-bundle-plugin:2.3.7(default-deploy)[INFO] Remote OBR update disabled (enable with -DremoteOBR)
[INFO]
[INFO] --- maven-bundle-plugin:2.3.7:deploy (default-deploy) @ pdfbox ---
mojoSucceeded org.apache.felix:maven-bundle-plugin:2.3.7(default-deploy)
projectSucceeded org.apache.pdfbox:pdfbox:1.8.0-SNAPSHOT
projectStarted org.apache.pdfbox:preflight:1.8.0-SNAPSHOT
[INFO]
[INFO] ------------------------------------------------------------------------
[INFO] Building Apache Preflight 1.8.0-SNAPSHOT
[INFO] ------------------------------------------------------------------------
mojoStarted org.apache.maven.plugins:maven-clean-plugin:2.4.1(default-clean)
[INFO]
[INFO] --- maven-clean-plugin:2.4.1:clean (default-clean) @ preflight ---
mojoSucceeded org.apache.maven.plugins:maven-clean-plugin:2.4.1(default-clean)
mojoStarted org.codehaus.mojo:cobertura-maven-plugin:2.3(default)
[INFO]
[INFO] --- cobertura-maven-plugin:2.3:clean (default) @ preflight ---
mojoSucceeded org.codehaus.mojo:cobertura-maven-plugin:2.3(default)
mojoStarted org.codehaus.mojo:javacc-maven-plugin:2.6(javacc)
[INFO]
[INFO] --- javacc-maven-plugin:2.6:javacc (javacc) @ preflight ---
Java Compiler Compiler Version 5.0 (Parser Generator)
(type "javacc" with no arguments for help)
Reading from file <https://builds.apache.org/job/PDFBox-trunk/ws/trunk/preflight/src/main/javacc/pdf_extractor.jj> . . .
File "TokenMgrError.java" does not exist. Will create one.
File "ParseException.java" does not exist. Will create one.
File "Token.java" does not exist. Will create one.
File "SimpleCharStream.java" does not exist. Will create one.
Parser generated successfully.
Java Compiler Compiler Version 5.0 (Parser Generator)
(type "javacc" with no arguments for help)
Reading from file <https://builds.apache.org/job/PDFBox-trunk/ws/trunk/preflight/src/main/javacc/pdf_full_grammar.jj> . . .
Warning: Line 172, Column 3: Non-ASCII characters used in regular expression.
Please make sure you use the correct Reader when you create the parser, one that can handle your character set.
File "TokenMgrError.java" does not exist. Will create one.
File "ParseException.java" does not exist. Will create one.
File "Token.java" does not exist. Will create one.
File "SimpleCharStream.java" does not exist. Will create one.
Parser generated with 0 errors and 1 warnings.
[INFO] Processed 2 grammars
mojoSucceeded org.codehaus.mojo:javacc-maven-plugin:2.6(javacc)
mojoStarted org.apache.maven.plugins:maven-remote-resources-plugin:1.2.1(default)
[INFO]
[INFO] --- maven-remote-resources-plugin:1.2.1:process (default) @ preflight ---
mojoSucceeded org.apache.maven.plugins:maven-remote-resources-plugin:1.2.1(default)
[debug] execute contextualize
mojoStarted org.apache.maven.plugins:maven-resources-plugin:2.5(default-resources)[INFO] Using 'ISO-8859-1' encoding to copy filtered resources.
[INFO] Copying 0 resource
[INFO] Copying 3 resources
[INFO]
[INFO] --- maven-resources-plugin:2.5:resources (default-resources) @ preflight ---
mojoSucceeded org.apache.maven.plugins:maven-resources-plugin:2.5(default-resources)
mojoStarted org.apache.maven.plugins:maven-compiler-plugin:2.3.2(default-compile)
[INFO]
[INFO] --- maven-compiler-plugin:2.3.2:compile (default-compile) @ preflight ---
[INFO] Compiling 133 source files to <https://builds.apache.org/job/PDFBox-trunk/ws/trunk/preflight/target/classes>
[INFO] -------------------------------------------------------------
[ERROR] COMPILATION ERROR :
[INFO] -------------------------------------------------------------
[ERROR] <https://builds.apache.org/job/PDFBox-trunk/ws/trunk/preflight/src/main/java/org/apache/pdfbox/preflight/parser/PreflightParser.java>:[265,61] cannot find symbol
symbol : method getBytes(java.nio.charset.Charset)
location: class java.lang.String
[INFO] 1 error
[INFO] -------------------------------------------------------------
mojoFailed org.apache.maven.plugins:maven-compiler-plugin:2.3.2(default-compile)
projectFailed org.apache.pdfbox:preflight:1.8.0-SNAPSHOT
sessionEnded
[INFO] ------------------------------------------------------------------------
[INFO] Reactor Summary:
[INFO]
[INFO] PDFBox parent ..................................... SUCCESS [7.581s]
[INFO] Apache FontBox .................................... SUCCESS [8.203s]
[INFO] Apache JempBox .................................... SUCCESS [4.586s]
[INFO] Apache XmpBox ..................................... SUCCESS [7.208s]
[INFO] Apache PDFBox ..................................... SUCCESS [38.609s]
[INFO] Apache Preflight .................................. FAILURE [2.752s]
[INFO] Apache PDFBox for Lucene .......................... SKIPPED
[INFO] Apache PDFBox for Ant ............................. SKIPPED
[INFO] Apache PDFBox webapp .............................. SKIPPED
[INFO] Apache PDFBox application ......................... SKIPPED
[INFO] Apache PDFBox examples ............................ SKIPPED
[INFO] PDFBox reactor .................................... SKIPPED
[INFO] ------------------------------------------------------------------------
[INFO] BUILD FAILURE
[INFO] ------------------------------------------------------------------------
[INFO] Total time: 1:10.759s
[INFO] Finished at: Sat Jan 05 07:08:34 GMT 2013
[INFO] Final Memory: 45M/431M
[INFO] ------------------------------------------------------------------------
Projects to build: [MavenProject: org.apache.pdfbox:pdfbox-parent:1.8.0-SNAPSHOT @ <https://builds.apache.org/job/PDFBox-trunk/ws/trunk/parent/pom.xml,> MavenProject: org.apache.pdfbox:fontbox:1.8.0-SNAPSHOT @ <https://builds.apache.org/job/PDFBox-trunk/ws/trunk/fontbox/pom.xml,> MavenProject: org.apache.pdfbox:jempbox:1.8.0-SNAPSHOT @ <https://builds.apache.org/job/PDFBox-trunk/ws/trunk/jempbox/pom.xml,> MavenProject: org.apache.pdfbox:xmpbox:1.8.0-SNAPSHOT @ <https://builds.apache.org/job/PDFBox-trunk/ws/trunk/xmpbox/pom.xml,> MavenProject: org.apache.pdfbox:pdfbox:1.8.0-SNAPSHOT @ <https://builds.apache.org/job/PDFBox-trunk/ws/trunk/pdfbox/pom.xml,> MavenProject: org.apache.pdfbox:preflight:1.8.0-SNAPSHOT @ <https://builds.apache.org/job/PDFBox-trunk/ws/trunk/preflight/pom.xml,> MavenProject: org.apache.pdfbox:pdfbox-lucene:1.8.0-SNAPSHOT @ <https://builds.apache.org/job/PDFBox-trunk/ws/trunk/lucene/pom.xml,> MavenProject: org.apache.pdfbox:pdfbox-ant:1.8.0-SNAPSHOT @ <https://builds.apache.org/job/PDFBox-trunk/ws/trunk/ant/pom.xml,> MavenProject: org.apache.pdfbox:pdfbox-war:1.8.0-SNAPSHOT @ <https://builds.apache.org/job/PDFBox-trunk/ws/trunk/war/pom.xml,> MavenProject: org.apache.pdfbox:pdfbox-app:1.8.0-SNAPSHOT @ <https://builds.apache.org/job/PDFBox-trunk/ws/trunk/app/pom.xml,> MavenProject: org.apache.pdfbox:pdfbox-examples:1.8.0-SNAPSHOT @ <https://builds.apache.org/job/PDFBox-trunk/ws/trunk/examples/pom.xml,> MavenProject: org.apache.pdfbox:pdfbox-reactor:1.8.0-SNAPSHOT @ <https://builds.apache.org/job/PDFBox-trunk/ws/trunk/pom.xml]>
[JENKINS] Archiving <https://builds.apache.org/job/PDFBox-trunk/ws/trunk/preflight/pom.xml> to /home/hudson/hudson/jobs/PDFBox-trunk/modules/org.apache.pdfbox$preflight/builds/2013-01-05_07-07-19/archive/org.apache.pdfbox/preflight/1.8.0-SNAPSHOT/preflight-1.8.0-SNAPSHOT.pom
[JENKINS] Archiving <https://builds.apache.org/job/PDFBox-trunk/ws/trunk/pom.xml> to /home/hudson/hudson/jobs/PDFBox-trunk/modules/org.apache.pdfbox$pdfbox-reactor/builds/2013-01-05_07-07-19/archive/org.apache.pdfbox/pdfbox-reactor/1.8.0-SNAPSHOT/pdfbox-reactor-1.8.0-SNAPSHOT.pom
[JENKINS] Archiving <https://builds.apache.org/job/PDFBox-trunk/ws/trunk/lucene/pom.xml> to /home/hudson/hudson/jobs/PDFBox-trunk/modules/org.apache.pdfbox$pdfbox-lucene/builds/2013-01-05_07-07-19/archive/org.apache.pdfbox/pdfbox-lucene/1.8.0-SNAPSHOT/pdfbox-lucene-1.8.0-SNAPSHOT.pom
[JENKINS] Archiving <https://builds.apache.org/job/PDFBox-trunk/ws/trunk/examples/pom.xml> to /home/hudson/hudson/jobs/PDFBox-trunk/modules/org.apache.pdfbox$pdfbox-examples/builds/2013-01-05_07-07-19/archive/org.apache.pdfbox/pdfbox-examples/1.8.0-SNAPSHOT/pdfbox-examples-1.8.0-SNAPSHOT.pom
[JENKINS] Archiving <https://builds.apache.org/job/PDFBox-trunk/ws/trunk/pdfbox/pom.xml> to /home/hudson/hudson/jobs/PDFBox-trunk/modules/org.apache.pdfbox$pdfbox/builds/2013-01-05_07-07-19/archive/org.apache.pdfbox/pdfbox/1.8.0-SNAPSHOT/pdfbox-1.8.0-SNAPSHOT.pom
[JENKINS] Archiving <https://builds.apache.org/job/PDFBox-trunk/ws/trunk/pdfbox/target/pdfbox-1.8.0-SNAPSHOT.jar> to /home/hudson/hudson/jobs/PDFBox-trunk/modules/org.apache.pdfbox$pdfbox/builds/2013-01-05_07-07-19/archive/org.apache.pdfbox/pdfbox/1.8.0-20130105.070830-84/pdfbox-1.8.0-20130105.070830-84.jar
[JENKINS] Archiving <https://builds.apache.org/job/PDFBox-trunk/ws/trunk/parent/pom.xml> to /home/hudson/hudson/jobs/PDFBox-trunk/modules/org.apache.pdfbox$pdfbox-parent/builds/2013-01-05_07-07-19/archive/org.apache.pdfbox/pdfbox-parent/1.8.0-SNAPSHOT/pdfbox-parent-1.8.0-SNAPSHOT.pom
[JENKINS] Archiving <https://builds.apache.org/job/PDFBox-trunk/ws/trunk/app/pom.xml> to /home/hudson/hudson/jobs/PDFBox-trunk/modules/org.apache.pdfbox$pdfbox-app/builds/2013-01-05_07-07-19/archive/org.apache.pdfbox/pdfbox-app/1.8.0-SNAPSHOT/pdfbox-app-1.8.0-SNAPSHOT.pom
[JENKINS] Archiving <https://builds.apache.org/job/PDFBox-trunk/ws/trunk/war/pom.xml> to /home/hudson/hudson/jobs/PDFBox-trunk/modules/org.apache.pdfbox$pdfbox-war/builds/2013-01-05_07-07-19/archive/org.apache.pdfbox/pdfbox-war/1.8.0-SNAPSHOT/pdfbox-war-1.8.0-SNAPSHOT.pom
[JENKINS] Archiving <https://builds.apache.org/job/PDFBox-trunk/ws/trunk/ant/pom.xml> to /home/hudson/hudson/jobs/PDFBox-trunk/modules/org.apache.pdfbox$pdfbox-ant/builds/2013-01-05_07-07-19/archive/org.apache.pdfbox/pdfbox-ant/1.8.0-SNAPSHOT/pdfbox-ant-1.8.0-SNAPSHOT.pom
[JENKINS] Archiving <https://builds.apache.org/job/PDFBox-trunk/ws/trunk/fontbox/pom.xml> to /home/hudson/hudson/jobs/PDFBox-trunk/modules/org.apache.pdfbox$fontbox/builds/2013-01-05_07-07-19/archive/org.apache.pdfbox/fontbox/1.8.0-SNAPSHOT/fontbox-1.8.0-SNAPSHOT.pom
[JENKINS] Archiving <https://builds.apache.org/job/PDFBox-trunk/ws/trunk/fontbox/target/fontbox-1.8.0-SNAPSHOT.jar> to /home/hudson/hudson/jobs/PDFBox-trunk/modules/org.apache.pdfbox$fontbox/builds/2013-01-05_07-07-19/archive/org.apache.pdfbox/fontbox/1.8.0-20130105.070740-87/fontbox-1.8.0-20130105.070740-87.jar
[JENKINS] Archiving <https://builds.apache.org/job/PDFBox-trunk/ws/trunk/jempbox/pom.xml> to /home/hudson/hudson/jobs/PDFBox-trunk/modules/org.apache.pdfbox$jempbox/builds/2013-01-05_07-07-19/archive/org.apache.pdfbox/jempbox/1.8.0-SNAPSHOT/jempbox-1.8.0-SNAPSHOT.pom
[JENKINS] Archiving <https://builds.apache.org/job/PDFBox-trunk/ws/trunk/jempbox/target/jempbox-1.8.0-SNAPSHOT.jar> to /home/hudson/hudson/jobs/PDFBox-trunk/modules/org.apache.pdfbox$jempbox/builds/2013-01-05_07-07-19/archive/org.apache.pdfbox/jempbox/1.8.0-20130105.070745-86/jempbox-1.8.0-20130105.070745-86.jar
[JENKINS] Archiving <https://builds.apache.org/job/PDFBox-trunk/ws/trunk/xmpbox/pom.xml> to /home/hudson/hudson/jobs/PDFBox-trunk/modules/org.apache.pdfbox$xmpbox/builds/2013-01-05_07-07-19/archive/org.apache.pdfbox/xmpbox/1.8.0-SNAPSHOT/xmpbox-1.8.0-SNAPSHOT.pom
[JENKINS] Archiving <https://builds.apache.org/job/PDFBox-trunk/ws/trunk/xmpbox/target/xmpbox-1.8.0-SNAPSHOT.jar> to /home/hudson/hudson/jobs/PDFBox-trunk/modules/org.apache.pdfbox$xmpbox/builds/2013-01-05_07-07-19/archive/org.apache.pdfbox/xmpbox/1.8.0-20130105.070752-80/xmpbox-1.8.0-20130105.070752-80.jar
Waiting for Jenkins to finish collecting data
mavenExecutionResult exceptions not empty
message : Failed to execute goal org.apache.maven.plugins:maven-compiler-plugin:2.3.2:compile (default-compile) on project preflight: Compilation failure
<https://builds.apache.org/job/PDFBox-trunk/ws/trunk/preflight/src/main/java/org/apache/pdfbox/preflight/parser/PreflightParser.java>:[265,61] cannot find symbol
symbol : method getBytes(java.nio.charset.Charset)
location: class java.lang.String
cause : Compilation failure
<https://builds.apache.org/job/PDFBox-trunk/ws/trunk/preflight/src/main/java/org/apache/pdfbox/preflight/parser/PreflightParser.java>:[265,61] cannot find symbol
symbol : method getBytes(java.nio.charset.Charset)
location: class java.lang.String
Stack trace :
org.apache.maven.lifecycle.LifecycleExecutionException: Failed to execute goal org.apache.maven.plugins:maven-compiler-plugin:2.3.2:compile (default-compile) on project preflight: Compilation failure
<https://builds.apache.org/job/PDFBox-trunk/ws/trunk/preflight/src/main/java/org/apache/pdfbox/preflight/parser/PreflightParser.java>:[265,61] cannot find symbol
symbol : method getBytes(java.nio.charset.Charset)
location: class java.lang.String
at org.apache.maven.lifecycle.internal.MojoExecutor.execute(MojoExecutor.java:213)
at org.apache.maven.lifecycle.internal.MojoExecutor.execute(MojoExecutor.java:153)
at org.apache.maven.lifecycle.internal.MojoExecutor.execute(MojoExecutor.java:145)
at org.apache.maven.lifecycle.internal.LifecycleModuleBuilder.buildProject(LifecycleModuleBuilder.java:84)
at org.apache.maven.lifecycle.internal.LifecycleModuleBuilder.buildProject(LifecycleModuleBuilder.java:59)
at org.apache.maven.lifecycle.internal.LifecycleStarter.singleThreadedBuild(LifecycleStarter.java:183)
at org.apache.maven.lifecycle.internal.LifecycleStarter.execute(LifecycleStarter.java:161)
at org.apache.maven.DefaultMaven.doExecute(DefaultMaven.java:320)
at org.apache.maven.DefaultMaven.execute(DefaultMaven.java:156)
at org.jvnet.hudson.maven3.launcher.Maven3Launcher.main(Maven3Launcher.java:79)
at sun.reflect.NativeMethodAccessorImpl.invoke0(Native Method)
at sun.reflect.NativeMethodAccessorImpl.invoke(NativeMethodAccessorImpl.java:39)
at sun.reflect.DelegatingMethodAccessorImpl.invoke(DelegatingMethodAccessorImpl.java:25)
at java.lang.reflect.Method.invoke(Method.java:592)
at org.codehaus.plexus.classworlds.launcher.Launcher.launchStandard(Launcher.java:329)
at org.codehaus.plexus.classworlds.launcher.Launcher.launch(Launcher.java:239)
at org.jvnet.hudson.maven3.agent.Maven3Main.launch(Maven3Main.java:158)
at hudson.maven.Maven3Builder.call(Maven3Builder.java:100)
at hudson.maven.Maven3Builder.call(Maven3Builder.java:66)
at hudson.remoting.UserRequest.perform(UserRequest.java:118)
at hudson.remoting.UserRequest.perform(UserRequest.java:48)
at hudson.remoting.Request$2.run(Request.java:326)
at hudson.remoting.InterceptingExecutorService$1.call(InterceptingExecutorService.java:72)
at java.util.concurrent.FutureTask$Sync.innerRun(FutureTask.java:269)
at java.util.concurrent.FutureTask.run(FutureTask.java:123)
at java.util.concurrent.ThreadPoolExecutor$Worker.runTask(ThreadPoolExecutor.java:651)
at java.util.concurrent.ThreadPoolExecutor$Worker.run(ThreadPoolExecutor.java:676)
at java.lang.Thread.run(Thread.java:595)
Caused by: org.apache.maven.plugin.CompilationFailureException: Compilation failure
<https://builds.apache.org/job/PDFBox-trunk/ws/trunk/preflight/src/main/java/org/apache/pdfbox/preflight/parser/PreflightParser.java>:[265,61] cannot find symbol
symbol : method getBytes(java.nio.charset.Charset)
location: class java.lang.String
at org.apache.maven.plugin.AbstractCompilerMojo.execute(AbstractCompilerMojo.java:656)
at org.apache.maven.plugin.CompilerMojo.execute(CompilerMojo.java:128)
at org.apache.maven.plugin.DefaultBuildPluginManager.executeMojo(DefaultBuildPluginManager.java:101)
at org.apache.maven.lifecycle.internal.MojoExecutor.execute(MojoExecutor.java:209)
... 27 more
Sending e-mails to: dev@pdfbox.apache.org
channel stopped
Archiving artifacts
Jenkins build is back to normal : PDFBox-trunk #586
Posted by Apache Jenkins Server <je...@builds.apache.org>.
See <https://builds.apache.org/job/PDFBox-trunk/586/changes>
Build failed in Jenkins: PDFBox-trunk #585
Posted by Apache Jenkins Server <je...@builds.apache.org>.
See <https://builds.apache.org/job/PDFBox-trunk/585/>
------------------------------------------
Started by user lehmi
Building remotely on solaris1 in workspace <https://builds.apache.org/job/PDFBox-trunk/ws/>
Updating http://svn.apache.org/repos/asf/pdfbox/trunk
At revision 1429451
no change for http://svn.apache.org/repos/asf/pdfbox/trunk since the previous build
Parsing POMs
[trunk] $ /home/hudson/tools/java/latest1.5/bin/java -cp /export/home/hudson/hudson-slave/maven3-agent.jar:/home/hudson/tools/maven/latest3/boot/plexus-classworlds-2.4.jar org.jvnet.hudson.maven3.agent.Maven3Main /home/hudson/tools/maven/latest3/ /zonestorage/hudson_solaris/home/hudson/hudson-slave/slave.jar /export/home/hudson/hudson-slave/maven3-interceptor.jar 57089
<===[JENchannel started
KINS REMOTING CAPACITY]===> log4j:WARN No appenders could be found for logger (org.apache.commons.beanutils.converters.BooleanConverter).
log4j:WARN Please initialize the log4j system properly.
Executing Maven: -B -f <https://builds.apache.org/job/PDFBox-trunk/ws/trunk/pom.xml> -Dmaven.repo.local=/export/home/hudson/hudson-slave/maven-repositories/1 clean deploy -Ppedantic
[INFO] Scanning for projects...
[INFO] ------------------------------------------------------------------------
[INFO] Reactor Build Order:
[INFO]
[INFO] PDFBox parent
[INFO] Apache FontBox
[INFO] Apache JempBox
[INFO] Apache XmpBox
[INFO] Apache PDFBox
[INFO] Apache Preflight
[INFO] Apache PDFBox for Lucene
[INFO] Apache PDFBox for Ant
[INFO] Apache PDFBox webapp
[INFO] Apache PDFBox application
[INFO] Apache PDFBox examples
[INFO] PDFBox reactor
Projects to build: [MavenProject: org.apache.pdfbox:pdfbox-parent:1.8.0-SNAPSHOT @ <https://builds.apache.org/job/PDFBox-trunk/ws/trunk/parent/pom.xml,> MavenProject: org.apache.pdfbox:fontbox:1.8.0-SNAPSHOT @ <https://builds.apache.org/job/PDFBox-trunk/ws/trunk/fontbox/pom.xml,> MavenProject: org.apache.pdfbox:jempbox:1.8.0-SNAPSHOT @ <https://builds.apache.org/job/PDFBox-trunk/ws/trunk/jempbox/pom.xml,> MavenProject: org.apache.pdfbox:xmpbox:1.8.0-SNAPSHOT @ <https://builds.apache.org/job/PDFBox-trunk/ws/trunk/xmpbox/pom.xml,> MavenProject: org.apache.pdfbox:pdfbox:1.8.0-SNAPSHOT @ <https://builds.apache.org/job/PDFBox-trunk/ws/trunk/pdfbox/pom.xml,> MavenProject: org.apache.pdfbox:preflight:1.8.0-SNAPSHOT @ <https://builds.apache.org/job/PDFBox-trunk/ws/trunk/preflight/pom.xml,> MavenProject: org.apache.pdfbox:pdfbox-lucene:1.8.0-SNAPSHOT @ <https://builds.apache.org/job/PDFBox-trunk/ws/trunk/lucene/pom.xml,> MavenProject: org.apache.pdfbox:pdfbox-ant:1.8.0-SNAPSHOT @ <https://builds.apache.org/job/PDFBox-trunk/ws/trunk/ant/pom.xml,> MavenProject: org.apache.pdfbox:pdfbox-war:1.8.0-SNAPSHOT @ <https://builds.apache.org/job/PDFBox-trunk/ws/trunk/war/pom.xml,> MavenProject: org.apache.pdfbox:pdfbox-app:1.8.0-SNAPSHOT @ <https://builds.apache.org/job/PDFBox-trunk/ws/trunk/app/pom.xml,> MavenProject: org.apache.pdfbox:pdfbox-examples:1.8.0-SNAPSHOT @ <https://builds.apache.org/job/PDFBox-trunk/ws/trunk/examples/pom.xml,> MavenProject: org.apache.pdfbox:pdfbox-reactor:1.8.0-SNAPSHOT @ <https://builds.apache.org/job/PDFBox-trunk/ws/trunk/pom.xml]>
projectStarted org.apache.pdfbox:pdfbox-parent:1.8.0-SNAPSHOT
[INFO]
[INFO] ------------------------------------------------------------------------
[INFO] Building PDFBox parent 1.8.0-SNAPSHOT
[INFO] ------------------------------------------------------------------------
mojoStarted org.apache.maven.plugins:maven-clean-plugin:2.4.1(default-clean)
[INFO]
[INFO] --- maven-clean-plugin:2.4.1:clean (default-clean) @ pdfbox-parent ---
[INFO] Deleting <https://builds.apache.org/job/PDFBox-trunk/ws/trunk/parent/target>
mojoSucceeded org.apache.maven.plugins:maven-clean-plugin:2.4.1(default-clean)
mojoStarted org.apache.maven.plugins:maven-remote-resources-plugin:1.2.1(default)
[INFO]
[INFO] --- maven-remote-resources-plugin:1.2.1:process (default) @ pdfbox-parent ---
mojoSucceeded org.apache.maven.plugins:maven-remote-resources-plugin:1.2.1(default)
mojoStarted org.apache.maven.plugins:maven-site-plugin:3.0(attach-descriptor)
[INFO]
[INFO] --- maven-site-plugin:3.0:attach-descriptor (attach-descriptor) @ pdfbox-parent ---
mojoSucceeded org.apache.maven.plugins:maven-site-plugin:3.0(attach-descriptor)
mojoStarted org.apache.rat:apache-rat-plugin:0.6(default)
[INFO]
[INFO] --- apache-rat-plugin:0.6:check (default) @ pdfbox-parent ---
[INFO] Exclude: release.properties
mojoSucceeded org.apache.rat:apache-rat-plugin:0.6(default)
mojoStarted org.apache.maven.plugins:maven-install-plugin:2.3.1(default-install)
[INFO]
[INFO] --- maven-install-plugin:2.3.1:install (default-install) @ pdfbox-parent ---
[INFO] Installing <https://builds.apache.org/job/PDFBox-trunk/ws/trunk/parent/pom.xml> to /export/home/hudson/hudson-slave/maven-repositories/1/org/apache/pdfbox/pdfbox-parent/1.8.0-SNAPSHOT/pdfbox-parent-1.8.0-SNAPSHOT.pom
mojoSucceeded org.apache.maven.plugins:maven-install-plugin:2.3.1(default-install)
mojoStarted org.apache.maven.plugins:maven-deploy-plugin:2.6(default-deploy)
[INFO]
[INFO] --- maven-deploy-plugin:2.6:deploy (default-deploy) @ pdfbox-parent ---
Downloading: https://repository.apache.org/content/repositories/snapshots/org/apache/pdfbox/pdfbox-parent/1.8.0-SNAPSHOT/maven-metadata.xml
Downloaded: https://repository.apache.org/content/repositories/snapshots/org/apache/pdfbox/pdfbox-parent/1.8.0-SNAPSHOT/maven-metadata.xml (609 B at 0.2 KB/sec)
Uploading: https://repository.apache.org/content/repositories/snapshots/org/apache/pdfbox/pdfbox-parent/1.8.0-SNAPSHOT/pdfbox-parent-1.8.0-20130106.012534-89.pom
Uploaded: https://repository.apache.org/content/repositories/snapshots/org/apache/pdfbox/pdfbox-parent/1.8.0-SNAPSHOT/pdfbox-parent-1.8.0-20130106.012534-89.pom (8 KB at 3.7 KB/sec)
mojoSucceeded org.apache.maven.plugins:maven-deploy-plugin:2.6(default-deploy)Downloading: https://repository.apache.org/content/repositories/snapshots/org/apache/pdfbox/pdfbox-parent/maven-metadata.xml
Downloaded: https://repository.apache.org/content/repositories/snapshots/org/apache/pdfbox/pdfbox-parent/maven-metadata.xml (430 B at 0.4 KB/sec)
Uploading: https://repository.apache.org/content/repositories/snapshots/org/apache/pdfbox/pdfbox-parent/1.8.0-SNAPSHOT/maven-metadata.xml
Uploaded: https://repository.apache.org/content/repositories/snapshots/org/apache/pdfbox/pdfbox-parent/1.8.0-SNAPSHOT/maven-metadata.xml (609 B at 0.5 KB/sec)
Uploading: https://repository.apache.org/content/repositories/snapshots/org/apache/pdfbox/pdfbox-parent/maven-metadata.xml
Uploaded: https://repository.apache.org/content/repositories/snapshots/org/apache/pdfbox/pdfbox-parent/maven-metadata.xml (430 B at 0.3 KB/sec)
projectSucceeded org.apache.pdfbox:pdfbox-parent:1.8.0-SNAPSHOT
projectStarted org.apache.pdfbox:fontbox:1.8.0-SNAPSHOT
[INFO]
[INFO] ------------------------------------------------------------------------
[INFO] Building Apache FontBox 1.8.0-SNAPSHOT
[INFO] ------------------------------------------------------------------------
mojoStarted org.apache.maven.plugins:maven-clean-plugin:2.4.1(default-clean)
[INFO]
[INFO] Deleting <https://builds.apache.org/job/PDFBox-trunk/ws/trunk/fontbox/target>
[INFO] --- maven-clean-plugin:2.4.1:clean (default-clean) @ fontbox ---
mojoSucceeded org.apache.maven.plugins:maven-clean-plugin:2.4.1(default-clean)
mojoStarted org.apache.maven.plugins:maven-remote-resources-plugin:1.2.1(default)
[INFO]
[INFO] --- maven-remote-resources-plugin:1.2.1:process (default) @ fontbox ---
mojoSucceeded org.apache.maven.plugins:maven-remote-resources-plugin:1.2.1(default)
mojoStarted org.apache.maven.plugins:maven-resources-plugin:2.5(default-resources)
[INFO]
[INFO] --- maven-resources-plugin:2.5:resources (default-resources) @ fontbox ---
[debug] execute contextualize
[INFO] Using 'ISO-8859-1' encoding to copy filtered resources.
[INFO] skip non existing resourceDirectory <https://builds.apache.org/job/PDFBox-trunk/ws/trunk/fontbox/src/main/resources>
[INFO] Copying 3 resources
mojoSucceeded org.apache.maven.plugins:maven-resources-plugin:2.5(default-resources)
mojoStarted org.apache.maven.plugins:maven-compiler-plugin:2.3.2(default-compile)
[INFO]
[INFO] --- maven-compiler-plugin:2.3.2:compile (default-compile) @ fontbox ---
[INFO] Compiling 73 source files to <https://builds.apache.org/job/PDFBox-trunk/ws/trunk/fontbox/target/classes>
mojoSucceeded org.apache.maven.plugins:maven-compiler-plugin:2.3.2(default-compile)
mojoStarted org.apache.maven.plugins:maven-resources-plugin:2.5(default-testResources)[debug] execute contextualize
[INFO] [INFO] Using 'ISO-8859-1' encoding to copy filtered resources.
[INFO] Copying 1 resource
[INFO] Copying 3 resources
[INFO] --- maven-resources-plugin:2.5:testResources (default-testResources) @ fontbox ---
mojoSucceeded org.apache.maven.plugins:maven-resources-plugin:2.5(default-testResources)
mojoStarted org.apache.maven.plugins:maven-compiler-plugin:2.3.2(default-testCompile)
[INFO]
[INFO] --- maven-compiler-plugin:2.3.2:testCompile (default-testCompile) @ fontbox ---
[INFO] Compiling 4 source files to <https://builds.apache.org/job/PDFBox-trunk/ws/trunk/fontbox/target/test-classes>
mojoSucceeded org.apache.maven.plugins:maven-compiler-plugin:2.3.2(default-testCompile)
mojoStarted org.apache.maven.plugins:maven-surefire-plugin:2.9(default-test)
[INFO]
[INFO] --- maven-surefire-plugin:2.9:test (default-test) @ fontbox ---
[INFO] Surefire report directory: <https://builds.apache.org/job/PDFBox-trunk/ws/trunk/fontbox/target/surefire-reports>
-------------------------------------------------------
T E S T S
-------------------------------------------------------
Results :
Tests run: 0, Failures: 0, Errors: 0, Skipped: 0
mojoFailed org.apache.maven.plugins:maven-surefire-plugin:2.9(default-test)
[JENKINS] Recording test results
projectFailed org.apache.pdfbox:fontbox:1.8.0-SNAPSHOT
sessionEnded
[INFO] ------------------------------------------------------------------------
[INFO] Reactor Summary:
[INFO]
[INFO] PDFBox parent ..................................... SUCCESS [3:16.333s]
[INFO] Apache FontBox .................................... FAILURE [56.573s]
[INFO] Apache JempBox .................................... SKIPPED
[INFO] Apache XmpBox ..................................... SKIPPED
[INFO] Apache PDFBox ..................................... SKIPPED
[INFO] Apache Preflight .................................. SKIPPED
[INFO] Apache PDFBox for Lucene .......................... SKIPPED
[INFO] Apache PDFBox for Ant ............................. SKIPPED
[INFO] Apache PDFBox webapp .............................. SKIPPED
[INFO] Apache PDFBox application ......................... SKIPPED
[INFO] Apache PDFBox examples ............................ SKIPPED
[INFO] PDFBox reactor .................................... SKIPPED
[INFO] ------------------------------------------------------------------------
[INFO] BUILD FAILURE
[INFO] ------------------------------------------------------------------------
[INFO] Total time: 4:51.478s
[INFO] Finished at: Sun Jan 06 01:26:45 GMT+00:00 2013
[INFO] Final Memory: 23M/136M
[INFO] ------------------------------------------------------------------------
Projects to build: [MavenProject: org.apache.pdfbox:pdfbox-parent:1.8.0-SNAPSHOT @ <https://builds.apache.org/job/PDFBox-trunk/ws/trunk/parent/pom.xml,> MavenProject: org.apache.pdfbox:fontbox:1.8.0-SNAPSHOT @ <https://builds.apache.org/job/PDFBox-trunk/ws/trunk/fontbox/pom.xml,> MavenProject: org.apache.pdfbox:jempbox:1.8.0-SNAPSHOT @ <https://builds.apache.org/job/PDFBox-trunk/ws/trunk/jempbox/pom.xml,> MavenProject: org.apache.pdfbox:xmpbox:1.8.0-SNAPSHOT @ <https://builds.apache.org/job/PDFBox-trunk/ws/trunk/xmpbox/pom.xml,> MavenProject: org.apache.pdfbox:pdfbox:1.8.0-SNAPSHOT @ <https://builds.apache.org/job/PDFBox-trunk/ws/trunk/pdfbox/pom.xml,> MavenProject: org.apache.pdfbox:preflight:1.8.0-SNAPSHOT @ <https://builds.apache.org/job/PDFBox-trunk/ws/trunk/preflight/pom.xml,> MavenProject: org.apache.pdfbox:pdfbox-lucene:1.8.0-SNAPSHOT @ <https://builds.apache.org/job/PDFBox-trunk/ws/trunk/lucene/pom.xml,> MavenProject: org.apache.pdfbox:pdfbox-ant:1.8.0-SNAPSHOT @ <https://builds.apache.org/job/PDFBox-trunk/ws/trunk/ant/pom.xml,> MavenProject: org.apache.pdfbox:pdfbox-war:1.8.0-SNAPSHOT @ <https://builds.apache.org/job/PDFBox-trunk/ws/trunk/war/pom.xml,> MavenProject: org.apache.pdfbox:pdfbox-app:1.8.0-SNAPSHOT @ <https://builds.apache.org/job/PDFBox-trunk/ws/trunk/app/pom.xml,> MavenProject: org.apache.pdfbox:pdfbox-examples:1.8.0-SNAPSHOT @ <https://builds.apache.org/job/PDFBox-trunk/ws/trunk/examples/pom.xml,> MavenProject: org.apache.pdfbox:pdfbox-reactor:1.8.0-SNAPSHOT @ <https://builds.apache.org/job/PDFBox-trunk/ws/trunk/pom.xml]>
[JENKINS] Archiving <https://builds.apache.org/job/PDFBox-trunk/ws/trunk/preflight/pom.xml> to /home/hudson/hudson/jobs/PDFBox-trunk/modules/org.apache.pdfbox$preflight/builds/2013-01-06_01-18-54/archive/org.apache.pdfbox/preflight/1.8.0-SNAPSHOT/preflight-1.8.0-SNAPSHOT.pom
[JENKINS] Archiving <https://builds.apache.org/job/PDFBox-trunk/ws/trunk/pom.xml> to /home/hudson/hudson/jobs/PDFBox-trunk/modules/org.apache.pdfbox$pdfbox-reactor/builds/2013-01-06_01-18-52/archive/org.apache.pdfbox/pdfbox-reactor/1.8.0-SNAPSHOT/pdfbox-reactor-1.8.0-SNAPSHOT.pom
[JENKINS] Archiving <https://builds.apache.org/job/PDFBox-trunk/ws/trunk/lucene/pom.xml> to /home/hudson/hudson/jobs/PDFBox-trunk/modules/org.apache.pdfbox$pdfbox-lucene/builds/2013-01-06_01-18-55/archive/org.apache.pdfbox/pdfbox-lucene/1.8.0-SNAPSHOT/pdfbox-lucene-1.8.0-SNAPSHOT.pom
[JENKINS] Archiving <https://builds.apache.org/job/PDFBox-trunk/ws/trunk/examples/pom.xml> to /home/hudson/hudson/jobs/PDFBox-trunk/modules/org.apache.pdfbox$pdfbox-examples/builds/2013-01-06_01-18-57/archive/org.apache.pdfbox/pdfbox-examples/1.8.0-SNAPSHOT/pdfbox-examples-1.8.0-SNAPSHOT.pom
[JENKINS] Archiving <https://builds.apache.org/job/PDFBox-trunk/ws/trunk/pdfbox/pom.xml> to /home/hudson/hudson/jobs/PDFBox-trunk/modules/org.apache.pdfbox$pdfbox/builds/2013-01-06_01-18-54/archive/org.apache.pdfbox/pdfbox/1.8.0-SNAPSHOT/pdfbox-1.8.0-SNAPSHOT.pom
[JENKINS] Archiving <https://builds.apache.org/job/PDFBox-trunk/ws/trunk/parent/pom.xml> to /home/hudson/hudson/jobs/PDFBox-trunk/modules/org.apache.pdfbox$pdfbox-parent/builds/2013-01-06_01-18-52/archive/org.apache.pdfbox/pdfbox-parent/1.8.0-SNAPSHOT/pdfbox-parent-1.8.0-SNAPSHOT.pom
[JENKINS] Archiving <https://builds.apache.org/job/PDFBox-trunk/ws/trunk/app/pom.xml> to /home/hudson/hudson/jobs/PDFBox-trunk/modules/org.apache.pdfbox$pdfbox-app/builds/2013-01-06_01-18-56/archive/org.apache.pdfbox/pdfbox-app/1.8.0-SNAPSHOT/pdfbox-app-1.8.0-SNAPSHOT.pom
[JENKINS] Archiving <https://builds.apache.org/job/PDFBox-trunk/ws/trunk/war/pom.xml> to /home/hudson/hudson/jobs/PDFBox-trunk/modules/org.apache.pdfbox$pdfbox-war/builds/2013-01-06_01-18-56/archive/org.apache.pdfbox/pdfbox-war/1.8.0-SNAPSHOT/pdfbox-war-1.8.0-SNAPSHOT.pom
[JENKINS] Archiving <https://builds.apache.org/job/PDFBox-trunk/ws/trunk/ant/pom.xml> to /home/hudson/hudson/jobs/PDFBox-trunk/modules/org.apache.pdfbox$pdfbox-ant/builds/2013-01-06_01-18-56/archive/org.apache.pdfbox/pdfbox-ant/1.8.0-SNAPSHOT/pdfbox-ant-1.8.0-SNAPSHOT.pom
[JENKINS] Archiving <https://builds.apache.org/job/PDFBox-trunk/ws/trunk/fontbox/pom.xml> to /home/hudson/hudson/jobs/PDFBox-trunk/modules/org.apache.pdfbox$fontbox/builds/2013-01-06_01-18-53/archive/org.apache.pdfbox/fontbox/1.8.0-SNAPSHOT/fontbox-1.8.0-SNAPSHOT.pom
[JENKINS] Archiving <https://builds.apache.org/job/PDFBox-trunk/ws/trunk/jempbox/pom.xml> to /home/hudson/hudson/jobs/PDFBox-trunk/modules/org.apache.pdfbox$jempbox/builds/2013-01-06_01-18-53/archive/org.apache.pdfbox/jempbox/1.8.0-SNAPSHOT/jempbox-1.8.0-SNAPSHOT.pom
[JENKINS] Archiving <https://builds.apache.org/job/PDFBox-trunk/ws/trunk/xmpbox/pom.xml> to /home/hudson/hudson/jobs/PDFBox-trunk/modules/org.apache.pdfbox$xmpbox/builds/2013-01-06_01-18-53/archive/org.apache.pdfbox/xmpbox/1.8.0-SNAPSHOT/xmpbox-1.8.0-SNAPSHOT.pom
Waiting for Jenkins to finish collecting data
mavenExecutionResult exceptions not empty
message : Failed to execute goal org.apache.maven.plugins:maven-surefire-plugin:2.9:test (default-test) on project fontbox: Error while executing forked tests.; nested exception is java.io.IOException: Not enough space
cause : Error while executing forked tests.; nested exception is java.io.IOException: Not enough space
Stack trace :
org.apache.maven.lifecycle.LifecycleExecutionException: Failed to execute goal org.apache.maven.plugins:maven-surefire-plugin:2.9:test (default-test) on project fontbox: Error while executing forked tests.; nested exception is java.io.IOException: Not enough space
at org.apache.maven.lifecycle.internal.MojoExecutor.execute(MojoExecutor.java:217)
at org.apache.maven.lifecycle.internal.MojoExecutor.execute(MojoExecutor.java:153)
at org.apache.maven.lifecycle.internal.MojoExecutor.execute(MojoExecutor.java:145)
at org.apache.maven.lifecycle.internal.LifecycleModuleBuilder.buildProject(LifecycleModuleBuilder.java:84)
at org.apache.maven.lifecycle.internal.LifecycleModuleBuilder.buildProject(LifecycleModuleBuilder.java:59)
at org.apache.maven.lifecycle.internal.LifecycleStarter.singleThreadedBuild(LifecycleStarter.java:183)
at org.apache.maven.lifecycle.internal.LifecycleStarter.execute(LifecycleStarter.java:161)
at org.apache.maven.DefaultMaven.doExecute(DefaultMaven.java:319)
at org.apache.maven.DefaultMaven.execute(DefaultMaven.java:156)
at org.jvnet.hudson.maven3.launcher.Maven3Launcher.main(Maven3Launcher.java:79)
at sun.reflect.NativeMethodAccessorImpl.invoke0(Native Method)
at sun.reflect.NativeMethodAccessorImpl.invoke(NativeMethodAccessorImpl.java:39)
at sun.reflect.DelegatingMethodAccessorImpl.invoke(DelegatingMethodAccessorImpl.java:25)
at java.lang.reflect.Method.invoke(Method.java:592)
at org.codehaus.plexus.classworlds.launcher.Launcher.launchStandard(Launcher.java:329)
at org.codehaus.plexus.classworlds.launcher.Launcher.launch(Launcher.java:239)
at org.jvnet.hudson.maven3.agent.Maven3Main.launch(Maven3Main.java:158)
at hudson.maven.Maven3Builder.call(Maven3Builder.java:100)
at hudson.maven.Maven3Builder.call(Maven3Builder.java:66)
at hudson.remoting.UserRequest.perform(UserRequest.java:118)
at hudson.remoting.UserRequest.perform(UserRequest.java:48)
at hudson.remoting.Request$2.run(Request.java:326)
at hudson.remoting.InterceptingExecutorService$1.call(InterceptingExecutorService.java:72)
at java.util.concurrent.FutureTask$Sync.innerRun(FutureTask.java:269)
at java.util.concurrent.FutureTask.run(FutureTask.java:123)
at java.util.concurrent.ThreadPoolExecutor$Worker.runTask(ThreadPoolExecutor.java:651)
at java.util.concurrent.ThreadPoolExecutor$Worker.run(ThreadPoolExecutor.java:676)
at java.lang.Thread.run(Thread.java:595)
Caused by: org.apache.maven.plugin.MojoExecutionException: Error while executing forked tests.; nested exception is java.io.IOException: Not enough space
at org.apache.maven.plugin.surefire.SurefirePlugin.assertNoException(SurefirePlugin.java:614)
at org.apache.maven.plugin.surefire.SurefirePlugin.handleSummary(SurefirePlugin.java:603)
at org.apache.maven.plugin.surefire.AbstractSurefireMojo.executeAfterPreconditionsChecked(AbstractSurefireMojo.java:136)
at org.apache.maven.plugin.surefire.AbstractSurefireMojo.execute(AbstractSurefireMojo.java:97)
at org.apache.maven.plugin.DefaultBuildPluginManager.executeMojo(DefaultBuildPluginManager.java:101)
at org.apache.maven.lifecycle.internal.MojoExecutor.execute(MojoExecutor.java:209)
... 27 more
Caused by: org.apache.maven.surefire.booter.SurefireBooterForkException: Error while executing forked tests.; nested exception is java.io.IOException: Not enough space
at org.apache.maven.plugin.surefire.booterclient.ForkStarter.fork(ForkStarter.java:206)
at org.apache.maven.plugin.surefire.booterclient.ForkStarter.run(ForkStarter.java:98)
at org.apache.maven.plugin.surefire.AbstractSurefireMojo.executeProvider(AbstractSurefireMojo.java:199)
at org.apache.maven.plugin.surefire.AbstractSurefireMojo.executeAllProviders(AbstractSurefireMojo.java:176)
at org.apache.maven.plugin.surefire.AbstractSurefireMojo.executeAfterPreconditionsChecked(AbstractSurefireMojo.java:134)
... 30 more
Caused by: java.io.IOException: Not enough space
at java.lang.UNIXProcess.forkAndExec(Native Method)
at java.lang.UNIXProcess.<init>(UNIXProcess.java:53)
at java.lang.ProcessImpl.start(ProcessImpl.java:65)
at java.lang.ProcessBuilder.start(ProcessBuilder.java:451)
at java.lang.Runtime.exec(Runtime.java:591)
at org.codehaus.plexus.util.cli.Commandline.execute(Commandline.java:651)
at org.codehaus.plexus.util.cli.CommandLineUtils.executeCommandLine(CommandLineUtils.java:119)
at org.codehaus.plexus.util.cli.CommandLineUtils.executeCommandLine(CommandLineUtils.java:88)
at org.apache.maven.plugin.surefire.booterclient.ForkStarter.fork(ForkStarter.java:191)
... 34 more
Sending e-mails to: dev@pdfbox.apache.org
channel stopped
Archiving artifacts
Build failed in Jenkins: PDFBox-trunk #584
Posted by Apache Jenkins Server <je...@builds.apache.org>.
See <https://builds.apache.org/job/PDFBox-trunk/584/changes>
Changes:
[gbailleul] PDFBOX-1477 : fix java 5 compatibility issue
------------------------------------------
Started by an SCM change
Building remotely on solaris1 in workspace <https://builds.apache.org/job/PDFBox-trunk/ws/>
Updating http://svn.apache.org/repos/asf/pdfbox/trunk
U preflight/src/main/java/org/apache/pdfbox/preflight/parser/PreflightParser.java
At revision 1429230
Parsing POMs
[trunk] $ /home/hudson/tools/java/latest1.5/bin/java -cp /export/home/hudson/hudson-slave/maven3-agent.jar:/home/hudson/tools/maven/latest3/boot/plexus-classworlds-2.4.jar org.jvnet.hudson.maven3.agent.Maven3Main /home/hudson/tools/maven/latest3/ /zonestorage/hudson_solaris/home/hudson/hudson-slave/slave.jar /export/home/hudson/hudson-slave/maven3-interceptor.jar 42160
<===[JENKINSchannel started
REMOTING CAPACITY]===> log4j:WARN No appenders could be found for logger (org.apache.commons.beanutils.converters.BooleanConverter).
log4j:WARN Please initialize the log4j system properly.
Executing Maven: -B -f <https://builds.apache.org/job/PDFBox-trunk/ws/trunk/pom.xml> -Dmaven.repo.local=/export/home/hudson/hudson-slave/maven-repositories/1 clean deploy -Ppedantic
[WARNING]
[WARNING] Some problems were encountered while building the effective settings
[WARNING] Failed to use environment variables for interpolation: Not enough space @
[WARNING]
[INFO] Scanning for projects...
[INFO] ------------------------------------------------------------------------
[INFO] Reactor Build Order:
[INFO]
[INFO] PDFBox parent
[INFO] Apache FontBox
[INFO] Apache JempBox
[INFO] Apache XmpBox
[INFO] Apache PDFBox
[INFO] Apache Preflight
[INFO] Apache PDFBox for Lucene
[INFO] Apache PDFBox for Ant
[INFO] Apache PDFBox webapp
[INFO] Apache PDFBox application
[INFO] Apache PDFBox examples
[INFO] PDFBox reactor
Projects to build: [MavenProject: org.apache.pdfbox:pdfbox-parent:1.8.0-SNAPSHOT @ <https://builds.apache.org/job/PDFBox-trunk/ws/trunk/parent/pom.xml,> MavenProject: org.apache.pdfbox:fontbox:1.8.0-SNAPSHOT @ <https://builds.apache.org/job/PDFBox-trunk/ws/trunk/fontbox/pom.xml,> MavenProject: org.apache.pdfbox:jempbox:1.8.0-SNAPSHOT @ <https://builds.apache.org/job/PDFBox-trunk/ws/trunk/jempbox/pom.xml,> MavenProject: org.apache.pdfbox:xmpbox:1.8.0-SNAPSHOT @ <https://builds.apache.org/job/PDFBox-trunk/ws/trunk/xmpbox/pom.xml,> MavenProject: org.apache.pdfbox:pdfbox:1.8.0-SNAPSHOT @ <https://builds.apache.org/job/PDFBox-trunk/ws/trunk/pdfbox/pom.xml,> MavenProject: org.apache.pdfbox:preflight:1.8.0-SNAPSHOT @ <https://builds.apache.org/job/PDFBox-trunk/ws/trunk/preflight/pom.xml,> MavenProject: org.apache.pdfbox:pdfbox-lucene:1.8.0-SNAPSHOT @ <https://builds.apache.org/job/PDFBox-trunk/ws/trunk/lucene/pom.xml,> MavenProject: org.apache.pdfbox:pdfbox-ant:1.8.0-SNAPSHOT @ <https://builds.apache.org/job/PDFBox-trunk/ws/trunk/ant/pom.xml,> MavenProject: org.apache.pdfbox:pdfbox-war:1.8.0-SNAPSHOT @ <https://builds.apache.org/job/PDFBox-trunk/ws/trunk/war/pom.xml,> MavenProject: org.apache.pdfbox:pdfbox-app:1.8.0-SNAPSHOT @ <https://builds.apache.org/job/PDFBox-trunk/ws/trunk/app/pom.xml,> MavenProject: org.apache.pdfbox:pdfbox-examples:1.8.0-SNAPSHOT @ <https://builds.apache.org/job/PDFBox-trunk/ws/trunk/examples/pom.xml,> MavenProject: org.apache.pdfbox:pdfbox-reactor:1.8.0-SNAPSHOT @ <https://builds.apache.org/job/PDFBox-trunk/ws/trunk/pom.xml]>
projectStarted org.apache.pdfbox:pdfbox-parent:1.8.0-SNAPSHOT
[INFO]
[INFO] ------------------------------------------------------------------------
[INFO] Building PDFBox parent 1.8.0-SNAPSHOT
[INFO] ------------------------------------------------------------------------
mojoStarted org.apache.maven.plugins:maven-clean-plugin:2.4.1(default-clean)
[INFO]
[INFO] --- maven-clean-plugin:2.4.1:clean (default-clean) @ pdfbox-parent ---
[INFO] Deleting <https://builds.apache.org/job/PDFBox-trunk/ws/trunk/parent/target>
mojoSucceeded org.apache.maven.plugins:maven-clean-plugin:2.4.1(default-clean)
mojoStarted org.apache.maven.plugins:maven-remote-resources-plugin:1.2.1(default)
[INFO]
[INFO] --- maven-remote-resources-plugin:1.2.1:process (default) @ pdfbox-parent ---
mojoSucceeded org.apache.maven.plugins:maven-remote-resources-plugin:1.2.1(default)
mojoStarted org.apache.maven.plugins:maven-site-plugin:3.0(attach-descriptor)
[INFO]
[INFO] --- maven-site-plugin:3.0:attach-descriptor (attach-descriptor) @ pdfbox-parent ---
mojoSucceeded org.apache.maven.plugins:maven-site-plugin:3.0(attach-descriptor)
mojoStarted org.apache.rat:apache-rat-plugin:0.6(default)
[INFO]
[INFO] --- apache-rat-plugin:0.6:check (default) @ pdfbox-parent ---
[INFO] Exclude: release.properties
mojoSucceeded org.apache.rat:apache-rat-plugin:0.6(default)
mojoStarted org.apache.maven.plugins:maven-install-plugin:2.3.1(default-install)
[INFO]
[INFO] --- maven-install-plugin:2.3.1:install (default-install) @ pdfbox-parent ---
[INFO] Installing <https://builds.apache.org/job/PDFBox-trunk/ws/trunk/parent/pom.xml> to /export/home/hudson/hudson-slave/maven-repositories/1/org/apache/pdfbox/pdfbox-parent/1.8.0-SNAPSHOT/pdfbox-parent-1.8.0-SNAPSHOT.pom
mojoSucceeded org.apache.maven.plugins:maven-install-plugin:2.3.1(default-install)
mojoStarted org.apache.maven.plugins:maven-deploy-plugin:2.6(default-deploy)
[INFO]
[INFO] --- maven-deploy-plugin:2.6:deploy (default-deploy) @ pdfbox-parent ---
Downloading: https://repository.apache.org/content/repositories/snapshots/org/apache/pdfbox/pdfbox-parent/1.8.0-SNAPSHOT/maven-metadata.xml
Downloaded: https://repository.apache.org/content/repositories/snapshots/org/apache/pdfbox/pdfbox-parent/1.8.0-SNAPSHOT/maven-metadata.xml (609 B at 0.1 KB/sec)
Uploading: https://repository.apache.org/content/repositories/snapshots/org/apache/pdfbox/pdfbox-parent/1.8.0-SNAPSHOT/pdfbox-parent-1.8.0-20130105.081851-88.pom
Uploaded: https://repository.apache.org/content/repositories/snapshots/org/apache/pdfbox/pdfbox-parent/1.8.0-SNAPSHOT/pdfbox-parent-1.8.0-20130105.081851-88.pom (8 KB at 2.0 KB/sec)
Downloading: https://repository.apache.org/content/repositories/snapshots/org/apache/pdfbox/pdfbox-parent/maven-metadata.xml
Downloaded: https://repository.apache.org/content/repositories/snapshots/org/apache/pdfbox/pdfbox-parent/maven-metadata.xml (430 B at 0.3 KB/sec)
Uploading: https://repository.apache.org/content/repositories/snapshots/org/apache/pdfbox/pdfbox-parent/1.8.0-SNAPSHOT/maven-metadata.xml
Uploaded: https://repository.apache.org/content/repositories/snapshots/org/apache/pdfbox/pdfbox-parent/1.8.0-SNAPSHOT/maven-metadata.xml (609 B at 0.6 KB/sec)
Uploading: https://repository.apache.org/content/repositories/snapshots/org/apache/pdfbox/pdfbox-parent/maven-metadata.xml
Uploaded: https://repository.apache.org/content/repositories/snapshots/org/apache/pdfbox/pdfbox-parent/maven-metadata.xml (430 B at 0.4 KB/sec)
mojoSucceeded org.apache.maven.plugins:maven-deploy-plugin:2.6(default-deploy)
projectSucceeded org.apache.pdfbox:pdfbox-parent:1.8.0-SNAPSHOT
projectStarted org.apache.pdfbox:fontbox:1.8.0-SNAPSHOT
[INFO]
[INFO] ------------------------------------------------------------------------
[INFO] Building Apache FontBox 1.8.0-SNAPSHOT
[INFO] ------------------------------------------------------------------------
mojoStarted org.apache.maven.plugins:maven-clean-plugin:2.4.1(default-clean)
[INFO]
[INFO] --- maven-clean-plugin:2.4.1:clean (default-clean) @ fontbox ---
[INFO] Deleting <https://builds.apache.org/job/PDFBox-trunk/ws/trunk/fontbox/target>
mojoSucceeded org.apache.maven.plugins:maven-clean-plugin:2.4.1(default-clean)
mojoStarted org.apache.maven.plugins:maven-remote-resources-plugin:1.2.1(default)
[INFO]
[INFO] --- maven-remote-resources-plugin:1.2.1:process (default) @ fontbox ---
mojoSucceeded org.apache.maven.plugins:maven-remote-resources-plugin:1.2.1(default)
mojoStarted org.apache.maven.plugins:maven-resources-plugin:2.5(default-resources)
[INFO]
[INFO] --- maven-resources-plugin:2.5:resources (default-resources) @ fontbox ---
[debug] execute contextualize
[INFO] Using 'ISO-8859-1' encoding to copy filtered resources.
[INFO] skip non existing resourceDirectory <https://builds.apache.org/job/PDFBox-trunk/ws/trunk/fontbox/src/main/resources>
[INFO] Copying 3 resources
mojoSucceeded org.apache.maven.plugins:maven-resources-plugin:2.5(default-resources)
mojoStarted org.apache.maven.plugins:maven-compiler-plugin:2.3.2(default-compile)
[INFO]
[INFO] --- maven-compiler-plugin:2.3.2:compile (default-compile) @ fontbox ---
[INFO] Compiling 73 source files to <https://builds.apache.org/job/PDFBox-trunk/ws/trunk/fontbox/target/classes>
mojoSucceeded org.apache.maven.plugins:maven-compiler-plugin:2.3.2(default-compile)
mojoStarted org.apache.maven.plugins:maven-resources-plugin:2.5(default-testResources)
[INFO]
[debug] execute contextualize
[INFO] Using 'ISO-8859-1' encoding to copy filtered resources.
[INFO] Copying 1 resource
[INFO] Copying 3 resources
[INFO] --- maven-resources-plugin:2.5:testResources (default-testResources) @ fontbox ---
mojoSucceeded org.apache.maven.plugins:maven-resources-plugin:2.5(default-testResources)
mojoStarted org.apache.maven.plugins:maven-compiler-plugin:2.3.2(default-testCompile)
[INFO]
[INFO] --- maven-compiler-plugin:2.3.2:testCompile (default-testCompile) @ fontbox ---
[INFO] Compiling 4 source files to <https://builds.apache.org/job/PDFBox-trunk/ws/trunk/fontbox/target/test-classes>
mojoSucceeded org.apache.maven.plugins:maven-compiler-plugin:2.3.2(default-testCompile)
mojoStarted org.apache.maven.plugins:maven-surefire-plugin:2.9(default-test)
[INFO]
[INFO] --- maven-surefire-plugin:2.9:test (default-test) @ fontbox ---
[INFO] Surefire report directory: <https://builds.apache.org/job/PDFBox-trunk/ws/trunk/fontbox/target/surefire-reports>
-------------------------------------------------------
T E S T S
-------------------------------------------------------
Results :
Tests run: 0, Failures: 0, Errors: 0, Skipped: 0
mojoFailed org.apache.maven.plugins:maven-surefire-plugin:2.9(default-test)
[JENKINS] Recording test results
projectFailed org.apache.pdfbox:fontbox:1.8.0-SNAPSHOT
sessionEnded
[INFO] ------------------------------------------------------------------------
[INFO] Reactor Summary:
[INFO]
[INFO] PDFBox parent ..................................... SUCCESS [2:35.773s]
[INFO] Apache FontBox .................................... FAILURE [1:04.378s]
[INFO] Apache JempBox .................................... SKIPPED
[INFO] Apache XmpBox ..................................... SKIPPED
[INFO] Apache PDFBox ..................................... SKIPPED
[INFO] Apache Preflight .................................. SKIPPED
[INFO] Apache PDFBox for Lucene .......................... SKIPPED
[INFO] Apache PDFBox for Ant ............................. SKIPPED
[INFO] Apache PDFBox webapp .............................. SKIPPED
[INFO] Apache PDFBox application ......................... SKIPPED
[INFO] Apache PDFBox examples ............................ SKIPPED
[INFO] PDFBox reactor .................................... SKIPPED
[INFO] ------------------------------------------------------------------------
[INFO] BUILD FAILURE
[INFO] ------------------------------------------------------------------------
[INFO] Total time: 4:15.170s
[INFO] Finished at: Sat Jan 05 08:20:10 GMT+00:00 2013
[INFO] Final Memory: 23M/136M
[INFO] ------------------------------------------------------------------------
Projects to build: [MavenProject: org.apache.pdfbox:pdfbox-parent:1.8.0-SNAPSHOT @ <https://builds.apache.org/job/PDFBox-trunk/ws/trunk/parent/pom.xml,> MavenProject: org.apache.pdfbox:fontbox:1.8.0-SNAPSHOT @ <https://builds.apache.org/job/PDFBox-trunk/ws/trunk/fontbox/pom.xml,> MavenProject: org.apache.pdfbox:jempbox:1.8.0-SNAPSHOT @ <https://builds.apache.org/job/PDFBox-trunk/ws/trunk/jempbox/pom.xml,> MavenProject: org.apache.pdfbox:xmpbox:1.8.0-SNAPSHOT @ <https://builds.apache.org/job/PDFBox-trunk/ws/trunk/xmpbox/pom.xml,> MavenProject: org.apache.pdfbox:pdfbox:1.8.0-SNAPSHOT @ <https://builds.apache.org/job/PDFBox-trunk/ws/trunk/pdfbox/pom.xml,> MavenProject: org.apache.pdfbox:preflight:1.8.0-SNAPSHOT @ <https://builds.apache.org/job/PDFBox-trunk/ws/trunk/preflight/pom.xml,> MavenProject: org.apache.pdfbox:pdfbox-lucene:1.8.0-SNAPSHOT @ <https://builds.apache.org/job/PDFBox-trunk/ws/trunk/lucene/pom.xml,> MavenProject: org.apache.pdfbox:pdfbox-ant:1.8.0-SNAPSHOT @ <https://builds.apache.org/job/PDFBox-trunk/ws/trunk/ant/pom.xml,> MavenProject: org.apache.pdfbox:pdfbox-war:1.8.0-SNAPSHOT @ <https://builds.apache.org/job/PDFBox-trunk/ws/trunk/war/pom.xml,> MavenProject: org.apache.pdfbox:pdfbox-app:1.8.0-SNAPSHOT @ <https://builds.apache.org/job/PDFBox-trunk/ws/trunk/app/pom.xml,> MavenProject: org.apache.pdfbox:pdfbox-examples:1.8.0-SNAPSHOT @ <https://builds.apache.org/job/PDFBox-trunk/ws/trunk/examples/pom.xml,> MavenProject: org.apache.pdfbox:pdfbox-reactor:1.8.0-SNAPSHOT @ <https://builds.apache.org/job/PDFBox-trunk/ws/trunk/pom.xml]>
[JENKINS] Archiving <https://builds.apache.org/job/PDFBox-trunk/ws/trunk/preflight/pom.xml> to /home/hudson/hudson/jobs/PDFBox-trunk/modules/org.apache.pdfbox$preflight/builds/2013-01-05_08-12-54/archive/org.apache.pdfbox/preflight/1.8.0-SNAPSHOT/preflight-1.8.0-SNAPSHOT.pom
[JENKINS] Archiving <https://builds.apache.org/job/PDFBox-trunk/ws/trunk/pom.xml> to /home/hudson/hudson/jobs/PDFBox-trunk/modules/org.apache.pdfbox$pdfbox-reactor/builds/2013-01-05_08-12-53/archive/org.apache.pdfbox/pdfbox-reactor/1.8.0-SNAPSHOT/pdfbox-reactor-1.8.0-SNAPSHOT.pom
[JENKINS] Archiving <https://builds.apache.org/job/PDFBox-trunk/ws/trunk/lucene/pom.xml> to /home/hudson/hudson/jobs/PDFBox-trunk/modules/org.apache.pdfbox$pdfbox-lucene/builds/2013-01-05_08-12-54/archive/org.apache.pdfbox/pdfbox-lucene/1.8.0-SNAPSHOT/pdfbox-lucene-1.8.0-SNAPSHOT.pom
[JENKINS] Archiving <https://builds.apache.org/job/PDFBox-trunk/ws/trunk/examples/pom.xml> to /home/hudson/hudson/jobs/PDFBox-trunk/modules/org.apache.pdfbox$pdfbox-examples/builds/2013-01-05_08-12-55/archive/org.apache.pdfbox/pdfbox-examples/1.8.0-SNAPSHOT/pdfbox-examples-1.8.0-SNAPSHOT.pom
[JENKINS] Archiving <https://builds.apache.org/job/PDFBox-trunk/ws/trunk/pdfbox/pom.xml> to /home/hudson/hudson/jobs/PDFBox-trunk/modules/org.apache.pdfbox$pdfbox/builds/2013-01-05_08-12-54/archive/org.apache.pdfbox/pdfbox/1.8.0-SNAPSHOT/pdfbox-1.8.0-SNAPSHOT.pom
[JENKINS] Archiving <https://builds.apache.org/job/PDFBox-trunk/ws/trunk/parent/pom.xml> to /home/hudson/hudson/jobs/PDFBox-trunk/modules/org.apache.pdfbox$pdfbox-parent/builds/2013-01-05_08-12-53/archive/org.apache.pdfbox/pdfbox-parent/1.8.0-SNAPSHOT/pdfbox-parent-1.8.0-SNAPSHOT.pom
[JENKINS] Archiving <https://builds.apache.org/job/PDFBox-trunk/ws/trunk/app/pom.xml> to /home/hudson/hudson/jobs/PDFBox-trunk/modules/org.apache.pdfbox$pdfbox-app/builds/2013-01-05_08-12-55/archive/org.apache.pdfbox/pdfbox-app/1.8.0-SNAPSHOT/pdfbox-app-1.8.0-SNAPSHOT.pom
[JENKINS] Archiving <https://builds.apache.org/job/PDFBox-trunk/ws/trunk/war/pom.xml> to /home/hudson/hudson/jobs/PDFBox-trunk/modules/org.apache.pdfbox$pdfbox-war/builds/2013-01-05_08-12-55/archive/org.apache.pdfbox/pdfbox-war/1.8.0-SNAPSHOT/pdfbox-war-1.8.0-SNAPSHOT.pom
[JENKINS] Archiving <https://builds.apache.org/job/PDFBox-trunk/ws/trunk/ant/pom.xml> to /home/hudson/hudson/jobs/PDFBox-trunk/modules/org.apache.pdfbox$pdfbox-ant/builds/2013-01-05_08-12-55/archive/org.apache.pdfbox/pdfbox-ant/1.8.0-SNAPSHOT/pdfbox-ant-1.8.0-SNAPSHOT.pom
[JENKINS] Archiving <https://builds.apache.org/job/PDFBox-trunk/ws/trunk/fontbox/pom.xml> to /home/hudson/hudson/jobs/PDFBox-trunk/modules/org.apache.pdfbox$fontbox/builds/2013-01-05_08-12-53/archive/org.apache.pdfbox/fontbox/1.8.0-SNAPSHOT/fontbox-1.8.0-SNAPSHOT.pom
[JENKINS] Archiving <https://builds.apache.org/job/PDFBox-trunk/ws/trunk/jempbox/pom.xml> to /home/hudson/hudson/jobs/PDFBox-trunk/modules/org.apache.pdfbox$jempbox/builds/2013-01-05_08-12-53/archive/org.apache.pdfbox/jempbox/1.8.0-SNAPSHOT/jempbox-1.8.0-SNAPSHOT.pom
[JENKINS] Archiving <https://builds.apache.org/job/PDFBox-trunk/ws/trunk/xmpbox/pom.xml> to /home/hudson/hudson/jobs/PDFBox-trunk/modules/org.apache.pdfbox$xmpbox/builds/2013-01-05_08-12-53/archive/org.apache.pdfbox/xmpbox/1.8.0-SNAPSHOT/xmpbox-1.8.0-SNAPSHOT.pom
Waiting for Jenkins to finish collecting data
mavenExecutionResult exceptions not empty
message : Failed to execute goal org.apache.maven.plugins:maven-surefire-plugin:2.9:test (default-test) on project fontbox: Error while executing forked tests.; nested exception is java.io.IOException: Not enough space
cause : Error while executing forked tests.; nested exception is java.io.IOException: Not enough space
Stack trace :
org.apache.maven.lifecycle.LifecycleExecutionException: Failed to execute goal org.apache.maven.plugins:maven-surefire-plugin:2.9:test (default-test) on project fontbox: Error while executing forked tests.; nested exception is java.io.IOException: Not enough space
at org.apache.maven.lifecycle.internal.MojoExecutor.execute(MojoExecutor.java:217)
at org.apache.maven.lifecycle.internal.MojoExecutor.execute(MojoExecutor.java:153)
at org.apache.maven.lifecycle.internal.MojoExecutor.execute(MojoExecutor.java:145)
at org.apache.maven.lifecycle.internal.LifecycleModuleBuilder.buildProject(LifecycleModuleBuilder.java:84)
at org.apache.maven.lifecycle.internal.LifecycleModuleBuilder.buildProject(LifecycleModuleBuilder.java:59)
at org.apache.maven.lifecycle.internal.LifecycleStarter.singleThreadedBuild(LifecycleStarter.java:183)
at org.apache.maven.lifecycle.internal.LifecycleStarter.execute(LifecycleStarter.java:161)
at org.apache.maven.DefaultMaven.doExecute(DefaultMaven.java:319)
at org.apache.maven.DefaultMaven.execute(DefaultMaven.java:156)
at org.jvnet.hudson.maven3.launcher.Maven3Launcher.main(Maven3Launcher.java:79)
at sun.reflect.NativeMethodAccessorImpl.invoke0(Native Method)
at sun.reflect.NativeMethodAccessorImpl.invoke(NativeMethodAccessorImpl.java:39)
at sun.reflect.DelegatingMethodAccessorImpl.invoke(DelegatingMethodAccessorImpl.java:25)
at java.lang.reflect.Method.invoke(Method.java:592)
at org.codehaus.plexus.classworlds.launcher.Launcher.launchStandard(Launcher.java:329)
at org.codehaus.plexus.classworlds.launcher.Launcher.launch(Launcher.java:239)
at org.jvnet.hudson.maven3.agent.Maven3Main.launch(Maven3Main.java:158)
at hudson.maven.Maven3Builder.call(Maven3Builder.java:100)
at hudson.maven.Maven3Builder.call(Maven3Builder.java:66)
at hudson.remoting.UserRequest.perform(UserRequest.java:118)
at hudson.remoting.UserRequest.perform(UserRequest.java:48)
at hudson.remoting.Request$2.run(Request.java:326)
at hudson.remoting.InterceptingExecutorService$1.call(InterceptingExecutorService.java:72)
at java.util.concurrent.FutureTask$Sync.innerRun(FutureTask.java:269)
at java.util.concurrent.FutureTask.run(FutureTask.java:123)
at java.util.concurrent.ThreadPoolExecutor$Worker.runTask(ThreadPoolExecutor.java:651)
at java.util.concurrent.ThreadPoolExecutor$Worker.run(ThreadPoolExecutor.java:676)
at java.lang.Thread.run(Thread.java:595)
Caused by: org.apache.maven.plugin.MojoExecutionException: Error while executing forked tests.; nested exception is java.io.IOException: Not enough space
at org.apache.maven.plugin.surefire.SurefirePlugin.assertNoException(SurefirePlugin.java:614)
at org.apache.maven.plugin.surefire.SurefirePlugin.handleSummary(SurefirePlugin.java:603)
at org.apache.maven.plugin.surefire.AbstractSurefireMojo.executeAfterPreconditionsChecked(AbstractSurefireMojo.java:136)
at org.apache.maven.plugin.surefire.AbstractSurefireMojo.execute(AbstractSurefireMojo.java:97)
at org.apache.maven.plugin.DefaultBuildPluginManager.executeMojo(DefaultBuildPluginManager.java:101)
at org.apache.maven.lifecycle.internal.MojoExecutor.execute(MojoExecutor.java:209)
... 27 more
Caused by: org.apache.maven.surefire.booter.SurefireBooterForkException: Error while executing forked tests.; nested exception is java.io.IOException: Not enough space
at org.apache.maven.plugin.surefire.booterclient.ForkStarter.fork(ForkStarter.java:206)
at org.apache.maven.plugin.surefire.booterclient.ForkStarter.run(ForkStarter.java:98)
at org.apache.maven.plugin.surefire.AbstractSurefireMojo.executeProvider(AbstractSurefireMojo.java:199)
at org.apache.maven.plugin.surefire.AbstractSurefireMojo.executeAllProviders(AbstractSurefireMojo.java:176)
at org.apache.maven.plugin.surefire.AbstractSurefireMojo.executeAfterPreconditionsChecked(AbstractSurefireMojo.java:134)
... 30 more
Caused by: java.io.IOException: Not enough space
at java.lang.UNIXProcess.forkAndExec(Native Method)
at java.lang.UNIXProcess.<init>(UNIXProcess.java:53)
at java.lang.ProcessImpl.start(ProcessImpl.java:65)
at java.lang.ProcessBuilder.start(ProcessBuilder.java:451)
at java.lang.Runtime.exec(Runtime.java:591)
at org.codehaus.plexus.util.cli.Commandline.execute(Commandline.java:651)
at org.codehaus.plexus.util.cli.CommandLineUtils.executeCommandLine(CommandLineUtils.java:119)
at org.codehaus.plexus.util.cli.CommandLineUtils.executeCommandLine(CommandLineUtils.java:88)
at org.apache.maven.plugin.surefire.booterclient.ForkStarter.fork(ForkStarter.java:191)
... 34 more
Sending e-mails to: dev@pdfbox.apache.org
channel stopped
Archiving artifacts