You are viewing a plain text version of this content. The canonical link for it is here.
Posted to notifications@maven.apache.org by Apache Jenkins Server <je...@builds.apache.org> on 2019/08/01 15:46:02 UTC

Build failed in Jenkins: Maven TLP » maven-archetype » ARCHETYPE-571 #7

See https://builds.apache.org/job/maven-box/job/maven-archetype/job/ARCHETYPE-571/7/

No changes.

All tests passed

Build log:
[...truncated 20899 lines...]
[withMaven] artifactsPublisher - Archive artifact j12m3.6.xb\archetype-models\pom.xml under org\apache\maven\archetype\archetype-models\3.1.2-SNAPSHOT\archetype-models-3.1.2-SNAPSHOT.pom
[withMaven] artifactsPublisher - Archive artifact j12m3.6.xb\archetype-models\target\archetype-models-3.1.2-SNAPSHOT-site.xml under org\apache\maven\archetype\archetype-models\3.1.2-SNAPSHOT\archetype-models-3.1.2-SNAPSHOT-site.xml
[withMaven] artifactsPublisher - Archive artifact j7m3.3.xb\pom.xml under org\apache\maven\archetype\maven-archetype\3.1.2-SNAPSHOT\maven-archetype-3.1.2-SNAPSHOT.pom
[withMaven] artifactsPublisher - Archive artifact j12m3.6.xb\archetype-models\archetype-catalog\pom.xml under org\apache\maven\archetype\archetype-catalog\3.1.2-SNAPSHOT\archetype-catalog-3.1.2-SNAPSHOT.pom
[Pipeline] // ws
[withMaven] artifactsPublisher - Archive artifact j7m3.3.xb\target\maven-archetype-3.1.2-SNAPSHOT-site.xml under org\apache\maven\archetype\maven-archetype\3.1.2-SNAPSHOT\maven-archetype-3.1.2-SNAPSHOT-site.xml
[withMaven] artifactsPublisher - Archive artifact j12m3.6.xb\archetype-models\archetype-catalog\target\archetype-catalog-3.1.2-SNAPSHOT.jar under org\apache\maven\archetype\archetype-catalog\3.1.2-SNAPSHOT\archetype-catalog-3.1.2-SNAPSHOT.jar
[Pipeline] }
[withMaven] artifactsPublisher - Archive artifact j12m3.6.xb\archetype-models\archetype-descriptor\pom.xml under org\apache\maven\archetype\archetype-descriptor\3.1.2-SNAPSHOT\archetype-descriptor-3.1.2-SNAPSHOT.pom
[withMaven] artifactsPublisher - Archive artifact j12m3.6.xb\archetype-models\archetype-descriptor\target\archetype-descriptor-3.1.2-SNAPSHOT.jar under org\apache\maven\archetype\archetype-descriptor\3.1.2-SNAPSHOT\archetype-descriptor-3.1.2-SNAPSHOT.jar
[withMaven] artifactsPublisher - Archive artifact j7m3.3.xb\archetype-models\pom.xml under org\apache\maven\archetype\archetype-models\3.1.2-SNAPSHOT\archetype-models-3.1.2-SNAPSHOT.pom
[Pipeline] // node
[withMaven] artifactsPublisher - Archive artifact j12m3.6.xb\archetype-common\pom.xml under org\apache\maven\archetype\archetype-common\3.1.2-SNAPSHOT\archetype-common-3.1.2-SNAPSHOT.pom
[withMaven] artifactsPublisher - Archive artifact j7m3.3.xb\archetype-models\target\archetype-models-3.1.2-SNAPSHOT-site.xml under org\apache\maven\archetype\archetype-models\3.1.2-SNAPSHOT\archetype-models-3.1.2-SNAPSHOT-site.xml
[Pipeline] }
[withMaven] artifactsPublisher - Archive artifact j12m3.6.xb\archetype-common\target\archetype-common-3.1.2-SNAPSHOT.jar under org\apache\maven\archetype\archetype-common\3.1.2-SNAPSHOT\archetype-common-3.1.2-SNAPSHOT.jar
[withMaven] artifactsPublisher - Archive artifact j12m3.6.xb\archetype-packaging\pom.xml under org\apache\maven\archetype\archetype-packaging\3.1.2-SNAPSHOT\archetype-packaging-3.1.2-SNAPSHOT.pom
[withMaven] artifactsPublisher - Archive artifact j7m3.3.xb\archetype-models\archetype-catalog\pom.xml under org\apache\maven\archetype\archetype-catalog\3.1.2-SNAPSHOT\archetype-catalog-3.1.2-SNAPSHOT.pom
[withMaven] artifactsPublisher - Archive artifact j12m3.6.xb\archetype-packaging\target\archetype-packaging-3.1.2-SNAPSHOT.jar under org\apache\maven\archetype\archetype-packaging\3.1.2-SNAPSHOT\archetype-packaging-3.1.2-SNAPSHOT.jar
[withMaven] artifactsPublisher - Archive artifact j7m3.3.xb\archetype-models\archetype-catalog\target\archetype-catalog-3.1.2-SNAPSHOT.jar under org\apache\maven\archetype\archetype-catalog\3.1.2-SNAPSHOT\archetype-catalog-3.1.2-SNAPSHOT.jar
[withMaven] artifactsPublisher - Archive artifact j12m3.6.xb\maven-archetype-plugin\pom.xml under org\apache\maven\plugins\maven-archetype-plugin\3.1.2-SNAPSHOT\maven-archetype-plugin-3.1.2-SNAPSHOT.pom
[withMaven] artifactsPublisher - Archive artifact j12m3.6.xb\maven-archetype-plugin\target\maven-archetype-plugin-3.1.2-SNAPSHOT.jar under org\apache\maven\plugins\maven-archetype-plugin\3.1.2-SNAPSHOT\maven-archetype-plugin-3.1.2-SNAPSHOT.jar
[withMaven] artifactsPublisher - Archive artifact j7m3.3.xb\archetype-models\archetype-descriptor\pom.xml under org\apache\maven\archetype\archetype-descriptor\3.1.2-SNAPSHOT\archetype-descriptor-3.1.2-SNAPSHOT.pom
[withMaven] artifactsPublisher - Archive artifact j7m3.3.xb\archetype-models\archetype-descriptor\target\archetype-descriptor-3.1.2-SNAPSHOT.jar under org\apache\maven\archetype\archetype-descriptor\3.1.2-SNAPSHOT\archetype-descriptor-3.1.2-SNAPSHOT.jar
[withMaven] artifactsPublisher - Archive artifact j7m3.3.xb\archetype-common\pom.xml under org\apache\maven\archetype\archetype-common\3.1.2-SNAPSHOT\archetype-common-3.1.2-SNAPSHOT.pom
[withMaven] artifactsPublisher - Archive artifact j7m3.3.xb\archetype-common\target\archetype-common-3.1.2-SNAPSHOT.jar under org\apache\maven\archetype\archetype-common\3.1.2-SNAPSHOT\archetype-common-3.1.2-SNAPSHOT.jar
[withMaven] artifactsPublisher - Archive artifact j7m3.3.xb\archetype-packaging\pom.xml under org\apache\maven\archetype\archetype-packaging\3.1.2-SNAPSHOT\archetype-packaging-3.1.2-SNAPSHOT.pom
[withMaven] artifactsPublisher - Archive artifact j7m3.3.xb\archetype-packaging\target\archetype-packaging-3.1.2-SNAPSHOT.jar under org\apache\maven\archetype\archetype-packaging\3.1.2-SNAPSHOT\archetype-packaging-3.1.2-SNAPSHOT.jar
[withMaven] artifactsPublisher - Archive artifact j7m3.3.xb\maven-archetype-plugin\pom.xml under org\apache\maven\plugins\maven-archetype-plugin\3.1.2-SNAPSHOT\maven-archetype-plugin-3.1.2-SNAPSHOT.pom
[withMaven] artifactsPublisher - Archive artifact j7m3.3.xb\maven-archetype-plugin\target\maven-archetype-plugin-3.1.2-SNAPSHOT.jar under org\apache\maven\plugins\maven-archetype-plugin\3.1.2-SNAPSHOT\maven-archetype-plugin-3.1.2-SNAPSHOT.jar
[withMaven] junitPublisher - Archive test results for Maven artifact org.apache.maven.archetype:archetype-catalog:jar:3.1.2-SNAPSHOT generated by maven-surefire-plugin:test (default-test): j12m3.6.xb\archetype-models\archetype-catalog\target\surefire-reports\*.xml
[withMaven] junitPublisher - Archive test results for Maven artifact org.apache.maven.archetype:archetype-descriptor:jar:3.1.2-SNAPSHOT generated by maven-surefire-plugin:test (default-test): j12m3.6.xb\archetype-models\archetype-descriptor\target\surefire-reports\*.xml
[withMaven] junitPublisher - Archive test results for Maven artifact org.apache.maven.archetype:archetype-common:jar:3.1.2-SNAPSHOT generated by maven-surefire-plugin:test (default-test): j12m3.6.xb\archetype-common\target\surefire-reports\*.xml
[withMaven] junitPublisher - Archive test results for Maven artifact org.apache.maven.archetype:archetype-packaging:jar:3.1.2-SNAPSHOT generated by maven-surefire-plugin:test (default-test): j12m3.6.xb\archetype-packaging\target\surefire-reports\*.xml
[withMaven] junitPublisher - Archive test results for Maven artifact org.apache.maven.plugins:maven-archetype-plugin:maven-plugin:3.1.2-SNAPSHOT generated by maven-surefire-plugin:test (default-test): j12m3.6.xb\maven-archetype-plugin\target\surefire-reports\*.xml
Recording test results
[withMaven] junitPublisher - Archive test results for Maven artifact org.apache.maven.archetype:archetype-catalog:jar:3.1.2-SNAPSHOT generated by maven-surefire-plugin:test (default-test): j7m3.3.xb\archetype-models\archetype-catalog\target\surefire-reports\*.xml
[withMaven] junitPublisher - Archive test results for Maven artifact org.apache.maven.archetype:archetype-descriptor:jar:3.1.2-SNAPSHOT generated by maven-surefire-plugin:test (default-test): j7m3.3.xb\archetype-models\archetype-descriptor\target\surefire-reports\*.xml
[withMaven] junitPublisher - Archive test results for Maven artifact org.apache.maven.archetype:archetype-common:jar:3.1.2-SNAPSHOT generated by maven-surefire-plugin:test (default-test): j7m3.3.xb\archetype-common\target\surefire-reports\*.xml
[withMaven] junitPublisher - Archive test results for Maven artifact org.apache.maven.archetype:archetype-packaging:jar:3.1.2-SNAPSHOT generated by maven-surefire-plugin:test (default-test): j7m3.3.xb\archetype-packaging\target\surefire-reports\*.xml
[withMaven] junitPublisher - Archive test results for Maven artifact org.apache.maven.plugins:maven-archetype-plugin:maven-plugin:3.1.2-SNAPSHOT generated by maven-surefire-plugin:test (default-test): j7m3.3.xb\maven-archetype-plugin\target\surefire-reports\*.xml
Recording test results
[withMaven] openTasksPublisher - Scan Tasks for Maven artifact org.apache.maven.archetype:archetype-common:jar:3.1.2-SNAPSHOT in source directory j12m3.6.xb\archetype-common\src\main\java
[withMaven] openTasksPublisher - Scan Tasks for Maven artifact org.apache.maven.plugins:maven-archetype-plugin:maven-plugin:3.1.2-SNAPSHOT in source directory j12m3.6.xb\maven-archetype-plugin\src\main\java
[withMaven] openTasksPublisher - Scan Tasks for Maven artifact org.apache.maven.archetype:archetype-common:jar:3.1.2-SNAPSHOT in source directory linux-jdk12-m3.6.x_build/archetype-common/src/main/java
[TASKS] Scanning folder 'F:\short\jenkins-maven-box-maven-archetype-ARCHETYPE-571-7' for files matching the pattern 'j12m3.6.xb\archetype-common\src\main\java\**\*,j12m3.6.xb\maven-archetype-plugin\src\main\java\**\*' - excludes: null
[TASKS] Found 89 files to scan for tasks
[TASKS] Found 26 open tasks.
Skipping warnings blame since pipelines do not have an SCM link.%n
[TASKS] Computing warning deltas based on reference build #5
[withMaven] openTasksPublisher - Scan Tasks for Maven artifact org.apache.maven.archetype:archetype-common:jar:3.1.2-SNAPSHOT in source directory j7m3.3.xb\archetype-common\src\main\java
[withMaven] openTasksPublisher - Scan Tasks for Maven artifact org.apache.maven.plugins:maven-archetype-plugin:maven-plugin:3.1.2-SNAPSHOT in source directory j7m3.3.xb\maven-archetype-plugin\src\main\java
[withMaven] invokerPublisher - Archive invoker results for Maven artifact MavenArtifact{org.apache.maven.plugins:maven-archetype-plugin:maven-plugin:3.1.2-SNAPSHOT(version: 3.1.2-SNAPSHOT, snapshot:false) } generated by PluginInvocation{org.apache.maven.plugins:maven-invoker-plugin:3.1.0@run  integration-test}: j12m3.6.xb\maven-archetype-plugin\target\invoker-reports\*.xml
[withMaven] openTasksPublisher - Scan Tasks for Maven artifact org.apache.maven.plugins:maven-archetype-plugin:maven-plugin:3.1.2-SNAPSHOT in source directory linux-jdk12-m3.6.x_build/maven-archetype-plugin/src/main/java
[TASKS] Scanning folder 'F:\short\jenkins-maven-box-maven-archetype-ARCHETYPE-571-7@2' for files matching the pattern 'j7m3.3.xb\archetype-common\src\main\java\**\*,j7m3.3.xb\maven-archetype-plugin\src\main\java\**\*' - excludes: null
[TASKS] Found 89 files to scan for tasks
[TASKS] Found 26 open tasks.
Skipping warnings blame since pipelines do not have an SCM link.%n
[TASKS] Computing warning deltas based on reference build #5
[withMaven] artifactsPublisher - Archive artifact linux-jdk7-m3.2.x_build/pom.xml under org/apache/maven/archetype/maven-archetype/3.1.2-SNAPSHOT/maven-archetype-3.1.2-SNAPSHOT.pom
[TASKS] Scanning folder '/home/jenkins/jenkins-slave/workspace/ox_maven-archetype_ARCHETYPE-571@2' for files matching the pattern 'linux-jdk12-m3.6.x_build/archetype-common/src/main/java/**/*,linux-jdk12-m3.6.x_build/maven-archetype-plugin/src/main/java/**/*' - excludes: null
[TASKS] Found 89 files to scan for tasks
[TASKS] Found 26 open tasks.
Skipping warnings blame since pipelines do not have an SCM link.%n
[TASKS] Computing warning deltas based on reference build #5
[withMaven] invokerPublisher - Archive invoker results for Maven artifact MavenArtifact{org.apache.maven.plugins:maven-archetype-plugin:maven-plugin:3.1.2-SNAPSHOT(version: 3.1.2-SNAPSHOT, snapshot:false) } generated by PluginInvocation{org.apache.maven.plugins:maven-invoker-plugin:3.1.0@run  integration-test}: j7m3.3.xb\maven-archetype-plugin\target\invoker-reports\*.xml
[withMaven] artifactsPublisher - Archive artifact linux-jdk7-m3.2.x_build/target/maven-archetype-3.1.2-SNAPSHOT-site.xml under org/apache/maven/archetype/maven-archetype/3.1.2-SNAPSHOT/maven-archetype-3.1.2-SNAPSHOT-site.xml
[withMaven] artifactsPublisher - Archive artifact linux-jdk7-m3.2.x_build/archetype-models/pom.xml under org/apache/maven/archetype/archetype-models/3.1.2-SNAPSHOT/archetype-models-3.1.2-SNAPSHOT.pom
[withMaven] artifactsPublisher - Archive artifact linux-jdk7-m3.2.x_build/archetype-models/target/archetype-models-3.1.2-SNAPSHOT-site.xml under org/apache/maven/archetype/archetype-models/3.1.2-SNAPSHOT/archetype-models-3.1.2-SNAPSHOT-site.xml
[withMaven] artifactsPublisher - Archive artifact linux-jdk7-m3.2.x_build/archetype-models/archetype-catalog/pom.xml under org/apache/maven/archetype/archetype-catalog/3.1.2-SNAPSHOT/archetype-catalog-3.1.2-SNAPSHOT.pom
[withMaven] artifactsPublisher - Archive artifact linux-jdk7-m3.2.x_build/archetype-models/archetype-catalog/target/archetype-catalog-3.1.2-SNAPSHOT.jar under org/apache/maven/archetype/archetype-catalog/3.1.2-SNAPSHOT/archetype-catalog-3.1.2-SNAPSHOT.jar
[withMaven] artifactsPublisher - Archive artifact linux-jdk7-m3.2.x_build/archetype-models/archetype-descriptor/pom.xml under org/apache/maven/archetype/archetype-descriptor/3.1.2-SNAPSHOT/archetype-descriptor-3.1.2-SNAPSHOT.pom
[withMaven] artifactsPublisher - Archive artifact linux-jdk7-m3.2.x_build/archetype-models/archetype-descriptor/target/archetype-descriptor-3.1.2-SNAPSHOT.jar under org/apache/maven/archetype/archetype-descriptor/3.1.2-SNAPSHOT/archetype-descriptor-3.1.2-SNAPSHOT.jar
[withMaven] artifactsPublisher - Archive artifact linux-jdk7-m3.2.x_build/archetype-common/pom.xml under org/apache/maven/archetype/archetype-common/3.1.2-SNAPSHOT/archetype-common-3.1.2-SNAPSHOT.pom
[withMaven] artifactsPublisher - Archive artifact linux-jdk7-m3.2.x_build/archetype-common/target/archetype-common-3.1.2-SNAPSHOT.jar under org/apache/maven/archetype/archetype-common/3.1.2-SNAPSHOT/archetype-common-3.1.2-SNAPSHOT.jar
[INFO] run post-build script verify.groovy
[INFO]           roundtrip-multi\pom.xml .......................... SUCCESS (20.8 s)
[INFO] -------------------------------------------------
[INFO] Build Summary:
[INFO]   Passed: 25, Failed: 0, Errors: 0, Skipped: 0
[INFO] -------------------------------------------------
[INFO] 
[INFO] --- mrm-maven-plugin:1.1.0:stop (mirror) @ maven-archetype-plugin ---
[INFO] Stopping Mock Repository Manager on http://localhost:62099
[INFO] Stopped SocketConnector@0.0.0.0:62099
[INFO] Mock Repository Manager http://localhost:62099 is stopped.
[INFO] 
[INFO] --- mrm-maven-plugin:1.1.0:stop (archetype-repository) @ maven-archetype-plugin ---
[INFO] Stopping Mock Repository Manager on http://localhost:62102
[INFO] Stopped SocketConnector@0.0.0.0:62102
[INFO] Mock Repository Manager http://localhost:62102 is stopped.
[INFO] 
[INFO] --- maven-checkstyle-plugin:3.0.0:check (checkstyle-check) @ maven-archetype-plugin ---
[INFO] There are 46 errors reported by Checkstyle 6.18 with config/maven_checks.xml ruleset.
[INFO] Ignored 46 errors, 0 violation remaining.
[INFO] ------------------------------------------------------------------------
[INFO] Reactor Summary:
[INFO] 
[INFO] Maven Archetype .................................... SUCCESS [ 32.544 s]
[INFO] Maven Archetype Models ............................. SUCCESS [  0.454 s]
[INFO] Maven Archetype Catalog Model ...................... SUCCESS [ 11.699 s]
[INFO] Maven Archetype Descriptor Model ................... SUCCESS [  1.550 s]
[INFO] Maven Archetype Common ............................. SUCCESS [ 37.186 s]
[INFO] Maven Archetype Packaging .......................... SUCCESS [  0.578 s]
[INFO] Maven Archetype Plugin ............................. SUCCESS [05:43 min]
[INFO] ------------------------------------------------------------------------
[INFO] BUILD SUCCESS
[INFO] ------------------------------------------------------------------------
[INFO] Total time: 07:07 min
[INFO] Finished at: 2019-08-01T08:45:19-07:00
[withMaven] artifactsPublisher - Archive artifact linux-jdk7-m3.2.x_build/archetype-packaging/pom.xml under org/apache/maven/archetype/archetype-packaging/3.1.2-SNAPSHOT/archetype-packaging-3.1.2-SNAPSHOT.pom
[withMaven] Publishers: Generated Artifacts Publisher: 371 ms, Junit Publisher: 390 ms, Open Task Scanner Publisher: 326 ms, Dependencies Fingerprint Publisher: 59 ms, Invoker Publisher: 19525 ms, Pipeline Graph Publisher: 4 ms
[Pipeline] // withMaven
[INFO] Final Memory: 59M/1008M
[INFO] ------------------------------------------------------------------------
[INFO] [jenkins-event-spy] Generated F:\short\jenkins-maven-box-maven-archetype-ARCHETYPE-571-7@3@tmp\withMaven017330db\maven-spy-20190801-083811-987729797091149459140.log
Picked up JAVA_TOOL_OPTIONS: -Dmaven.ext.class.path="F:\short\jenkins-maven-box-maven-archetype-ARCHETYPE-571-7@3@tmp\withMaven017330db\pipeline-maven-spy.jar" -Dorg.jenkinsci.plugins.pipeline.maven.reportsFolder="F:\short\jenkins-maven-box-maven-archetype-ARCHETYPE-571-7@3@tmp\withMaven017330db" 
[Pipeline] cleanWs
[WS-CLEANUP] Deleting project workspace...
[WS-CLEANUP] Deferred wipeout is used...
[Pipeline] }
[WS-CLEANUP] done
[Pipeline] // dir
[Pipeline] }
[Pipeline] }
[Pipeline] // stage
[Pipeline] }
[withMaven] artifactsPublisher - Archive artifact j7m3.5.xb\pom.xml under org\apache\maven\archetype\maven-archetype\3.1.2-SNAPSHOT\maven-archetype-3.1.2-SNAPSHOT.pom
[Pipeline] // ws
[withMaven] artifactsPublisher - Archive artifact j7m3.5.xb\target\maven-archetype-3.1.2-SNAPSHOT-site.xml under org\apache\maven\archetype\maven-archetype\3.1.2-SNAPSHOT\maven-archetype-3.1.2-SNAPSHOT-site.xml
[Pipeline] }
[withMaven] artifactsPublisher - Archive artifact linux-jdk7-m3.2.x_build/archetype-packaging/target/archetype-packaging-3.1.2-SNAPSHOT.jar under org/apache/maven/archetype/archetype-packaging/3.1.2-SNAPSHOT/archetype-packaging-3.1.2-SNAPSHOT.jar
[withMaven] artifactsPublisher - Archive artifact j7m3.5.xb\archetype-models\pom.xml under org\apache\maven\archetype\archetype-models\3.1.2-SNAPSHOT\archetype-models-3.1.2-SNAPSHOT.pom
[withMaven] artifactsPublisher - Archive artifact j7m3.5.xb\archetype-models\target\archetype-models-3.1.2-SNAPSHOT-site.xml under org\apache\maven\archetype\archetype-models\3.1.2-SNAPSHOT\archetype-models-3.1.2-SNAPSHOT-site.xml
[withMaven] artifactsPublisher - Archive artifact j7m3.5.xb\archetype-models\archetype-catalog\pom.xml under org\apache\maven\archetype\archetype-catalog\3.1.2-SNAPSHOT\archetype-catalog-3.1.2-SNAPSHOT.pom
[Pipeline] // node
[withMaven] artifactsPublisher - Archive artifact j7m3.5.xb\archetype-models\archetype-catalog\target\archetype-catalog-3.1.2-SNAPSHOT.jar under org\apache\maven\archetype\archetype-catalog\3.1.2-SNAPSHOT\archetype-catalog-3.1.2-SNAPSHOT.jar
[Pipeline] }
[withMaven] artifactsPublisher - Archive artifact j7m3.5.xb\archetype-models\archetype-descriptor\pom.xml under org\apache\maven\archetype\archetype-descriptor\3.1.2-SNAPSHOT\archetype-descriptor-3.1.2-SNAPSHOT.pom
[withMaven] artifactsPublisher - Archive artifact j7m3.5.xb\archetype-models\archetype-descriptor\target\archetype-descriptor-3.1.2-SNAPSHOT.jar under org\apache\maven\archetype\archetype-descriptor\3.1.2-SNAPSHOT\archetype-descriptor-3.1.2-SNAPSHOT.jar
[withMaven] invokerPublisher - Archive invoker results for Maven artifact MavenArtifact{org.apache.maven.plugins:maven-archetype-plugin:maven-plugin:3.1.2-SNAPSHOT(version: 3.1.2-SNAPSHOT, snapshot:false) } generated by PluginInvocation{org.apache.maven.plugins:maven-invoker-plugin:3.1.0@run  integration-test}: linux-jdk12-m3.6.x_build/maven-archetype-plugin/target/invoker-reports/*.xml
[withMaven] artifactsPublisher - Archive artifact j7m3.5.xb\archetype-common\pom.xml under org\apache\maven\archetype\archetype-common\3.1.2-SNAPSHOT\archetype-common-3.1.2-SNAPSHOT.pom
[withMaven] artifactsPublisher - Archive artifact j7m3.5.xb\archetype-common\target\archetype-common-3.1.2-SNAPSHOT.jar under org\apache\maven\archetype\archetype-common\3.1.2-SNAPSHOT\archetype-common-3.1.2-SNAPSHOT.jar
[withMaven] artifactsPublisher - Archive artifact j7m3.5.xb\archetype-packaging\pom.xml under org\apache\maven\archetype\archetype-packaging\3.1.2-SNAPSHOT\archetype-packaging-3.1.2-SNAPSHOT.pom
[withMaven] artifactsPublisher - Archive artifact j7m3.5.xb\archetype-packaging\target\archetype-packaging-3.1.2-SNAPSHOT.jar under org\apache\maven\archetype\archetype-packaging\3.1.2-SNAPSHOT\archetype-packaging-3.1.2-SNAPSHOT.jar
[withMaven] artifactsPublisher - Archive artifact j7m3.5.xb\maven-archetype-plugin\pom.xml under org\apache\maven\plugins\maven-archetype-plugin\3.1.2-SNAPSHOT\maven-archetype-plugin-3.1.2-SNAPSHOT.pom
[withMaven] artifactsPublisher - Archive artifact j7m3.5.xb\maven-archetype-plugin\target\maven-archetype-plugin-3.1.2-SNAPSHOT.jar under org\apache\maven\plugins\maven-archetype-plugin\3.1.2-SNAPSHOT\maven-archetype-plugin-3.1.2-SNAPSHOT.jar
[withMaven] junitPublisher - Archive test results for Maven artifact org.apache.maven.archetype:archetype-catalog:jar:3.1.2-SNAPSHOT generated by maven-surefire-plugin:test (default-test): j7m3.5.xb\archetype-models\archetype-catalog\target\surefire-reports\*.xml
[withMaven] junitPublisher - Archive test results for Maven artifact org.apache.maven.archetype:archetype-descriptor:jar:3.1.2-SNAPSHOT generated by maven-surefire-plugin:test (default-test): j7m3.5.xb\archetype-models\archetype-descriptor\target\surefire-reports\*.xml
[withMaven] junitPublisher - Archive test results for Maven artifact org.apache.maven.archetype:archetype-common:jar:3.1.2-SNAPSHOT generated by maven-surefire-plugin:test (default-test): j7m3.5.xb\archetype-common\target\surefire-reports\*.xml
[withMaven] junitPublisher - Archive test results for Maven artifact org.apache.maven.archetype:archetype-packaging:jar:3.1.2-SNAPSHOT generated by maven-surefire-plugin:test (default-test): j7m3.5.xb\archetype-packaging\target\surefire-reports\*.xml
[withMaven] junitPublisher - Archive test results for Maven artifact org.apache.maven.plugins:maven-archetype-plugin:maven-plugin:3.1.2-SNAPSHOT generated by maven-surefire-plugin:test (default-test): j7m3.5.xb\maven-archetype-plugin\target\surefire-reports\*.xml
Recording test results
[withMaven] artifactsPublisher - Archive artifact linux-jdk7-m3.2.x_build/maven-archetype-plugin/pom.xml under org/apache/maven/plugins/maven-archetype-plugin/3.1.2-SNAPSHOT/maven-archetype-plugin-3.1.2-SNAPSHOT.pom
[withMaven] artifactsPublisher - Archive artifact linux-jdk7-m3.2.x_build/maven-archetype-plugin/target/maven-archetype-plugin-3.1.2-SNAPSHOT.jar under org/apache/maven/plugins/maven-archetype-plugin/3.1.2-SNAPSHOT/maven-archetype-plugin-3.1.2-SNAPSHOT.jar
[withMaven] openTasksPublisher - Scan Tasks for Maven artifact org.apache.maven.archetype:archetype-common:jar:3.1.2-SNAPSHOT in source directory j7m3.5.xb\archetype-common\src\main\java
[withMaven] openTasksPublisher - Scan Tasks for Maven artifact org.apache.maven.plugins:maven-archetype-plugin:maven-plugin:3.1.2-SNAPSHOT in source directory j7m3.5.xb\maven-archetype-plugin\src\main\java
[TASKS] Scanning folder 'F:\short\jenkins-maven-box-maven-archetype-ARCHETYPE-571-7@3' for files matching the pattern 'j7m3.5.xb\archetype-common\src\main\java\**\*,j7m3.5.xb\maven-archetype-plugin\src\main\java\**\*' - excludes: null
[TASKS] Found 89 files to scan for tasks
[TASKS] Found 26 open tasks.
Skipping warnings blame since pipelines do not have an SCM link.%n
[TASKS] Computing warning deltas based on reference build #5
[withMaven] invokerPublisher - Archive invoker results for Maven artifact MavenArtifact{org.apache.maven.plugins:maven-archetype-plugin:maven-plugin:3.1.2-SNAPSHOT(version: 3.1.2-SNAPSHOT, snapshot:false) } generated by PluginInvocation{org.apache.maven.plugins:maven-invoker-plugin:3.1.0@run  integration-test}: j7m3.5.xb\maven-archetype-plugin\target\invoker-reports\*.xml
[withMaven] junitPublisher - Archive test results for Maven artifact org.apache.maven.archetype:archetype-catalog:jar:3.1.2-SNAPSHOT generated by maven-surefire-plugin:test (default-test): linux-jdk7-m3.2.x_build/archetype-models/archetype-catalog/target/surefire-reports/*.xml
[withMaven] junitPublisher - Archive test results for Maven artifact org.apache.maven.archetype:archetype-descriptor:jar:3.1.2-SNAPSHOT generated by maven-surefire-plugin:test (default-test): linux-jdk7-m3.2.x_build/archetype-models/archetype-descriptor/target/surefire-reports/*.xml
[withMaven] junitPublisher - Archive test results for Maven artifact org.apache.maven.archetype:archetype-common:jar:3.1.2-SNAPSHOT generated by maven-surefire-plugin:test (default-test): linux-jdk7-m3.2.x_build/archetype-common/target/surefire-reports/*.xml
[withMaven] junitPublisher - Archive test results for Maven artifact org.apache.maven.archetype:archetype-packaging:jar:3.1.2-SNAPSHOT generated by maven-surefire-plugin:test (default-test): linux-jdk7-m3.2.x_build/archetype-packaging/target/surefire-reports/*.xml
[withMaven] junitPublisher - Archive test results for Maven artifact org.apache.maven.plugins:maven-archetype-plugin:maven-plugin:3.1.2-SNAPSHOT generated by maven-surefire-plugin:test (default-test): linux-jdk7-m3.2.x_build/maven-archetype-plugin/target/surefire-reports/*.xml
Recording test results
[withMaven] openTasksPublisher - Scan Tasks for Maven artifact org.apache.maven.archetype:archetype-common:jar:3.1.2-SNAPSHOT in source directory linux-jdk7-m3.2.x_build/archetype-common/src/main/java
[withMaven] openTasksPublisher - Scan Tasks for Maven artifact org.apache.maven.plugins:maven-archetype-plugin:maven-plugin:3.1.2-SNAPSHOT in source directory linux-jdk7-m3.2.x_build/maven-archetype-plugin/src/main/java
[TASKS] Scanning folder '/home/jenkins/jenkins-slave/workspace/ox_maven-archetype_ARCHETYPE-571@2' for files matching the pattern 'linux-jdk7-m3.2.x_build/archetype-common/src/main/java/**/*,linux-jdk7-m3.2.x_build/maven-archetype-plugin/src/main/java/**/*' - excludes: null
[TASKS] Found 89 files to scan for tasks
[TASKS] Found 26 open tasks.
Skipping warnings blame since pipelines do not have an SCM link.%n
[TASKS] Computing warning deltas based on reference build #5
[withMaven] Publishers: Generated Artifacts Publisher: 376 ms, Junit Publisher: 353 ms, Open Task Scanner Publisher: 339 ms, Dependencies Fingerprint Publisher: 69 ms, Invoker Publisher: 19267 ms, Pipeline Graph Publisher: 4 ms
[Pipeline] // withMaven
[Pipeline] cleanWs
[WS-CLEANUP] Deleting project workspace...
[WS-CLEANUP] Deferred wipeout is used...
[WS-CLEANUP] done
[Pipeline] }
[Pipeline] // stage
[Pipeline] }
[Pipeline] // ws
[Pipeline] }
[withMaven] invokerPublisher - Archive invoker results for Maven artifact MavenArtifact{org.apache.maven.plugins:maven-archetype-plugin:maven-plugin:3.1.2-SNAPSHOT(version: 3.1.2-SNAPSHOT, snapshot:false) } generated by PluginInvocation{org.apache.maven.plugins:maven-invoker-plugin:3.1.0@run  integration-test}: linux-jdk7-m3.2.x_build/maven-archetype-plugin/target/invoker-reports/*.xml
[Pipeline] // node
[Pipeline] }
[withMaven] Publishers: Generated Artifacts Publisher: 501 ms, Junit Publisher: 529 ms, Open Task Scanner Publisher: 351 ms, Dependencies Fingerprint Publisher: 64 ms, Invoker Publisher: 22016 ms, Pipeline Graph Publisher: 5 ms
[Pipeline] // withMaven
[Pipeline] cleanWs
[WS-CLEANUP] Deleting project workspace...
[WS-CLEANUP] Deferred wipeout is used...
[WS-CLEANUP] done
[Pipeline] }
[Pipeline] // stage
[Pipeline] }
[Pipeline] // ws
[Pipeline] }
[Pipeline] // node
[Pipeline] }
[withMaven] Publishers: Generated Artifacts Publisher: 438 ms, Junit Publisher: 429 ms, Open Task Scanner Publisher: 335 ms, Dependencies Fingerprint Publisher: 67 ms, Invoker Publisher: 22564 ms, Pipeline Graph Publisher: 4 ms
[Pipeline] // withMaven
[Pipeline] cleanWs
[WS-CLEANUP] Deleting project workspace...
[WS-CLEANUP] Deferred wipeout is used...
[WS-CLEANUP] done
[Pipeline] }
[Pipeline] // stage
[Pipeline] }
[Pipeline] // ws
[Pipeline] }
[Pipeline] // node
[Pipeline] }
[withMaven] Publishers: Generated Artifacts Publisher: 5891 ms, Junit Publisher: 8103 ms, Open Task Scanner Publisher: 3583 ms, Dependencies Fingerprint Publisher: 1554 ms, Invoker Publisher: 25215 ms, Pipeline Graph Publisher: 4 ms
[Pipeline] // withMaven
[Pipeline] cleanWs
[WS-CLEANUP] Deleting project workspace...
[WS-CLEANUP] Deferred wipeout is used...
[WS-CLEANUP] done
[Pipeline] }
[Pipeline] // stage
[Pipeline] }
[Pipeline] // ws
[Pipeline] }
[Pipeline] // node
[Pipeline] }
[withMaven] Publishers: Generated Artifacts Publisher: 5884 ms, Junit Publisher: 7950 ms, Open Task Scanner Publisher: 3546 ms, Dependencies Fingerprint Publisher: 1522 ms, Invoker Publisher: 24588 ms, Pipeline Graph Publisher: 4 ms
[Pipeline] // withMaven
[Pipeline] cleanWs
[WS-CLEANUP] Deleting project workspace...
[WS-CLEANUP] Deferred wipeout is used...
[WS-CLEANUP] done
[Pipeline] }
[Pipeline] // stage
[Pipeline] }
[Pipeline] // ws
[Pipeline] }
[Pipeline] // node
[Pipeline] }
[Pipeline] // parallel
[Pipeline] stage
[Pipeline] { (Notifications)
[Pipeline] echo
Build result: FAILURE
[Pipeline] jiraIssueSelector
[Pipeline] emailext

Build succeeded in Jenkins: Maven TLP » maven-archetype » ARCHETYPE-571 #11

Posted by Apache Jenkins Server <je...@builds.apache.org>.
See https://builds.apache.org/job/maven-box/job/maven-archetype/job/ARCHETYPE-571/11/

No changes.

All tests passed

Build failed in Jenkins: Maven TLP » maven-archetype » ARCHETYPE-571 #10

Posted by Apache Jenkins Server <je...@builds.apache.org>.
See https://builds.apache.org/job/maven-box/job/maven-archetype/job/ARCHETYPE-571/10/

No changes.

All tests passed

Build log:
[...truncated 20920 lines...]
[INFO] Maven Archetype Common ............................. SUCCESS [ 17.299 s]
[INFO] Maven Archetype Packaging .......................... SUCCESS [  0.454 s]
[INFO] Maven Archetype Plugin ............................. SUCCESS [04:46 min]
[INFO] ------------------------------------------------------------------------
[INFO] BUILD SUCCESS
[INFO] ------------------------------------------------------------------------
[INFO] Total time:  05:15 min
[INFO] Finished at: 2019-08-15T17:36:55Z
[INFO] ------------------------------------------------------------------------
[INFO] [jenkins-event-spy] Generated /home/jenkins/jenkins-slave/workspace/ox_maven-archetype_ARCHETYPE-571@2@tmp/withMaven70b1f3e7/maven-spy-20190815-173140-29116608811947017552916.log
[Pipeline] }
[Pipeline] // dir
[Pipeline] }
[withMaven] artifactsPublisher - Archive artifact linux-jdk11-m3.6.x_build/pom.xml under org/apache/maven/archetype/maven-archetype/3.1.2-SNAPSHOT/maven-archetype-3.1.2-SNAPSHOT.pom
[withMaven] artifactsPublisher - Archive artifact linux-jdk11-m3.6.x_build/target/maven-archetype-3.1.2-SNAPSHOT-site.xml under org/apache/maven/archetype/maven-archetype/3.1.2-SNAPSHOT/maven-archetype-3.1.2-SNAPSHOT-site.xml
[withMaven] artifactsPublisher - Archive artifact linux-jdk11-m3.6.x_build/archetype-models/pom.xml under org/apache/maven/archetype/archetype-models/3.1.2-SNAPSHOT/archetype-models-3.1.2-SNAPSHOT.pom
[withMaven] artifactsPublisher - Archive artifact linux-jdk11-m3.6.x_build/archetype-models/target/archetype-models-3.1.2-SNAPSHOT-site.xml under org/apache/maven/archetype/archetype-models/3.1.2-SNAPSHOT/archetype-models-3.1.2-SNAPSHOT-site.xml
[withMaven] artifactsPublisher - Archive artifact linux-jdk11-m3.6.x_build/archetype-models/archetype-catalog/pom.xml under org/apache/maven/archetype/archetype-catalog/3.1.2-SNAPSHOT/archetype-catalog-3.1.2-SNAPSHOT.pom
[INFO] run post-build script verify.bsh
[INFO]           build-archetype/pom.xml .......................... SUCCESS (13.7 s)
[INFO] Building: exclude-patterns-2/pom.xml
[withMaven] artifactsPublisher - Archive artifact linux-jdk11-m3.6.x_build/archetype-models/archetype-catalog/target/archetype-catalog-3.1.2-SNAPSHOT.jar under org/apache/maven/archetype/archetype-catalog/3.1.2-SNAPSHOT/archetype-catalog-3.1.2-SNAPSHOT.jar
[withMaven] artifactsPublisher - Archive artifact linux-jdk11-m3.6.x_build/archetype-models/archetype-descriptor/pom.xml under org/apache/maven/archetype/archetype-descriptor/3.1.2-SNAPSHOT/archetype-descriptor-3.1.2-SNAPSHOT.pom
[INFO] run post-build script verify.groovy
[INFO]           create-1/pom.xml ................................. SUCCESS (8.1 s)
[INFO] Building: exclude-patterns-2/pom.xml
[withMaven] artifactsPublisher - Archive artifact linux-jdk11-m3.6.x_build/archetype-models/archetype-descriptor/target/archetype-descriptor-3.1.2-SNAPSHOT.jar under org/apache/maven/archetype/archetype-descriptor/3.1.2-SNAPSHOT/archetype-descriptor-3.1.2-SNAPSHOT.jar
[withMaven] artifactsPublisher - Archive artifact linux-jdk11-m3.6.x_build/archetype-common/pom.xml under org/apache/maven/archetype/archetype-common/3.1.2-SNAPSHOT/archetype-common-3.1.2-SNAPSHOT.pom
[withMaven] artifactsPublisher - Archive artifact linux-jdk11-m3.6.x_build/archetype-common/target/archetype-common-3.1.2-SNAPSHOT.jar under org/apache/maven/archetype/archetype-common/3.1.2-SNAPSHOT/archetype-common-3.1.2-SNAPSHOT.jar
[withMaven] artifactsPublisher - Archive artifact linux-jdk11-m3.6.x_build/archetype-packaging/pom.xml under org/apache/maven/archetype/archetype-packaging/3.1.2-SNAPSHOT/archetype-packaging-3.1.2-SNAPSHOT.pom
[withMaven] artifactsPublisher - Archive artifact linux-jdk11-m3.6.x_build/archetype-packaging/target/archetype-packaging-3.1.2-SNAPSHOT.jar under org/apache/maven/archetype/archetype-packaging/3.1.2-SNAPSHOT/archetype-packaging-3.1.2-SNAPSHOT.jar
[withMaven] artifactsPublisher - Archive artifact linux-jdk11-m3.6.x_build/maven-archetype-plugin/pom.xml under org/apache/maven/plugins/maven-archetype-plugin/3.1.2-SNAPSHOT/maven-archetype-plugin-3.1.2-SNAPSHOT.pom
[withMaven] artifactsPublisher - Archive artifact linux-jdk11-m3.6.x_build/maven-archetype-plugin/target/maven-archetype-plugin-3.1.2-SNAPSHOT.jar under org/apache/maven/plugins/maven-archetype-plugin/3.1.2-SNAPSHOT/maven-archetype-plugin-3.1.2-SNAPSHOT.jar
[withMaven] junitPublisher - Archive test results for Maven artifact org.apache.maven.archetype:archetype-catalog:jar:3.1.2-SNAPSHOT generated by maven-surefire-plugin:test (default-test): linux-jdk11-m3.6.x_build/archetype-models/archetype-catalog/target/surefire-reports/*.xml
[withMaven] junitPublisher - Archive test results for Maven artifact org.apache.maven.archetype:archetype-descriptor:jar:3.1.2-SNAPSHOT generated by maven-surefire-plugin:test (default-test): linux-jdk11-m3.6.x_build/archetype-models/archetype-descriptor/target/surefire-reports/*.xml
[withMaven] junitPublisher - Archive test results for Maven artifact org.apache.maven.archetype:archetype-common:jar:3.1.2-SNAPSHOT generated by maven-surefire-plugin:test (default-test): linux-jdk11-m3.6.x_build/archetype-common/target/surefire-reports/*.xml
[withMaven] junitPublisher - Archive test results for Maven artifact org.apache.maven.archetype:archetype-packaging:jar:3.1.2-SNAPSHOT generated by maven-surefire-plugin:test (default-test): linux-jdk11-m3.6.x_build/archetype-packaging/target/surefire-reports/*.xml
[withMaven] junitPublisher - Archive test results for Maven artifact org.apache.maven.plugins:maven-archetype-plugin:maven-plugin:3.1.2-SNAPSHOT generated by maven-surefire-plugin:test (default-test): linux-jdk11-m3.6.x_build/maven-archetype-plugin/target/surefire-reports/*.xml
Recording test results
[INFO] run post-build script verify.groovy
[INFO]           exclude-patterns-2/pom.xml ....................... SUCCESS (8.0 s)
[INFO] -------------------------------------------------
[INFO] Build Summary:
[INFO]   Passed: 25, Failed: 0, Errors: 0, Skipped: 0
[INFO] -------------------------------------------------
[INFO] 
[INFO] --- mrm-maven-plugin:1.1.0:stop (mirror) @ maven-archetype-plugin ---
[INFO] Stopping Mock Repository Manager on http://localhost:38219
[INFO] Stopped SocketConnector@0.0.0.0:38219
[INFO] Mock Repository Manager http://localhost:38219 is stopped.
[INFO] 
[INFO] --- mrm-maven-plugin:1.1.0:stop (archetype-repository) @ maven-archetype-plugin ---
[INFO] Stopping Mock Repository Manager on http://localhost:36559
[INFO] Stopped SocketConnector@0.0.0.0:36559
[INFO] Mock Repository Manager http://localhost:36559 is stopped.
[INFO] 
[INFO] --- maven-checkstyle-plugin:3.0.0:check (checkstyle-check) @ maven-archetype-plugin ---
[INFO] There are 46 errors reported by Checkstyle 6.18 with config/maven_checks.xml ruleset.
[INFO] Ignored 46 errors, 0 violation remaining.
[INFO] ------------------------------------------------------------------------
[INFO] Reactor Summary for Maven Archetype 3.1.2-SNAPSHOT:
[INFO] 
[INFO] Maven Archetype .................................... SUCCESS [  9.723 s]
[INFO] Maven Archetype Models ............................. SUCCESS [  0.561 s]
[INFO] Maven Archetype Catalog Model ...................... SUCCESS [  5.944 s]
[INFO] Maven Archetype Descriptor Model ................... SUCCESS [  1.032 s]
[INFO] Maven Archetype Common ............................. SUCCESS [ 19.222 s]
[INFO] Maven Archetype Packaging .......................... SUCCESS [  0.492 s]
[INFO] Maven Archetype Plugin ............................. SUCCESS [04:22 min]
[INFO] ------------------------------------------------------------------------
[INFO] BUILD SUCCESS
[INFO] ------------------------------------------------------------------------
[INFO] Total time:  05:00 min
[INFO] Finished at: 2019-08-15T17:37:08Z
[INFO] ------------------------------------------------------------------------
[INFO] [jenkins-event-spy] Generated /home/jenkins/jenkins-slave/workspace/ox_maven-archetype_ARCHETYPE-571@2@tmp/withMavenc877a90a/maven-spy-20190815-173207-32815390579595637597467.log
[INFO] run post-build script verify.groovy
[INFO]           exclude-patterns-2/pom.xml ....................... SUCCESS (8.0 s)
[INFO] Building: ARCHETYPE-517_failing-goals
[INFO] run pre-build script setup.groovy
[Pipeline] }
[Pipeline] // dir
[Pipeline] }
[withMaven] openTasksPublisher - Scan Tasks for Maven artifact org.apache.maven.archetype:archetype-common:jar:3.1.2-SNAPSHOT in source directory linux-jdk11-m3.6.x_build/archetype-common/src/main/java
[withMaven] openTasksPublisher - Scan Tasks for Maven artifact org.apache.maven.plugins:maven-archetype-plugin:maven-plugin:3.1.2-SNAPSHOT in source directory linux-jdk11-m3.6.x_build/maven-archetype-plugin/src/main/java
[withMaven] artifactsPublisher - Archive artifact linux-jdk12-m3.6.x_build/pom.xml under org/apache/maven/archetype/maven-archetype/3.1.2-SNAPSHOT/maven-archetype-3.1.2-SNAPSHOT.pom
[TASKS] Scanning folder '/home/jenkins/jenkins-slave/workspace/ox_maven-archetype_ARCHETYPE-571@2' for files matching the pattern 'linux-jdk11-m3.6.x_build/archetype-common/src/main/java/**/*,linux-jdk11-m3.6.x_build/maven-archetype-plugin/src/main/java/**/*' - excludes: null
[TASKS] Found 89 files to scan for tasks
[TASKS] Found 26 open tasks.
Skipping warnings blame since pipelines do not have an SCM link.%n
[TASKS] Computing warning deltas based on reference build #5
[withMaven] artifactsPublisher - Archive artifact linux-jdk12-m3.6.x_build/target/maven-archetype-3.1.2-SNAPSHOT-site.xml under org/apache/maven/archetype/maven-archetype/3.1.2-SNAPSHOT/maven-archetype-3.1.2-SNAPSHOT-site.xml
[withMaven] artifactsPublisher - Archive artifact linux-jdk12-m3.6.x_build/archetype-models/pom.xml under org/apache/maven/archetype/archetype-models/3.1.2-SNAPSHOT/archetype-models-3.1.2-SNAPSHOT.pom
[withMaven] artifactsPublisher - Archive artifact linux-jdk12-m3.6.x_build/archetype-models/target/archetype-models-3.1.2-SNAPSHOT-site.xml under org/apache/maven/archetype/archetype-models/3.1.2-SNAPSHOT/archetype-models-3.1.2-SNAPSHOT-site.xml
[INFO] run post-build script verify.groovy
[INFO]           ARCHETYPE-517_failing-goals ...................... SUCCESS (5.9 s)
[INFO] Building: exclude-patterns/pom.xml
[withMaven] artifactsPublisher - Archive artifact linux-jdk12-m3.6.x_build/archetype-models/archetype-catalog/pom.xml under org/apache/maven/archetype/archetype-catalog/3.1.2-SNAPSHOT/archetype-catalog-3.1.2-SNAPSHOT.pom
[withMaven] artifactsPublisher - Archive artifact linux-jdk12-m3.6.x_build/archetype-models/archetype-catalog/target/archetype-catalog-3.1.2-SNAPSHOT.jar under org/apache/maven/archetype/archetype-catalog/3.1.2-SNAPSHOT/archetype-catalog-3.1.2-SNAPSHOT.jar
[withMaven] artifactsPublisher - Archive artifact linux-jdk12-m3.6.x_build/archetype-models/archetype-descriptor/pom.xml under org/apache/maven/archetype/archetype-descriptor/3.1.2-SNAPSHOT/archetype-descriptor-3.1.2-SNAPSHOT.pom
[withMaven] artifactsPublisher - Archive artifact linux-jdk12-m3.6.x_build/archetype-models/archetype-descriptor/target/archetype-descriptor-3.1.2-SNAPSHOT.jar under org/apache/maven/archetype/archetype-descriptor/3.1.2-SNAPSHOT/archetype-descriptor-3.1.2-SNAPSHOT.jar
[withMaven] artifactsPublisher - Archive artifact linux-jdk12-m3.6.x_build/archetype-common/pom.xml under org/apache/maven/archetype/archetype-common/3.1.2-SNAPSHOT/archetype-common-3.1.2-SNAPSHOT.pom
[withMaven] artifactsPublisher - Archive artifact linux-jdk12-m3.6.x_build/archetype-common/target/archetype-common-3.1.2-SNAPSHOT.jar under org/apache/maven/archetype/archetype-common/3.1.2-SNAPSHOT/archetype-common-3.1.2-SNAPSHOT.jar
[withMaven] artifactsPublisher - Archive artifact linux-jdk12-m3.6.x_build/archetype-packaging/pom.xml under org/apache/maven/archetype/archetype-packaging/3.1.2-SNAPSHOT/archetype-packaging-3.1.2-SNAPSHOT.pom
[withMaven] artifactsPublisher - Archive artifact linux-jdk12-m3.6.x_build/archetype-packaging/target/archetype-packaging-3.1.2-SNAPSHOT.jar under org/apache/maven/archetype/archetype-packaging/3.1.2-SNAPSHOT/archetype-packaging-3.1.2-SNAPSHOT.jar
[withMaven] invokerPublisher - Archive invoker results for Maven artifact MavenArtifact{org.apache.maven.plugins:maven-archetype-plugin:maven-plugin:3.1.2-SNAPSHOT(version: 3.1.2-SNAPSHOT, snapshot:false) } generated by PluginInvocation{org.apache.maven.plugins:maven-invoker-plugin:3.1.0@run  integration-test}: linux-jdk11-m3.6.x_build/maven-archetype-plugin/target/invoker-reports/*.xml
[withMaven] artifactsPublisher - Archive artifact linux-jdk12-m3.6.x_build/maven-archetype-plugin/pom.xml under org/apache/maven/plugins/maven-archetype-plugin/3.1.2-SNAPSHOT/maven-archetype-plugin-3.1.2-SNAPSHOT.pom
[withMaven] artifactsPublisher - Archive artifact linux-jdk12-m3.6.x_build/maven-archetype-plugin/target/maven-archetype-plugin-3.1.2-SNAPSHOT.jar under org/apache/maven/plugins/maven-archetype-plugin/3.1.2-SNAPSHOT/maven-archetype-plugin-3.1.2-SNAPSHOT.jar
[withMaven] junitPublisher - Archive test results for Maven artifact org.apache.maven.archetype:archetype-catalog:jar:3.1.2-SNAPSHOT generated by maven-surefire-plugin:test (default-test): linux-jdk12-m3.6.x_build/archetype-models/archetype-catalog/target/surefire-reports/*.xml
[withMaven] junitPublisher - Archive test results for Maven artifact org.apache.maven.archetype:archetype-descriptor:jar:3.1.2-SNAPSHOT generated by maven-surefire-plugin:test (default-test): linux-jdk12-m3.6.x_build/archetype-models/archetype-descriptor/target/surefire-reports/*.xml
[withMaven] junitPublisher - Archive test results for Maven artifact org.apache.maven.archetype:archetype-common:jar:3.1.2-SNAPSHOT generated by maven-surefire-plugin:test (default-test): linux-jdk12-m3.6.x_build/archetype-common/target/surefire-reports/*.xml
[withMaven] junitPublisher - Archive test results for Maven artifact org.apache.maven.archetype:archetype-packaging:jar:3.1.2-SNAPSHOT generated by maven-surefire-plugin:test (default-test): linux-jdk12-m3.6.x_build/archetype-packaging/target/surefire-reports/*.xml
[withMaven] junitPublisher - Archive test results for Maven artifact org.apache.maven.plugins:maven-archetype-plugin:maven-plugin:3.1.2-SNAPSHOT generated by maven-surefire-plugin:test (default-test): linux-jdk12-m3.6.x_build/maven-archetype-plugin/target/surefire-reports/*.xml
Recording test results
[INFO] run post-build script verify.groovy
[INFO]           exclude-patterns/pom.xml ......................... SUCCESS (8.1 s)
[INFO] Building: create-3/pom.xml
[withMaven] openTasksPublisher - Scan Tasks for Maven artifact org.apache.maven.archetype:archetype-common:jar:3.1.2-SNAPSHOT in source directory linux-jdk12-m3.6.x_build/archetype-common/src/main/java
[withMaven] openTasksPublisher - Scan Tasks for Maven artifact org.apache.maven.plugins:maven-archetype-plugin:maven-plugin:3.1.2-SNAPSHOT in source directory linux-jdk12-m3.6.x_build/maven-archetype-plugin/src/main/java
[TASKS] Scanning folder '/home/jenkins/jenkins-slave/workspace/ox_maven-archetype_ARCHETYPE-571@2' for files matching the pattern 'linux-jdk12-m3.6.x_build/archetype-common/src/main/java/**/*,linux-jdk12-m3.6.x_build/maven-archetype-plugin/src/main/java/**/*' - excludes: null
[TASKS] Found 89 files to scan for tasks
[TASKS] Found 26 open tasks.
Skipping warnings blame since pipelines do not have an SCM link.%n
[TASKS] Computing warning deltas based on reference build #5
[INFO] run post-build script verify.groovy
[INFO]           create-3/pom.xml ................................. SUCCESS (8.2 s)
[INFO] Building: change-file-with-property/pom.xml
[withMaven] invokerPublisher - Archive invoker results for Maven artifact MavenArtifact{org.apache.maven.plugins:maven-archetype-plugin:maven-plugin:3.1.2-SNAPSHOT(version: 3.1.2-SNAPSHOT, snapshot:false) } generated by PluginInvocation{org.apache.maven.plugins:maven-invoker-plugin:3.1.0@run  integration-test}: linux-jdk12-m3.6.x_build/maven-archetype-plugin/target/invoker-reports/*.xml
[INFO] run post-build script verify.groovy
[INFO]           change-file-with-property/pom.xml ................ SUCCESS (8.1 s)
[INFO] Building: create-from-project/pom.xml
[withMaven] Publishers: Generated Artifacts Publisher: 5928 ms, Junit Publisher: 8171 ms, Open Task Scanner Publisher: 3705 ms, Dependencies Fingerprint Publisher: 1562 ms, Invoker Publisher: 28603 ms, Pipeline Graph Publisher: 8 ms
[Pipeline] // withMaven
[Pipeline] cleanWs
[INFO] run post-build script verify.bsh
[INFO]           create-from-project/pom.xml ...................... SUCCESS (8.0 s)
[INFO] -------------------------------------------------
[INFO] Build Summary:
[INFO]   Passed: 25, Failed: 0, Errors: 0, Skipped: 0
[INFO] -------------------------------------------------
[INFO] 
[INFO] --- mrm-maven-plugin:1.1.0:stop (mirror) @ maven-archetype-plugin ---
[INFO] Stopping Mock Repository Manager on http://localhost:38761
[INFO] Stopped SocketConnector@0.0.0.0:38761
[INFO] Mock Repository Manager http://localhost:38761 is stopped.
[INFO] 
[INFO] --- mrm-maven-plugin:1.1.0:stop (archetype-repository) @ maven-archetype-plugin ---
[INFO] Stopping Mock Repository Manager on http://localhost:36268
[INFO] Stopped SocketConnector@0.0.0.0:36268
[INFO] Mock Repository Manager http://localhost:36268 is stopped.
[INFO] 
[INFO] --- maven-checkstyle-plugin:3.0.0:check (checkstyle-check) @ maven-archetype-plugin ---
[WS-CLEANUP] Deleting project workspace...
[WS-CLEANUP] Deferred wipeout is used...
[WS-CLEANUP] done
[Pipeline] }
[Pipeline] // stage
[Pipeline] }
[Pipeline] // ws
[Pipeline] }
[INFO] There are 46 errors reported by Checkstyle 6.18 with config/maven_checks.xml ruleset.
[INFO] Ignored 46 errors, 0 violation remaining.
[INFO] ------------------------------------------------------------------------
[INFO] Reactor Summary for Maven Archetype 3.1.2-SNAPSHOT:
[INFO] 
[INFO] Maven Archetype .................................... SUCCESS [  6.044 s]
[INFO] Maven Archetype Models ............................. SUCCESS [  0.521 s]
[INFO] Maven Archetype Catalog Model ...................... SUCCESS [  3.340 s]
[INFO] Maven Archetype Descriptor Model ................... SUCCESS [  0.906 s]
[INFO] Maven Archetype Common ............................. SUCCESS [ 24.156 s]
[INFO] Maven Archetype Packaging .......................... SUCCESS [  0.459 s]
[INFO] Maven Archetype Plugin ............................. SUCCESS [04:40 min]
[INFO] ------------------------------------------------------------------------
[INFO] BUILD SUCCESS
[INFO] ------------------------------------------------------------------------
[INFO] Total time:  05:16 min
[INFO] Finished at: 2019-08-15T17:37:47Z
[INFO] ------------------------------------------------------------------------
[INFO] [jenkins-event-spy] Generated /home/jenkins/jenkins-slave/workspace/ox_maven-archetype_ARCHETYPE-571@2@tmp/withMavendd7be04c/maven-spy-20190815-173230-363626478409319774269.log
[Pipeline] // node
[Pipeline] }
[Pipeline] }
[Pipeline] // dir
[Pipeline] }
[withMaven] artifactsPublisher - Archive artifact linux-jdk13-m3.6.x_build/pom.xml under org/apache/maven/archetype/maven-archetype/3.1.2-SNAPSHOT/maven-archetype-3.1.2-SNAPSHOT.pom
[withMaven] artifactsPublisher - Archive artifact linux-jdk13-m3.6.x_build/target/maven-archetype-3.1.2-SNAPSHOT-site.xml under org/apache/maven/archetype/maven-archetype/3.1.2-SNAPSHOT/maven-archetype-3.1.2-SNAPSHOT-site.xml
[withMaven] artifactsPublisher - Archive artifact linux-jdk13-m3.6.x_build/archetype-models/pom.xml under org/apache/maven/archetype/archetype-models/3.1.2-SNAPSHOT/archetype-models-3.1.2-SNAPSHOT.pom
[withMaven] artifactsPublisher - Archive artifact linux-jdk13-m3.6.x_build/archetype-models/target/archetype-models-3.1.2-SNAPSHOT-site.xml under org/apache/maven/archetype/archetype-models/3.1.2-SNAPSHOT/archetype-models-3.1.2-SNAPSHOT-site.xml
[withMaven] artifactsPublisher - Archive artifact linux-jdk13-m3.6.x_build/archetype-models/archetype-catalog/pom.xml under org/apache/maven/archetype/archetype-catalog/3.1.2-SNAPSHOT/archetype-catalog-3.1.2-SNAPSHOT.pom
[withMaven] artifactsPublisher - Archive artifact linux-jdk13-m3.6.x_build/archetype-models/archetype-catalog/target/archetype-catalog-3.1.2-SNAPSHOT.jar under org/apache/maven/archetype/archetype-catalog/3.1.2-SNAPSHOT/archetype-catalog-3.1.2-SNAPSHOT.jar
[withMaven] artifactsPublisher - Archive artifact linux-jdk13-m3.6.x_build/archetype-models/archetype-descriptor/pom.xml under org/apache/maven/archetype/archetype-descriptor/3.1.2-SNAPSHOT/archetype-descriptor-3.1.2-SNAPSHOT.pom
[withMaven] artifactsPublisher - Archive artifact linux-jdk13-m3.6.x_build/archetype-models/archetype-descriptor/target/archetype-descriptor-3.1.2-SNAPSHOT.jar under org/apache/maven/archetype/archetype-descriptor/3.1.2-SNAPSHOT/archetype-descriptor-3.1.2-SNAPSHOT.jar
[withMaven] artifactsPublisher - Archive artifact linux-jdk13-m3.6.x_build/archetype-common/pom.xml under org/apache/maven/archetype/archetype-common/3.1.2-SNAPSHOT/archetype-common-3.1.2-SNAPSHOT.pom
[withMaven] artifactsPublisher - Archive artifact linux-jdk13-m3.6.x_build/archetype-common/target/archetype-common-3.1.2-SNAPSHOT.jar under org/apache/maven/archetype/archetype-common/3.1.2-SNAPSHOT/archetype-common-3.1.2-SNAPSHOT.jar
[withMaven] artifactsPublisher - Archive artifact linux-jdk13-m3.6.x_build/archetype-packaging/pom.xml under org/apache/maven/archetype/archetype-packaging/3.1.2-SNAPSHOT/archetype-packaging-3.1.2-SNAPSHOT.pom
[withMaven] artifactsPublisher - Archive artifact linux-jdk13-m3.6.x_build/archetype-packaging/target/archetype-packaging-3.1.2-SNAPSHOT.jar under org/apache/maven/archetype/archetype-packaging/3.1.2-SNAPSHOT/archetype-packaging-3.1.2-SNAPSHOT.jar
[withMaven] artifactsPublisher - Archive artifact linux-jdk13-m3.6.x_build/maven-archetype-plugin/pom.xml under org/apache/maven/plugins/maven-archetype-plugin/3.1.2-SNAPSHOT/maven-archetype-plugin-3.1.2-SNAPSHOT.pom
[withMaven] artifactsPublisher - Archive artifact linux-jdk13-m3.6.x_build/maven-archetype-plugin/target/maven-archetype-plugin-3.1.2-SNAPSHOT.jar under org/apache/maven/plugins/maven-archetype-plugin/3.1.2-SNAPSHOT/maven-archetype-plugin-3.1.2-SNAPSHOT.jar
[withMaven] junitPublisher - Archive test results for Maven artifact org.apache.maven.archetype:archetype-catalog:jar:3.1.2-SNAPSHOT generated by maven-surefire-plugin:test (default-test): linux-jdk13-m3.6.x_build/archetype-models/archetype-catalog/target/surefire-reports/*.xml
[withMaven] junitPublisher - Archive test results for Maven artifact org.apache.maven.archetype:archetype-descriptor:jar:3.1.2-SNAPSHOT generated by maven-surefire-plugin:test (default-test): linux-jdk13-m3.6.x_build/archetype-models/archetype-descriptor/target/surefire-reports/*.xml
[withMaven] junitPublisher - Archive test results for Maven artifact org.apache.maven.archetype:archetype-common:jar:3.1.2-SNAPSHOT generated by maven-surefire-plugin:test (default-test): linux-jdk13-m3.6.x_build/archetype-common/target/surefire-reports/*.xml
[withMaven] junitPublisher - Archive test results for Maven artifact org.apache.maven.archetype:archetype-packaging:jar:3.1.2-SNAPSHOT generated by maven-surefire-plugin:test (default-test): linux-jdk13-m3.6.x_build/archetype-packaging/target/surefire-reports/*.xml
[withMaven] junitPublisher - Archive test results for Maven artifact org.apache.maven.plugins:maven-archetype-plugin:maven-plugin:3.1.2-SNAPSHOT generated by maven-surefire-plugin:test (default-test): linux-jdk13-m3.6.x_build/maven-archetype-plugin/target/surefire-reports/*.xml
Recording test results
[withMaven] Publishers: Generated Artifacts Publisher: 5872 ms, Junit Publisher: 8305 ms, Open Task Scanner Publisher: 3823 ms, Dependencies Fingerprint Publisher: 1547 ms, Invoker Publisher: 30433 ms, Pipeline Graph Publisher: 3 ms
[Pipeline] // withMaven
[Pipeline] cleanWs
[WS-CLEANUP] Deleting project workspace...
[WS-CLEANUP] Deferred wipeout is used...
[withMaven] openTasksPublisher - Scan Tasks for Maven artifact org.apache.maven.archetype:archetype-common:jar:3.1.2-SNAPSHOT in source directory linux-jdk13-m3.6.x_build/archetype-common/src/main/java
[WS-CLEANUP] done
[Pipeline] }
[Pipeline] // stage
[Pipeline] }
[Pipeline] // ws
[Pipeline] }
[withMaven] openTasksPublisher - Scan Tasks for Maven artifact org.apache.maven.plugins:maven-archetype-plugin:maven-plugin:3.1.2-SNAPSHOT in source directory linux-jdk13-m3.6.x_build/maven-archetype-plugin/src/main/java
[Pipeline] // node
[Pipeline] }
[TASKS] Scanning folder '/home/jenkins/jenkins-slave/workspace/ox_maven-archetype_ARCHETYPE-571@2' for files matching the pattern 'linux-jdk13-m3.6.x_build/archetype-common/src/main/java/**/*,linux-jdk13-m3.6.x_build/maven-archetype-plugin/src/main/java/**/*' - excludes: null
[TASKS] Found 89 files to scan for tasks
[TASKS] Found 26 open tasks.
Skipping warnings blame since pipelines do not have an SCM link.%n
[TASKS] Computing warning deltas based on reference build #5
[withMaven] invokerPublisher - Archive invoker results for Maven artifact MavenArtifact{org.apache.maven.plugins:maven-archetype-plugin:maven-plugin:3.1.2-SNAPSHOT(version: 3.1.2-SNAPSHOT, snapshot:false) } generated by PluginInvocation{org.apache.maven.plugins:maven-invoker-plugin:3.1.0@run  integration-test}: linux-jdk13-m3.6.x_build/maven-archetype-plugin/target/invoker-reports/*.xml
[withMaven] Publishers: Generated Artifacts Publisher: 5907 ms, Junit Publisher: 8315 ms, Open Task Scanner Publisher: 3597 ms, Dependencies Fingerprint Publisher: 1558 ms, Invoker Publisher: 27896 ms, Pipeline Graph Publisher: 5 ms
[Pipeline] // withMaven
[Pipeline] cleanWs
[WS-CLEANUP] Deleting project workspace...
[WS-CLEANUP] Deferred wipeout is used...
[WS-CLEANUP] done
[Pipeline] }
[Pipeline] // stage
[Pipeline] }
[Pipeline] // ws
[Pipeline] }
[Pipeline] // node
[Pipeline] }
[Pipeline] // parallel
[Pipeline] stage
[Pipeline] { (Notifications)
[Pipeline] echo
Build result: FAILURE
[Pipeline] jiraIssueSelector
[Pipeline] echo
The authors of changes [].
[Pipeline] echo
Sending email ...
[Pipeline] emailext

Build failed in Jenkins: Maven TLP » maven-archetype » ARCHETYPE-571 #9

Posted by Apache Jenkins Server <je...@builds.apache.org>.
See https://builds.apache.org/job/maven-box/job/maven-archetype/job/ARCHETYPE-571/9/

No changes.

All tests passed

Build log:
[...truncated 20981 lines...]
[INFO] Building: ARCHETYPE-536_groovy-grape/pom.xml
[INFO] snapshot org.apache.maven.plugins.archetype.its:archetype536-archetype:1.0-SNAPSHOT: checking for updates from Nexus
[INFO] artifact org.apache.maven.plugins.archetype.its.archetype536-archetype:1.0-SNAPSHOT: checking for updates from central
[INFO] run post-build script verify.groovy
[INFO]           ARCHETYPE-536_groovy-grape/pom.xml ............... SUCCESS (10.9 s)
[INFO] Building: create-from-project/pom.xml
[INFO] run post-build script verify.groovy
[INFO]           roundtrip-1-project .............................. SUCCESS (13.3 s)
[INFO] Building: exclude-patterns/pom.xml
[withMaven] Publishers: Generated Artifacts Publisher: 6011 ms, Junit Publisher: 8251 ms, Open Task Scanner Publisher: 3740 ms, Dependencies Fingerprint Publisher: 1657 ms, Invoker Publisher: 24487 ms, Pipeline Graph Publisher: 6 ms
[Pipeline] // withMaven
[Pipeline] cleanWs
[WS-CLEANUP] Deleting project workspace...
[WS-CLEANUP] Deferred wipeout is used...
[WS-CLEANUP] done
[Pipeline] }
[Pipeline] // stage
[Pipeline] }
[Pipeline] // ws
[Pipeline] }
[Pipeline] // node
[Pipeline] }
[INFO] run post-build script verify.bsh
[INFO]           create-from-project/pom.xml ...................... SUCCESS (8.5 s)
[INFO] Building: create-1/pom.xml
[INFO] run post-build script verify.groovy
[INFO]           exclude-patterns/pom.xml ......................... SUCCESS (6.3 s)
[INFO] Building: included-system-properties/pom.xml
[INFO] run post-build script verify.groovy
[INFO]           included-system-properties/pom.xml ............... SUCCESS (6.5 s)
[INFO] Building: create-3/pom.xml
[INFO] run post-build script verify.groovy
[INFO]           create-1/pom.xml ................................. SUCCESS (8.2 s)
[INFO] Building: generate-basic
[INFO] run post-build script verify.bsh
[INFO]           generate-basic ................................... SUCCESS (3.8 s)
[INFO] Building: create-from-project-exclude-patterns/pom.xml
[INFO] run post-build script verify.groovy
[INFO]           create-3/pom.xml ................................. SUCCESS (6.8 s)
[INFO] Building: change-file-with-property/pom.xml
[INFO] run post-build script verify.bsh
[INFO]           create-from-project-exclude-patterns/pom.xml ..... SUCCESS (8.2 s)
[INFO] Building: create-3/pom.xml
[INFO] run post-build script verify.groovy
[INFO]           change-file-with-property/pom.xml ................ SUCCESS (6.5 s)
[INFO] Building: build-and-run-its/pom.xml
[INFO] run post-build script verify.groovy
[INFO]           create-3/pom.xml ................................. SUCCESS (8.7 s)
[INFO] Building: exclude-patterns/pom.xml
[INFO] run post-build script verify.bsh
[INFO]           build-and-run-its/pom.xml ........................ SUCCESS (11.2 s)
[INFO] Building: create-2/pom.xml
[INFO] run post-build script verify.groovy
[INFO]           exclude-patterns/pom.xml ......................... SUCCESS (8.2 s)
[INFO] Building: build-ignore-eol/pom.xml
[INFO] run pre-build script setup.bsh
[INFO]           create-2/pom.xml ................................. SUCCESS (6.6 s)
[INFO] Building: create-5/pom.xml
[INFO] run post-build script verify.groovy
[INFO]           create-5/pom.xml ................................. SUCCESS (7.3 s)
[INFO] -------------------------------------------------
[INFO] Build Summary:
[INFO]   Passed: 25, Failed: 0, Errors: 0, Skipped: 0
[INFO] -------------------------------------------------
[INFO] 
[INFO] --- mrm-maven-plugin:1.1.0:stop (mirror) @ maven-archetype-plugin ---
[INFO] Stopping Mock Repository Manager on http://localhost:33163
[INFO] Stopped SocketConnector@0.0.0.0:33163
[INFO] Mock Repository Manager http://localhost:33163 is stopped.
[INFO] 
[INFO] --- mrm-maven-plugin:1.1.0:stop (archetype-repository) @ maven-archetype-plugin ---
[INFO] Stopping Mock Repository Manager on http://localhost:33254
[INFO] Stopped SocketConnector@0.0.0.0:33254
[INFO] Mock Repository Manager http://localhost:33254 is stopped.
[INFO] 
[INFO] --- maven-checkstyle-plugin:3.0.0:check (checkstyle-check) @ maven-archetype-plugin ---
[INFO] There are 46 errors reported by Checkstyle 6.18 with config/maven_checks.xml ruleset.
[INFO] Ignored 46 errors, 0 violation remaining.
[INFO] ------------------------------------------------------------------------
[INFO] Reactor Summary for Maven Archetype 3.1.2-SNAPSHOT:
[INFO] 
[INFO] Maven Archetype .................................... SUCCESS [ 11.154 s]
[INFO] Maven Archetype Models ............................. SUCCESS [  0.429 s]
[INFO] Maven Archetype Catalog Model ...................... SUCCESS [  4.071 s]
[INFO] Maven Archetype Descriptor Model ................... SUCCESS [  0.843 s]
[INFO] Maven Archetype Common ............................. SUCCESS [ 15.867 s]
[INFO] Maven Archetype Packaging .......................... SUCCESS [  0.407 s]
[INFO] Maven Archetype Plugin ............................. SUCCESS [03:51 min]
[INFO] ------------------------------------------------------------------------
[INFO] BUILD SUCCESS
[INFO] ------------------------------------------------------------------------
[INFO] Total time:  04:24 min
[INFO] Finished at: 2019-08-14T23:50:31Z
[INFO] ------------------------------------------------------------------------
[INFO] [jenkins-event-spy] Generated /home/jenkins/jenkins-slave/workspace/ox_maven-archetype_ARCHETYPE-571@2@tmp/withMavenf8bb74ab/maven-spy-20190814-234606-88511359648763181669871.log
[Pipeline] }
[Pipeline] // dir
[Pipeline] }
[withMaven] artifactsPublisher - Archive artifact linux-jdk12-m3.6.x_build/pom.xml under org/apache/maven/archetype/maven-archetype/3.1.2-SNAPSHOT/maven-archetype-3.1.2-SNAPSHOT.pom
[withMaven] artifactsPublisher - Archive artifact linux-jdk12-m3.6.x_build/target/maven-archetype-3.1.2-SNAPSHOT-site.xml under org/apache/maven/archetype/maven-archetype/3.1.2-SNAPSHOT/maven-archetype-3.1.2-SNAPSHOT-site.xml
[withMaven] artifactsPublisher - Archive artifact linux-jdk12-m3.6.x_build/archetype-models/pom.xml under org/apache/maven/archetype/archetype-models/3.1.2-SNAPSHOT/archetype-models-3.1.2-SNAPSHOT.pom
[withMaven] artifactsPublisher - Archive artifact linux-jdk12-m3.6.x_build/archetype-models/target/archetype-models-3.1.2-SNAPSHOT-site.xml under org/apache/maven/archetype/archetype-models/3.1.2-SNAPSHOT/archetype-models-3.1.2-SNAPSHOT-site.xml
[withMaven] artifactsPublisher - Archive artifact linux-jdk12-m3.6.x_build/archetype-models/archetype-catalog/pom.xml under org/apache/maven/archetype/archetype-catalog/3.1.2-SNAPSHOT/archetype-catalog-3.1.2-SNAPSHOT.pom
[withMaven] artifactsPublisher - Archive artifact linux-jdk12-m3.6.x_build/archetype-models/archetype-catalog/target/archetype-catalog-3.1.2-SNAPSHOT.jar under org/apache/maven/archetype/archetype-catalog/3.1.2-SNAPSHOT/archetype-catalog-3.1.2-SNAPSHOT.jar
[withMaven] artifactsPublisher - Archive artifact linux-jdk12-m3.6.x_build/archetype-models/archetype-descriptor/pom.xml under org/apache/maven/archetype/archetype-descriptor/3.1.2-SNAPSHOT/archetype-descriptor-3.1.2-SNAPSHOT.pom
[withMaven] artifactsPublisher - Archive artifact linux-jdk12-m3.6.x_build/archetype-models/archetype-descriptor/target/archetype-descriptor-3.1.2-SNAPSHOT.jar under org/apache/maven/archetype/archetype-descriptor/3.1.2-SNAPSHOT/archetype-descriptor-3.1.2-SNAPSHOT.jar
[withMaven] artifactsPublisher - Archive artifact linux-jdk12-m3.6.x_build/archetype-common/pom.xml under org/apache/maven/archetype/archetype-common/3.1.2-SNAPSHOT/archetype-common-3.1.2-SNAPSHOT.pom
[withMaven] artifactsPublisher - Archive artifact linux-jdk12-m3.6.x_build/archetype-common/target/archetype-common-3.1.2-SNAPSHOT.jar under org/apache/maven/archetype/archetype-common/3.1.2-SNAPSHOT/archetype-common-3.1.2-SNAPSHOT.jar
[withMaven] artifactsPublisher - Archive artifact linux-jdk12-m3.6.x_build/archetype-packaging/pom.xml under org/apache/maven/archetype/archetype-packaging/3.1.2-SNAPSHOT/archetype-packaging-3.1.2-SNAPSHOT.pom
[withMaven] artifactsPublisher - Archive artifact linux-jdk12-m3.6.x_build/archetype-packaging/target/archetype-packaging-3.1.2-SNAPSHOT.jar under org/apache/maven/archetype/archetype-packaging/3.1.2-SNAPSHOT/archetype-packaging-3.1.2-SNAPSHOT.jar
[withMaven] artifactsPublisher - Archive artifact linux-jdk12-m3.6.x_build/maven-archetype-plugin/pom.xml under org/apache/maven/plugins/maven-archetype-plugin/3.1.2-SNAPSHOT/maven-archetype-plugin-3.1.2-SNAPSHOT.pom
[withMaven] artifactsPublisher - Archive artifact linux-jdk12-m3.6.x_build/maven-archetype-plugin/target/maven-archetype-plugin-3.1.2-SNAPSHOT.jar under org/apache/maven/plugins/maven-archetype-plugin/3.1.2-SNAPSHOT/maven-archetype-plugin-3.1.2-SNAPSHOT.jar
[withMaven] junitPublisher - Archive test results for Maven artifact org.apache.maven.archetype:archetype-catalog:jar:3.1.2-SNAPSHOT generated by maven-surefire-plugin:test (default-test): linux-jdk12-m3.6.x_build/archetype-models/archetype-catalog/target/surefire-reports/*.xml
[withMaven] junitPublisher - Archive test results for Maven artifact org.apache.maven.archetype:archetype-descriptor:jar:3.1.2-SNAPSHOT generated by maven-surefire-plugin:test (default-test): linux-jdk12-m3.6.x_build/archetype-models/archetype-descriptor/target/surefire-reports/*.xml
[withMaven] junitPublisher - Archive test results for Maven artifact org.apache.maven.archetype:archetype-common:jar:3.1.2-SNAPSHOT generated by maven-surefire-plugin:test (default-test): linux-jdk12-m3.6.x_build/archetype-common/target/surefire-reports/*.xml
[withMaven] junitPublisher - Archive test results for Maven artifact org.apache.maven.archetype:archetype-packaging:jar:3.1.2-SNAPSHOT generated by maven-surefire-plugin:test (default-test): linux-jdk12-m3.6.x_build/archetype-packaging/target/surefire-reports/*.xml
[withMaven] junitPublisher - Archive test results for Maven artifact org.apache.maven.plugins:maven-archetype-plugin:maven-plugin:3.1.2-SNAPSHOT generated by maven-surefire-plugin:test (default-test): linux-jdk12-m3.6.x_build/maven-archetype-plugin/target/surefire-reports/*.xml
Recording test results
[INFO] run post-build script verify.bsh
[INFO]           build-ignore-eol/pom.xml ......................... SUCCESS (17.5 s)
[INFO] Building: create-4/pom.xml
[withMaven] openTasksPublisher - Scan Tasks for Maven artifact org.apache.maven.archetype:archetype-common:jar:3.1.2-SNAPSHOT in source directory linux-jdk12-m3.6.x_build/archetype-common/src/main/java
[INFO] run post-build script verify.groovy
[INFO]           create-4/pom.xml ................................. SUCCESS (8.5 s)
[INFO] Building: build-archetype/pom.xml
[INFO] run pre-build script setup.bsh
[withMaven] openTasksPublisher - Scan Tasks for Maven artifact org.apache.maven.plugins:maven-archetype-plugin:maven-plugin:3.1.2-SNAPSHOT in source directory linux-jdk12-m3.6.x_build/maven-archetype-plugin/src/main/java
[TASKS] Scanning folder '/home/jenkins/jenkins-slave/workspace/ox_maven-archetype_ARCHETYPE-571@2' for files matching the pattern 'linux-jdk12-m3.6.x_build/archetype-common/src/main/java/**/*,linux-jdk12-m3.6.x_build/maven-archetype-plugin/src/main/java/**/*' - excludes: null
[TASKS] Found 89 files to scan for tasks
[TASKS] Found 26 open tasks.
Skipping warnings blame since pipelines do not have an SCM link.%n
[TASKS] Computing warning deltas based on reference build #5
[withMaven] invokerPublisher - Archive invoker results for Maven artifact MavenArtifact{org.apache.maven.plugins:maven-archetype-plugin:maven-plugin:3.1.2-SNAPSHOT(version: 3.1.2-SNAPSHOT, snapshot:false) } generated by PluginInvocation{org.apache.maven.plugins:maven-invoker-plugin:3.1.0@run  integration-test}: linux-jdk12-m3.6.x_build/maven-archetype-plugin/target/invoker-reports/*.xml
[INFO] run post-build script verify.bsh
[INFO]           build-archetype/pom.xml .......................... SUCCESS (18.0 s)
[INFO] Building: included-system-properties/pom.xml
[INFO] run post-build script verify.groovy
[INFO]           included-system-properties/pom.xml ............... SUCCESS (8.3 s)
[INFO] Building: property-setting-cli/pom.xml
[withMaven] Publishers: Generated Artifacts Publisher: 5903 ms, Junit Publisher: 8142 ms, Open Task Scanner Publisher: 3645 ms, Dependencies Fingerprint Publisher: 1562 ms, Invoker Publisher: 24695 ms, Pipeline Graph Publisher: 5 ms
[Pipeline] // withMaven
[Pipeline] cleanWs
[WS-CLEANUP] Deleting project workspace...
[WS-CLEANUP] Deferred wipeout is used...
[INFO]           property-setting-cli/pom.xml ..................... SUCCESS (4.3 s)
[INFO] Building: create-5/pom.xml
[WS-CLEANUP] done
[Pipeline] }
[Pipeline] // stage
[Pipeline] }
[Pipeline] // ws
[Pipeline] }
[Pipeline] // node
[Pipeline] }
[INFO] run post-build script verify.groovy
[INFO]           create-5/pom.xml ................................. SUCCESS (8.5 s)
[INFO] Building: exclude-patterns-2/pom.xml
[INFO] run post-build script verify.groovy
[INFO]           exclude-patterns-2/pom.xml ....................... SUCCESS (8.3 s)
[INFO] -------------------------------------------------
[INFO] Build Summary:
[INFO]   Passed: 25, Failed: 0, Errors: 0, Skipped: 0
[INFO] -------------------------------------------------
[INFO] 
[INFO] --- mrm-maven-plugin:1.1.0:stop (mirror) @ maven-archetype-plugin ---
[INFO] Stopping Mock Repository Manager on http://localhost:34106
[INFO] Stopped SocketConnector@0.0.0.0:34106
[INFO] Mock Repository Manager http://localhost:34106 is stopped.
[INFO] 
[INFO] --- mrm-maven-plugin:1.1.0:stop (archetype-repository) @ maven-archetype-plugin ---
[INFO] Stopping Mock Repository Manager on http://localhost:33556
[INFO] Stopped SocketConnector@0.0.0.0:33556
[INFO] Mock Repository Manager http://localhost:33556 is stopped.
[INFO] 
[INFO] --- maven-checkstyle-plugin:3.0.0:check (checkstyle-check) @ maven-archetype-plugin ---
[INFO] There are 46 errors reported by Checkstyle 6.18 with config/maven_checks.xml ruleset.
[INFO] Ignored 46 errors, 0 violation remaining.
[INFO] ------------------------------------------------------------------------
[INFO] Reactor Summary for Maven Archetype 3.1.2-SNAPSHOT:
[INFO] 
[INFO] Maven Archetype .................................... SUCCESS [  9.067 s]
[INFO] Maven Archetype Models ............................. SUCCESS [  0.521 s]
[INFO] Maven Archetype Catalog Model ...................... SUCCESS [  3.907 s]
[INFO] Maven Archetype Descriptor Model ................... SUCCESS [  0.950 s]
[INFO] Maven Archetype Common ............................. SUCCESS [ 26.496 s]
[INFO] Maven Archetype Packaging .......................... SUCCESS [  0.458 s]
[INFO] Maven Archetype Plugin ............................. SUCCESS [04:48 min]
[INFO] ------------------------------------------------------------------------
[INFO] BUILD SUCCESS
[INFO] ------------------------------------------------------------------------
[INFO] Total time:  05:30 min
[INFO] Finished at: 2019-08-14T23:51:36Z
[INFO] ------------------------------------------------------------------------
[INFO] [jenkins-event-spy] Generated /home/jenkins/jenkins-slave/workspace/ox_maven-archetype_ARCHETYPE-571@2@tmp/withMaven4ccf974b/maven-spy-20190814-234606-16512066567535911673068.log
[Pipeline] }
[Pipeline] // dir
[Pipeline] }
[withMaven] artifactsPublisher - Archive artifact linux-jdk13-m3.6.x_build/pom.xml under org/apache/maven/archetype/maven-archetype/3.1.2-SNAPSHOT/maven-archetype-3.1.2-SNAPSHOT.pom
[withMaven] artifactsPublisher - Archive artifact linux-jdk13-m3.6.x_build/target/maven-archetype-3.1.2-SNAPSHOT-site.xml under org/apache/maven/archetype/maven-archetype/3.1.2-SNAPSHOT/maven-archetype-3.1.2-SNAPSHOT-site.xml
[withMaven] artifactsPublisher - Archive artifact linux-jdk13-m3.6.x_build/archetype-models/pom.xml under org/apache/maven/archetype/archetype-models/3.1.2-SNAPSHOT/archetype-models-3.1.2-SNAPSHOT.pom
[withMaven] artifactsPublisher - Archive artifact linux-jdk13-m3.6.x_build/archetype-models/target/archetype-models-3.1.2-SNAPSHOT-site.xml under org/apache/maven/archetype/archetype-models/3.1.2-SNAPSHOT/archetype-models-3.1.2-SNAPSHOT-site.xml
[withMaven] artifactsPublisher - Archive artifact linux-jdk13-m3.6.x_build/archetype-models/archetype-catalog/pom.xml under org/apache/maven/archetype/archetype-catalog/3.1.2-SNAPSHOT/archetype-catalog-3.1.2-SNAPSHOT.pom
[withMaven] artifactsPublisher - Archive artifact linux-jdk13-m3.6.x_build/archetype-models/archetype-catalog/target/archetype-catalog-3.1.2-SNAPSHOT.jar under org/apache/maven/archetype/archetype-catalog/3.1.2-SNAPSHOT/archetype-catalog-3.1.2-SNAPSHOT.jar
[withMaven] artifactsPublisher - Archive artifact linux-jdk13-m3.6.x_build/archetype-models/archetype-descriptor/pom.xml under org/apache/maven/archetype/archetype-descriptor/3.1.2-SNAPSHOT/archetype-descriptor-3.1.2-SNAPSHOT.pom
[withMaven] artifactsPublisher - Archive artifact linux-jdk13-m3.6.x_build/archetype-models/archetype-descriptor/target/archetype-descriptor-3.1.2-SNAPSHOT.jar under org/apache/maven/archetype/archetype-descriptor/3.1.2-SNAPSHOT/archetype-descriptor-3.1.2-SNAPSHOT.jar
[withMaven] artifactsPublisher - Archive artifact linux-jdk13-m3.6.x_build/archetype-common/pom.xml under org/apache/maven/archetype/archetype-common/3.1.2-SNAPSHOT/archetype-common-3.1.2-SNAPSHOT.pom
[withMaven] artifactsPublisher - Archive artifact linux-jdk13-m3.6.x_build/archetype-common/target/archetype-common-3.1.2-SNAPSHOT.jar under org/apache/maven/archetype/archetype-common/3.1.2-SNAPSHOT/archetype-common-3.1.2-SNAPSHOT.jar
[withMaven] artifactsPublisher - Archive artifact linux-jdk13-m3.6.x_build/archetype-packaging/pom.xml under org/apache/maven/archetype/archetype-packaging/3.1.2-SNAPSHOT/archetype-packaging-3.1.2-SNAPSHOT.pom
[withMaven] artifactsPublisher - Archive artifact linux-jdk13-m3.6.x_build/archetype-packaging/target/archetype-packaging-3.1.2-SNAPSHOT.jar under org/apache/maven/archetype/archetype-packaging/3.1.2-SNAPSHOT/archetype-packaging-3.1.2-SNAPSHOT.jar
[withMaven] artifactsPublisher - Archive artifact linux-jdk13-m3.6.x_build/maven-archetype-plugin/pom.xml under org/apache/maven/plugins/maven-archetype-plugin/3.1.2-SNAPSHOT/maven-archetype-plugin-3.1.2-SNAPSHOT.pom
[withMaven] artifactsPublisher - Archive artifact linux-jdk13-m3.6.x_build/maven-archetype-plugin/target/maven-archetype-plugin-3.1.2-SNAPSHOT.jar under org/apache/maven/plugins/maven-archetype-plugin/3.1.2-SNAPSHOT/maven-archetype-plugin-3.1.2-SNAPSHOT.jar
[withMaven] junitPublisher - Archive test results for Maven artifact org.apache.maven.archetype:archetype-catalog:jar:3.1.2-SNAPSHOT generated by maven-surefire-plugin:test (default-test): linux-jdk13-m3.6.x_build/archetype-models/archetype-catalog/target/surefire-reports/*.xml
[withMaven] junitPublisher - Archive test results for Maven artifact org.apache.maven.archetype:archetype-descriptor:jar:3.1.2-SNAPSHOT generated by maven-surefire-plugin:test (default-test): linux-jdk13-m3.6.x_build/archetype-models/archetype-descriptor/target/surefire-reports/*.xml
[withMaven] junitPublisher - Archive test results for Maven artifact org.apache.maven.archetype:archetype-common:jar:3.1.2-SNAPSHOT generated by maven-surefire-plugin:test (default-test): linux-jdk13-m3.6.x_build/archetype-common/target/surefire-reports/*.xml
[withMaven] junitPublisher - Archive test results for Maven artifact org.apache.maven.archetype:archetype-packaging:jar:3.1.2-SNAPSHOT generated by maven-surefire-plugin:test (default-test): linux-jdk13-m3.6.x_build/archetype-packaging/target/surefire-reports/*.xml
[withMaven] junitPublisher - Archive test results for Maven artifact org.apache.maven.plugins:maven-archetype-plugin:maven-plugin:3.1.2-SNAPSHOT generated by maven-surefire-plugin:test (default-test): linux-jdk13-m3.6.x_build/maven-archetype-plugin/target/surefire-reports/*.xml
Recording test results
[withMaven] openTasksPublisher - Scan Tasks for Maven artifact org.apache.maven.archetype:archetype-common:jar:3.1.2-SNAPSHOT in source directory linux-jdk13-m3.6.x_build/archetype-common/src/main/java
[withMaven] openTasksPublisher - Scan Tasks for Maven artifact org.apache.maven.plugins:maven-archetype-plugin:maven-plugin:3.1.2-SNAPSHOT in source directory linux-jdk13-m3.6.x_build/maven-archetype-plugin/src/main/java
[TASKS] Scanning folder '/home/jenkins/jenkins-slave/workspace/ox_maven-archetype_ARCHETYPE-571@2' for files matching the pattern 'linux-jdk13-m3.6.x_build/archetype-common/src/main/java/**/*,linux-jdk13-m3.6.x_build/maven-archetype-plugin/src/main/java/**/*' - excludes: null
[TASKS] Found 89 files to scan for tasks
[TASKS] Found 26 open tasks.
Skipping warnings blame since pipelines do not have an SCM link.%n
[TASKS] Computing warning deltas based on reference build #5
[withMaven] invokerPublisher - Archive invoker results for Maven artifact MavenArtifact{org.apache.maven.plugins:maven-archetype-plugin:maven-plugin:3.1.2-SNAPSHOT(version: 3.1.2-SNAPSHOT, snapshot:false) } generated by PluginInvocation{org.apache.maven.plugins:maven-invoker-plugin:3.1.0@run  integration-test}: linux-jdk13-m3.6.x_build/maven-archetype-plugin/target/invoker-reports/*.xml
[withMaven] Publishers: Generated Artifacts Publisher: 5924 ms, Junit Publisher: 8194 ms, Open Task Scanner Publisher: 3659 ms, Dependencies Fingerprint Publisher: 1562 ms, Invoker Publisher: 27676 ms, Pipeline Graph Publisher: 5 ms
[Pipeline] // withMaven
[Pipeline] cleanWs
[WS-CLEANUP] Deleting project workspace...
[WS-CLEANUP] Deferred wipeout is used...
[WS-CLEANUP] done
[Pipeline] }
[Pipeline] // stage
[Pipeline] }
[Pipeline] // ws
[Pipeline] }
[Pipeline] // node
[Pipeline] }
[Pipeline] // parallel
[Pipeline] stage
[Pipeline] { (Notifications)
[Pipeline] echo
Build result: FAILURE
[Pipeline] jiraIssueSelector
[Pipeline] echo
The authors of changes [].
[Pipeline] echo
Sending email ...
[Pipeline] emailext

Build failed in Jenkins: Maven TLP » maven-archetype » ARCHETYPE-571 #8

Posted by Apache Jenkins Server <je...@builds.apache.org>.
See https://builds.apache.org/job/maven-box/job/maven-archetype/job/ARCHETYPE-571/8/

Changes:

* [INFRA-18734] Jenkins builds fail on email notifications due to unknown
* Scripts not permitted to use staticMethod
* excluded message body from the log message
* NotSerializableException: hudson.plugins.git.GitChangeSetList
* investigating permissions to the call 'ChangeSetList.author'
* NotSerializableException: hudson.plugins.git.GitChangeSetList
* [INFRA-18734] Jenkins builds fail on email notifications due to unknown
* Prevent Caused: java.io.NotSerializableException: hudson.model.User
* [INFRA-18734] Jenkins builds fail on email notifications due to unknown
* last() cannot be called on []
* [improvement] currentBuild.changeSets can be referenced as changes
* moved the fix of INFRA-18734 to jenkinsNotify

All tests passed

Build log:
[...truncated 21175 lines...]
[withMaven] artifactsPublisher - Archive artifact j7m3.5.xb\archetype-models\pom.xml under org\apache\maven\archetype\archetype-models\3.1.2-SNAPSHOT\archetype-models-3.1.2-SNAPSHOT.pom
[withMaven] artifactsPublisher - Archive artifact j7m3.5.xb\archetype-models\target\archetype-models-3.1.2-SNAPSHOT-site.xml under org\apache\maven\archetype\archetype-models\3.1.2-SNAPSHOT\archetype-models-3.1.2-SNAPSHOT-site.xml
[withMaven] artifactsPublisher - Archive artifact j7m3.5.xb\archetype-models\archetype-catalog\pom.xml under org\apache\maven\archetype\archetype-catalog\3.1.2-SNAPSHOT\archetype-catalog-3.1.2-SNAPSHOT.pom
[withMaven] artifactsPublisher - Archive artifact j7m3.5.xb\archetype-models\archetype-catalog\target\archetype-catalog-3.1.2-SNAPSHOT.jar under org\apache\maven\archetype\archetype-catalog\3.1.2-SNAPSHOT\archetype-catalog-3.1.2-SNAPSHOT.jar
[withMaven] artifactsPublisher - Archive artifact j7m3.5.xb\archetype-models\archetype-descriptor\pom.xml under org\apache\maven\archetype\archetype-descriptor\3.1.2-SNAPSHOT\archetype-descriptor-3.1.2-SNAPSHOT.pom
[withMaven] artifactsPublisher - Archive artifact j7m3.5.xb\archetype-models\archetype-descriptor\target\archetype-descriptor-3.1.2-SNAPSHOT.jar under org\apache\maven\archetype\archetype-descriptor\3.1.2-SNAPSHOT\archetype-descriptor-3.1.2-SNAPSHOT.jar
[withMaven] artifactsPublisher - Archive artifact j7m3.5.xb\archetype-common\pom.xml under org\apache\maven\archetype\archetype-common\3.1.2-SNAPSHOT\archetype-common-3.1.2-SNAPSHOT.pom
[withMaven] artifactsPublisher - Archive artifact j7m3.5.xb\archetype-common\target\archetype-common-3.1.2-SNAPSHOT.jar under org\apache\maven\archetype\archetype-common\3.1.2-SNAPSHOT\archetype-common-3.1.2-SNAPSHOT.jar
[withMaven] artifactsPublisher - Archive artifact j7m3.5.xb\archetype-packaging\pom.xml under org\apache\maven\archetype\archetype-packaging\3.1.2-SNAPSHOT\archetype-packaging-3.1.2-SNAPSHOT.pom
[withMaven] artifactsPublisher - Archive artifact j7m3.5.xb\archetype-packaging\target\archetype-packaging-3.1.2-SNAPSHOT.jar under org\apache\maven\archetype\archetype-packaging\3.1.2-SNAPSHOT\archetype-packaging-3.1.2-SNAPSHOT.jar
[withMaven] junitPublisher - Archive test results for Maven artifact org.apache.maven.archetype:archetype-catalog:jar:3.1.2-SNAPSHOT generated by maven-surefire-plugin:test (default-test): j7m3.5.xb\archetype-models\archetype-catalog\target\surefire-reports\*.xml
[withMaven] junitPublisher - Archive test results for Maven artifact org.apache.maven.archetype:archetype-descriptor:jar:3.1.2-SNAPSHOT generated by maven-surefire-plugin:test (default-test): j7m3.5.xb\archetype-models\archetype-descriptor\target\surefire-reports\*.xml
[withMaven] junitPublisher - Archive test results for Maven artifact org.apache.maven.archetype:archetype-common:jar:3.1.2-SNAPSHOT generated by maven-surefire-plugin:test (default-test): j7m3.5.xb\archetype-common\target\surefire-reports\*.xml
[withMaven] junitPublisher - Archive test results for Maven artifact org.apache.maven.archetype:archetype-packaging:jar:3.1.2-SNAPSHOT generated by maven-surefire-plugin:test (default-test): j7m3.5.xb\archetype-packaging\target\surefire-reports\*.xml
[withMaven] junitPublisher - Archive test results for Maven artifact org.apache.maven.plugins:maven-archetype-plugin:maven-plugin:3.1.2-SNAPSHOT generated by maven-surefire-plugin:test (default-test): j7m3.5.xb\maven-archetype-plugin\target\surefire-reports\*.xml
Recording test results
[withMaven] openTasksPublisher - Scan Tasks for Maven artifact org.apache.maven.archetype:archetype-common:jar:3.1.2-SNAPSHOT in source directory j7m3.5.xb\archetype-common\src\main\java
[withMaven] openTasksPublisher - Scan Tasks for Maven artifact org.apache.maven.plugins:maven-archetype-plugin:maven-plugin:3.1.2-SNAPSHOT in source directory j7m3.5.xb\maven-archetype-plugin\src\main\java
[TASKS] Scanning folder 'F:\short\jenkins-maven-box-maven-archetype-ARCHETYPE-571-8@2' for files matching the pattern 'j7m3.5.xb\archetype-common\src\main\java\**\*,j7m3.5.xb\maven-archetype-plugin\src\main\java\**\*' - excludes: null
[TASKS] Found 89 files to scan for tasks
[TASKS] Found 26 open tasks.
Skipping warnings blame since pipelines do not have an SCM link.%n
[TASKS] Computing warning deltas based on reference build #5
[withMaven] invokerPublisher - Archive invoker results for Maven artifact MavenArtifact{org.apache.maven.plugins:maven-archetype-plugin:maven-plugin:3.1.2-SNAPSHOT(version: 3.1.2-SNAPSHOT, snapshot:false) } generated by PluginInvocation{org.apache.maven.plugins:maven-invoker-plugin:3.1.0@run  integration-test}: j7m3.5.xb\maven-archetype-plugin\target\invoker-reports\*.xml
[withMaven] invokerPublisher - Archive invoker results for Maven artifact MavenArtifact{org.apache.maven.plugins:maven-archetype-plugin:maven-plugin:3.1.2-SNAPSHOT(version: 3.1.2-SNAPSHOT, snapshot:false) } generated by PluginInvocation{org.apache.maven.plugins:maven-invoker-plugin:3.1.0@run  integration-test}: linux-jdk7-m3.3.x_build/maven-archetype-plugin/target/invoker-reports/*.xml
[INFO] run post-build script verify.groovy
[INFO]           roundtrip-multi\pom.xml .......................... SUCCESS (18.9 s)
[INFO] -------------------------------------------------
[INFO] Build Summary:
[INFO]   Passed: 25, Failed: 0, Errors: 0, Skipped: 0
[INFO] -------------------------------------------------
[INFO] 
[INFO] --- mrm-maven-plugin:1.1.0:stop (mirror) @ maven-archetype-plugin ---
[INFO] Stopping Mock Repository Manager on http://localhost:56926
[INFO] Stopped SocketConnector@0.0.0.0:56926
[INFO] Mock Repository Manager http://localhost:56926 is stopped.
[INFO] 
[INFO] --- mrm-maven-plugin:1.1.0:stop (archetype-repository) @ maven-archetype-plugin ---
[INFO] Stopping Mock Repository Manager on http://localhost:56929
[INFO] Stopped SocketConnector@0.0.0.0:56929
[INFO] Mock Repository Manager http://localhost:56929 is stopped.
[INFO] 
[INFO] --- maven-checkstyle-plugin:3.0.0:check (checkstyle-check) @ maven-archetype-plugin ---
[INFO] There are 46 errors reported by Checkstyle 6.18 with config/maven_checks.xml ruleset.
[INFO] Ignored 46 errors, 0 violation remaining.
[INFO] ------------------------------------------------------------------------
[INFO] Reactor Summary for Maven Archetype 3.1.2-SNAPSHOT:
[INFO] 
[INFO] Maven Archetype .................................... SUCCESS [ 43.327 s]
[INFO] Maven Archetype Models ............................. SUCCESS [  0.624 s]
[INFO] Maven Archetype Catalog Model ...................... SUCCESS [ 13.996 s]
[INFO] Maven Archetype Descriptor Model ................... SUCCESS [  1.626 s]
[INFO] Maven Archetype Common ............................. SUCCESS [ 36.409 s]
[INFO] Maven Archetype Packaging .......................... SUCCESS [  0.594 s]
[INFO] Maven Archetype Plugin ............................. SUCCESS [06:03 min]
[INFO] ------------------------------------------------------------------------
[INFO] BUILD SUCCESS
[INFO] ------------------------------------------------------------------------
[INFO] Total time:  07:40 min
[INFO] Finished at: 2019-08-12T10:56:23-07:00
[INFO] ------------------------------------------------------------------------
[INFO] [jenkins-event-spy] Generated F:\short\jenkins-maven-box-maven-archetype-ARCHETYPE-571-8@3@tmp\withMaven6bbc216c\maven-spy-20190812-104842-5937005846637137387633.log
Picked up JAVA_TOOL_OPTIONS: -Dmaven.ext.class.path="F:\short\jenkins-maven-box-maven-archetype-ARCHETYPE-571-8@3@tmp\withMaven6bbc216c\pipeline-maven-spy.jar" -Dorg.jenkinsci.plugins.pipeline.maven.reportsFolder="F:\short\jenkins-maven-box-maven-archetype-ARCHETYPE-571-8@3@tmp\withMaven6bbc216c" 
[Pipeline] }
[Pipeline] // dir
[Pipeline] }
[withMaven] artifactsPublisher - Archive artifact j7m3.6.xb\pom.xml under org\apache\maven\archetype\maven-archetype\3.1.2-SNAPSHOT\maven-archetype-3.1.2-SNAPSHOT.pom
[withMaven] artifactsPublisher - Archive artifact j7m3.6.xb\target\maven-archetype-3.1.2-SNAPSHOT-site.xml under org\apache\maven\archetype\maven-archetype\3.1.2-SNAPSHOT\maven-archetype-3.1.2-SNAPSHOT-site.xml
[withMaven] artifactsPublisher - Archive artifact j7m3.6.xb\archetype-models\pom.xml under org\apache\maven\archetype\archetype-models\3.1.2-SNAPSHOT\archetype-models-3.1.2-SNAPSHOT.pom
[withMaven] artifactsPublisher - Archive artifact j7m3.6.xb\archetype-models\target\archetype-models-3.1.2-SNAPSHOT-site.xml under org\apache\maven\archetype\archetype-models\3.1.2-SNAPSHOT\archetype-models-3.1.2-SNAPSHOT-site.xml
[withMaven] artifactsPublisher - Archive artifact j7m3.6.xb\archetype-models\archetype-catalog\pom.xml under org\apache\maven\archetype\archetype-catalog\3.1.2-SNAPSHOT\archetype-catalog-3.1.2-SNAPSHOT.pom
[withMaven] artifactsPublisher - Archive artifact j7m3.6.xb\archetype-models\archetype-catalog\target\archetype-catalog-3.1.2-SNAPSHOT.jar under org\apache\maven\archetype\archetype-catalog\3.1.2-SNAPSHOT\archetype-catalog-3.1.2-SNAPSHOT.jar
[withMaven] artifactsPublisher - Archive artifact j7m3.6.xb\archetype-models\archetype-descriptor\pom.xml under org\apache\maven\archetype\archetype-descriptor\3.1.2-SNAPSHOT\archetype-descriptor-3.1.2-SNAPSHOT.pom
[withMaven] artifactsPublisher - Archive artifact j7m3.6.xb\archetype-models\archetype-descriptor\target\archetype-descriptor-3.1.2-SNAPSHOT.jar under org\apache\maven\archetype\archetype-descriptor\3.1.2-SNAPSHOT\archetype-descriptor-3.1.2-SNAPSHOT.jar
[withMaven] artifactsPublisher - Archive artifact j7m3.6.xb\archetype-common\pom.xml under org\apache\maven\archetype\archetype-common\3.1.2-SNAPSHOT\archetype-common-3.1.2-SNAPSHOT.pom
[withMaven] artifactsPublisher - Archive artifact j7m3.6.xb\archetype-common\target\archetype-common-3.1.2-SNAPSHOT.jar under org\apache\maven\archetype\archetype-common\3.1.2-SNAPSHOT\archetype-common-3.1.2-SNAPSHOT.jar
[withMaven] artifactsPublisher - Archive artifact j7m3.6.xb\archetype-packaging\pom.xml under org\apache\maven\archetype\archetype-packaging\3.1.2-SNAPSHOT\archetype-packaging-3.1.2-SNAPSHOT.pom
[withMaven] artifactsPublisher - Archive artifact j7m3.6.xb\archetype-packaging\target\archetype-packaging-3.1.2-SNAPSHOT.jar under org\apache\maven\archetype\archetype-packaging\3.1.2-SNAPSHOT\archetype-packaging-3.1.2-SNAPSHOT.jar
[withMaven] artifactsPublisher - Archive artifact j7m3.6.xb\maven-archetype-plugin\pom.xml under org\apache\maven\plugins\maven-archetype-plugin\3.1.2-SNAPSHOT\maven-archetype-plugin-3.1.2-SNAPSHOT.pom
[withMaven] artifactsPublisher - Archive artifact j7m3.6.xb\maven-archetype-plugin\target\maven-archetype-plugin-3.1.2-SNAPSHOT.jar under org\apache\maven\plugins\maven-archetype-plugin\3.1.2-SNAPSHOT\maven-archetype-plugin-3.1.2-SNAPSHOT.jar
[withMaven] junitPublisher - Archive test results for Maven artifact org.apache.maven.archetype:archetype-catalog:jar:3.1.2-SNAPSHOT generated by maven-surefire-plugin:test (default-test): j7m3.6.xb\archetype-models\archetype-catalog\target\surefire-reports\*.xml
[withMaven] junitPublisher - Archive test results for Maven artifact org.apache.maven.archetype:archetype-descriptor:jar:3.1.2-SNAPSHOT generated by maven-surefire-plugin:test (default-test): j7m3.6.xb\archetype-models\archetype-descriptor\target\surefire-reports\*.xml
[withMaven] junitPublisher - Archive test results for Maven artifact org.apache.maven.archetype:archetype-common:jar:3.1.2-SNAPSHOT generated by maven-surefire-plugin:test (default-test): j7m3.6.xb\archetype-common\target\surefire-reports\*.xml
[withMaven] junitPublisher - Archive test results for Maven artifact org.apache.maven.archetype:archetype-packaging:jar:3.1.2-SNAPSHOT generated by maven-surefire-plugin:test (default-test): j7m3.6.xb\archetype-packaging\target\surefire-reports\*.xml
[withMaven] junitPublisher - Archive test results for Maven artifact org.apache.maven.plugins:maven-archetype-plugin:maven-plugin:3.1.2-SNAPSHOT generated by maven-surefire-plugin:test (default-test): j7m3.6.xb\maven-archetype-plugin\target\surefire-reports\*.xml
Recording test results
[withMaven] openTasksPublisher - Scan Tasks for Maven artifact org.apache.maven.archetype:archetype-common:jar:3.1.2-SNAPSHOT in source directory j7m3.6.xb\archetype-common\src\main\java
[withMaven] openTasksPublisher - Scan Tasks for Maven artifact org.apache.maven.plugins:maven-archetype-plugin:maven-plugin:3.1.2-SNAPSHOT in source directory j7m3.6.xb\maven-archetype-plugin\src\main\java
[TASKS] Scanning folder 'F:\short\jenkins-maven-box-maven-archetype-ARCHETYPE-571-8@3' for files matching the pattern 'j7m3.6.xb\archetype-common\src\main\java\**\*,j7m3.6.xb\maven-archetype-plugin\src\main\java\**\*' - excludes: null
[TASKS] Found 89 files to scan for tasks
[TASKS] Found 26 open tasks.
Skipping warnings blame since pipelines do not have an SCM link.%n
[TASKS] Computing warning deltas based on reference build #5
[withMaven] invokerPublisher - Archive invoker results for Maven artifact MavenArtifact{org.apache.maven.plugins:maven-archetype-plugin:maven-plugin:3.1.2-SNAPSHOT(version: 3.1.2-SNAPSHOT, snapshot:false) } generated by PluginInvocation{org.apache.maven.plugins:maven-invoker-plugin:3.1.0@run  integration-test}: j7m3.6.xb\maven-archetype-plugin\target\invoker-reports\*.xml
[withMaven] Publishers: Generated Artifacts Publisher: 348 ms, Junit Publisher: 358 ms, Open Task Scanner Publisher: 272 ms, Dependencies Fingerprint Publisher: 65 ms, Invoker Publisher: 18113 ms, Pipeline Graph Publisher: 5 ms
[Pipeline] // withMaven
[Pipeline] cleanWs
[WS-CLEANUP] Deleting project workspace...
[WS-CLEANUP] Deferred wipeout is used...
[WS-CLEANUP] done
[Pipeline] }
[Pipeline] // stage
[Pipeline] }
[Pipeline] // ws
[Pipeline] }
[Pipeline] // node
[INFO] run post-build script verify.groovy
[INFO]           roundtrip-1-project .............................. SUCCESS (18.0 s)
[INFO] Building: roundtrip-multi\pom.xml
[Pipeline] }
[withMaven] Publishers: Generated Artifacts Publisher: 302 ms, Junit Publisher: 363 ms, Open Task Scanner Publisher: 280 ms, Dependencies Fingerprint Publisher: 65 ms, Invoker Publisher: 17910 ms, Pipeline Graph Publisher: 4 ms
[Pipeline] // withMaven
[Pipeline] cleanWs
[WS-CLEANUP] Deleting project workspace...
[WS-CLEANUP] Deferred wipeout is used...
[WS-CLEANUP] done
[Pipeline] cleanWs
[WS-CLEANUP] Deleting project workspace...
[WS-CLEANUP] Deferred wipeout is used...
[WS-CLEANUP] done
[Pipeline] }
[Pipeline] // stage
[Pipeline] }
[Pipeline] // ws
[Pipeline] }
[Pipeline] // node
[Pipeline] }
Failed in branch windows-jdk7-m3.5.x_build
[withMaven] Publishers: Generated Artifacts Publisher: 393 ms, Junit Publisher: 377 ms, Open Task Scanner Publisher: 335 ms, Dependencies Fingerprint Publisher: 67 ms, Invoker Publisher: 18089 ms, Pipeline Graph Publisher: 2 ms
[Pipeline] // withMaven
[Pipeline] cleanWs
[WS-CLEANUP] Deleting project workspace...
[WS-CLEANUP] Deferred wipeout is used...
[WS-CLEANUP] done
[Pipeline] }
[Pipeline] // stage
[Pipeline] }
[Pipeline] // ws
[Pipeline] }
[Pipeline] // node
[Pipeline] }
[withMaven] Publishers: Generated Artifacts Publisher: 5894 ms, Junit Publisher: 8104 ms, Open Task Scanner Publisher: 3562 ms, Dependencies Fingerprint Publisher: 1565 ms, Invoker Publisher: 25199 ms, Pipeline Graph Publisher: 4 ms
[Pipeline] // withMaven
[Pipeline] cleanWs
[WS-CLEANUP] Deleting project workspace...
[WS-CLEANUP] Deferred wipeout is used...
[WS-CLEANUP] done
[Pipeline] }
[Pipeline] // stage
[Pipeline] }
[Pipeline] // ws
[Pipeline] }
[Pipeline] // node
[Pipeline] }
[INFO] snapshot com.company.proficio:proficio-archetype:1.0-SNAPSHOT: checking for updates from apache-snapshots
[INFO] snapshot com.company.proficio:proficio-archetype:1.0-SNAPSHOT: checking for updates from Nexus
[INFO] artifact com.company.proficio.proficio-archetype:1.0-SNAPSHOT: checking for updates from central
[INFO] run post-build script verify.groovy
[INFO]           roundtrip-multi\pom.xml .......................... SUCCESS (20.0 s)
[INFO] -------------------------------------------------
[INFO] Build Summary:
[INFO]   Passed: 25, Failed: 0, Errors: 0, Skipped: 0
[INFO] -------------------------------------------------
[INFO] 
[INFO] --- mrm-maven-plugin:1.1.0:stop (mirror) @ maven-archetype-plugin ---
[INFO] Stopping Mock Repository Manager on http://localhost:54404
[INFO] Stopped SocketConnector@0.0.0.0:54404
[INFO] Mock Repository Manager http://localhost:54404 is stopped.
[INFO] 
[INFO] --- mrm-maven-plugin:1.1.0:stop (archetype-repository) @ maven-archetype-plugin ---
[INFO] Stopping Mock Repository Manager on http://localhost:54407
[INFO] Stopped SocketConnector@0.0.0.0:54407
[INFO] Mock Repository Manager http://localhost:54407 is stopped.
[INFO] 
[INFO] --- maven-checkstyle-plugin:3.0.0:check (checkstyle-check) @ maven-archetype-plugin ---
[INFO] There are 46 errors reported by Checkstyle 6.18 with config/maven_checks.xml ruleset.
[INFO] Ignored 46 errors, 0 violation remaining.
[INFO] ------------------------------------------------------------------------
[INFO] Reactor Summary for Maven Archetype 3.1.2-SNAPSHOT:
[INFO] 
[INFO] Maven Archetype .................................... SUCCESS [ 37.441 s]
[INFO] Maven Archetype Models ............................. SUCCESS [  0.764 s]
[INFO] Maven Archetype Catalog Model ...................... SUCCESS [ 12.718 s]
[INFO] Maven Archetype Descriptor Model ................... SUCCESS [  1.833 s]
[INFO] Maven Archetype Common ............................. SUCCESS [ 42.387 s]
[INFO] Maven Archetype Packaging .......................... SUCCESS [  0.818 s]
[INFO] Maven Archetype Plugin ............................. SUCCESS [06:24 min]
[INFO] ------------------------------------------------------------------------
[INFO] BUILD SUCCESS
[INFO] ------------------------------------------------------------------------
[INFO] Total time:  08:01 min
[INFO] Finished at: 2019-08-12T10:56:57-07:00
[INFO] ------------------------------------------------------------------------
[INFO] [jenkins-event-spy] Generated F:\short\jenkins-maven-box-maven-archetype-ARCHETYPE-571-8@tmp\withMaven0a1f8e15\maven-spy-20190812-104855-7498855725562709387698.log
[Pipeline] }
[Pipeline] // dir
[Pipeline] }
[withMaven] artifactsPublisher - Archive artifact j11m3.6.xb\pom.xml under org\apache\maven\archetype\maven-archetype\3.1.2-SNAPSHOT\maven-archetype-3.1.2-SNAPSHOT.pom
[withMaven] artifactsPublisher - Archive artifact j11m3.6.xb\target\maven-archetype-3.1.2-SNAPSHOT-site.xml under org\apache\maven\archetype\maven-archetype\3.1.2-SNAPSHOT\maven-archetype-3.1.2-SNAPSHOT-site.xml
[withMaven] artifactsPublisher - Archive artifact j11m3.6.xb\archetype-models\pom.xml under org\apache\maven\archetype\archetype-models\3.1.2-SNAPSHOT\archetype-models-3.1.2-SNAPSHOT.pom
[withMaven] artifactsPublisher - Archive artifact j11m3.6.xb\archetype-models\target\archetype-models-3.1.2-SNAPSHOT-site.xml under org\apache\maven\archetype\archetype-models\3.1.2-SNAPSHOT\archetype-models-3.1.2-SNAPSHOT-site.xml
[withMaven] artifactsPublisher - Archive artifact j11m3.6.xb\archetype-models\archetype-catalog\pom.xml under org\apache\maven\archetype\archetype-catalog\3.1.2-SNAPSHOT\archetype-catalog-3.1.2-SNAPSHOT.pom
[withMaven] artifactsPublisher - Archive artifact j11m3.6.xb\archetype-models\archetype-catalog\target\archetype-catalog-3.1.2-SNAPSHOT.jar under org\apache\maven\archetype\archetype-catalog\3.1.2-SNAPSHOT\archetype-catalog-3.1.2-SNAPSHOT.jar
[withMaven] artifactsPublisher - Archive artifact j11m3.6.xb\archetype-models\archetype-descriptor\pom.xml under org\apache\maven\archetype\archetype-descriptor\3.1.2-SNAPSHOT\archetype-descriptor-3.1.2-SNAPSHOT.pom
[withMaven] artifactsPublisher - Archive artifact j11m3.6.xb\archetype-models\archetype-descriptor\target\archetype-descriptor-3.1.2-SNAPSHOT.jar under org\apache\maven\archetype\archetype-descriptor\3.1.2-SNAPSHOT\archetype-descriptor-3.1.2-SNAPSHOT.jar
[withMaven] artifactsPublisher - Archive artifact j11m3.6.xb\archetype-common\pom.xml under org\apache\maven\archetype\archetype-common\3.1.2-SNAPSHOT\archetype-common-3.1.2-SNAPSHOT.pom
[withMaven] artifactsPublisher - Archive artifact j11m3.6.xb\archetype-common\target\archetype-common-3.1.2-SNAPSHOT.jar under org\apache\maven\archetype\archetype-common\3.1.2-SNAPSHOT\archetype-common-3.1.2-SNAPSHOT.jar
[withMaven] artifactsPublisher - Archive artifact j11m3.6.xb\archetype-packaging\pom.xml under org\apache\maven\archetype\archetype-packaging\3.1.2-SNAPSHOT\archetype-packaging-3.1.2-SNAPSHOT.pom
[withMaven] artifactsPublisher - Archive artifact j11m3.6.xb\archetype-packaging\target\archetype-packaging-3.1.2-SNAPSHOT.jar under org\apache\maven\archetype\archetype-packaging\3.1.2-SNAPSHOT\archetype-packaging-3.1.2-SNAPSHOT.jar
[withMaven] artifactsPublisher - Archive artifact j11m3.6.xb\maven-archetype-plugin\pom.xml under org\apache\maven\plugins\maven-archetype-plugin\3.1.2-SNAPSHOT\maven-archetype-plugin-3.1.2-SNAPSHOT.pom
[withMaven] artifactsPublisher - Archive artifact j11m3.6.xb\maven-archetype-plugin\target\maven-archetype-plugin-3.1.2-SNAPSHOT.jar under org\apache\maven\plugins\maven-archetype-plugin\3.1.2-SNAPSHOT\maven-archetype-plugin-3.1.2-SNAPSHOT.jar
[withMaven] junitPublisher - Archive test results for Maven artifact org.apache.maven.archetype:archetype-catalog:jar:3.1.2-SNAPSHOT generated by maven-surefire-plugin:test (default-test): j11m3.6.xb\archetype-models\archetype-catalog\target\surefire-reports\*.xml
[withMaven] junitPublisher - Archive test results for Maven artifact org.apache.maven.archetype:archetype-descriptor:jar:3.1.2-SNAPSHOT generated by maven-surefire-plugin:test (default-test): j11m3.6.xb\archetype-models\archetype-descriptor\target\surefire-reports\*.xml
[withMaven] junitPublisher - Archive test results for Maven artifact org.apache.maven.archetype:archetype-common:jar:3.1.2-SNAPSHOT generated by maven-surefire-plugin:test (default-test): j11m3.6.xb\archetype-common\target\surefire-reports\*.xml
[withMaven] junitPublisher - Archive test results for Maven artifact org.apache.maven.archetype:archetype-packaging:jar:3.1.2-SNAPSHOT generated by maven-surefire-plugin:test (default-test): j11m3.6.xb\archetype-packaging\target\surefire-reports\*.xml
[withMaven] junitPublisher - Archive test results for Maven artifact org.apache.maven.plugins:maven-archetype-plugin:maven-plugin:3.1.2-SNAPSHOT generated by maven-surefire-plugin:test (default-test): j11m3.6.xb\maven-archetype-plugin\target\surefire-reports\*.xml
Recording test results
[withMaven] openTasksPublisher - Scan Tasks for Maven artifact org.apache.maven.archetype:archetype-common:jar:3.1.2-SNAPSHOT in source directory j11m3.6.xb\archetype-common\src\main\java
[withMaven] openTasksPublisher - Scan Tasks for Maven artifact org.apache.maven.plugins:maven-archetype-plugin:maven-plugin:3.1.2-SNAPSHOT in source directory j11m3.6.xb\maven-archetype-plugin\src\main\java
[TASKS] Scanning folder 'F:\short\jenkins-maven-box-maven-archetype-ARCHETYPE-571-8' for files matching the pattern 'j11m3.6.xb\archetype-common\src\main\java\**\*,j11m3.6.xb\maven-archetype-plugin\src\main\java\**\*' - excludes: null
[TASKS] Found 89 files to scan for tasks
[TASKS] Found 26 open tasks.
Skipping warnings blame since pipelines do not have an SCM link.%n
[TASKS] Computing warning deltas based on reference build #5
[withMaven] invokerPublisher - Archive invoker results for Maven artifact MavenArtifact{org.apache.maven.plugins:maven-archetype-plugin:maven-plugin:3.1.2-SNAPSHOT(version: 3.1.2-SNAPSHOT, snapshot:false) } generated by PluginInvocation{org.apache.maven.plugins:maven-invoker-plugin:3.1.0@run  integration-test}: j11m3.6.xb\maven-archetype-plugin\target\invoker-reports\*.xml
[withMaven] Publishers: Generated Artifacts Publisher: 374 ms, Junit Publisher: 474 ms, Open Task Scanner Publisher: 317 ms, Dependencies Fingerprint Publisher: 68 ms, Invoker Publisher: 17743 ms, Pipeline Graph Publisher: 5 ms
[Pipeline] // withMaven
[Pipeline] cleanWs
[WS-CLEANUP] Deleting project workspace...
[WS-CLEANUP] Deferred wipeout is used...
[WS-CLEANUP] done
[Pipeline] }
[Pipeline] // stage
[Pipeline] }
[Pipeline] // ws
[Pipeline] }
[Pipeline] // node
[Pipeline] }
[Pipeline] // parallel
[Pipeline] stage
[Pipeline] { (Notifications)
[Pipeline] echo
Build result: FAILURE
[Pipeline] jiraIssueSelector
[Pipeline] echo
The authors of changes [tibordigana, rfscholte].
[Pipeline] echo
Sending email ...
[Pipeline] emailext