You are viewing a plain text version of this content. The canonical link for it is here.
Posted to builds@mesos.apache.org by Apache Jenkins Server <je...@builds.apache.org> on 2017/08/11 01:54:45 UTC
Build failed in Jenkins: Mesos-Buildbot » cmake,clang,--verbose --enable-libevent --enable-ssl,GLOG_v=1 MESOS_VERBOSE=1,ubuntu:14.04,(ubuntu)&&(!ubuntu-us1)&&(!ubuntu-eu2) #4094
See <https://builds.apache.org/job/Mesos-Buildbot/BUILDTOOL=cmake,COMPILER=clang,CONFIGURATION=--verbose%20--enable-libevent%20--enable-ssl,ENVIRONMENT=GLOG_v=1%20MESOS_VERBOSE=1,OS=ubuntu%3A14.04,label_exp=(ubuntu)&&(!ubuntu-us1)&&(!ubuntu-eu2)/4094/display/redirect?page=changes>
Changes:
[alexr] Added logging in docker executor on `docker stop` failure.
[alexr] Enabled retries for `killTask` in docker executor.
[alexr] Added MESOS-6743 to 1.3.2 CHANGELOG.
------------------------------------------
[...truncated 26.47 MB...]
I0811 01:54:29.066752 1745 process.cpp:3741] Handling HTTP event for process 'slave(742)' with path: '/slave(742)/monitor/statistics.json'
I0811 01:54:29.067255 1745 http.cpp:1115] HTTP GET for /slave(742)/monitor/statistics.json from 172.17.0.4:46270
I0811 01:54:29.067298 1745 http.cpp:936] Authorizing principal 'test-principal' to GET the '/monitor/statistics.json' endpoint
I0811 01:54:29.070869 1743 slave.cpp:796] Agent terminating
I0811 01:54:29.077071 26717 containerizer.cpp:221] Using isolation: posix/cpu,posix/mem,filesystem/posix,network/cni
W0811 01:54:29.077567 26717 backend.cpp:76] Failed to create 'aufs' backend: AufsBackend requires root privileges
W0811 01:54:29.077711 26717 backend.cpp:76] Failed to create 'bind' backend: BindBackend requires root privileges
I0811 01:54:29.077810 26717 provisioner.cpp:249] Using default backend 'copy'
I0811 01:54:29.079680 1741 slave.cpp:231] Mesos agent started on (743)@172.17.0.4:35690
I0811 01:54:29.079860 1741 slave.cpp:232] Flags at startup: --acls="" --appc_simple_discovery_uri_prefix="http://" --appc_store_dir="/tmp/mesos/store/appc" --authenticate_http_executors="true" --authenticate_http_readonly="true" --authenticate_http_readwrite="true" --authenticatee="crammd5" --authentication_backoff_factor="1secs" --authorizer="local" --cgroups_cpu_enable_pids_and_tids_count="false" --cgroups_enable_cfs="false" --cgroups_hierarchy="/sys/fs/cgroup" --cgroups_limit_swap="false" --cgroups_root="mesos" --container_disk_watch_interval="15secs" --containerizers="mesos" --credential="/tmp/Endpoint_SlaveEndpointTest_AuthorizedRequest_2_WW9cU0/credential" --default_role="*" --disk_watch_interval="1mins" --docker="docker" --docker_kill_orphans="true" --docker_registry="https://registry-1.docker.io" --docker_remove_delay="6hrs" --docker_socket="/var/run/docker.sock" --docker_stop_timeout="0ns" --docker_store_dir="/tmp/mesos/store/docker" --docker_volume_checkpoint_dir="/var/run/mesos/isolators/docker/volume" --enforce_container_disk_quota="false" --executor_registration_timeout="1mins" --executor_reregistration_timeout="2secs" --executor_secret_key="/tmp/Endpoint_SlaveEndpointTest_AuthorizedRequest_2_WW9cU0/executor_secret_key" --executor_shutdown_grace_period="5secs" --fetcher_cache_dir="/tmp/Endpoint_SlaveEndpointTest_AuthorizedRequest_2_WW9cU0/fetch" --fetcher_cache_size="2GB" --frameworks_home="" --gc_delay="1weeks" --gc_disk_headroom="0.1" --hadoop_home="" --help="false" --hostname_lookup="true" --http_command_executor="false" --http_credentials="/tmp/Endpoint_SlaveEndpointTest_AuthorizedRequest_2_WW9cU0/http_credentials" --http_heartbeat_interval="30secs" --initialize_driver_logging="true" --isolation="posix/cpu,posix/mem" --launcher="posix" --launcher_dir="/mesos/build/src" --logbufsecs="0" --logging_level="INFO" --max_completed_executors_per_framework="150" --oversubscribed_resources_interval="15secs" --perf_duration="10secs" --perf_interval="1mins" --port="5051" --qos_correction_interval_min="0ns" --quiet="false" --recover="reconnect" --recovery_timeout="15mins" --registration_backoff_factor="10ms" --resources="cpus:2;gpus:0;mem:1024;disk:1024;ports:[31000-32000]" --revocable_cpu_low_priority="true" --runtime_dir="/tmp/Endpoint_SlaveEndpointTest_AuthorizedRequest_2_WW9cU0" --sandbox_directory="/mnt/mesos/sandbox" --strict="true" --switch_user="true" --systemd_enable_support="true" --systemd_runtime_directory="/run/systemd/system" --version="false" --work_dir="/tmp/Endpoint_SlaveEndpointTest_AuthorizedRequest_2_Wroq1v"
I0811 01:54:29.080224 1741 credentials.hpp:86] Loading credential for authentication from '/tmp/Endpoint_SlaveEndpointTest_AuthorizedRequest_2_WW9cU0/credential'
I0811 01:54:29.080420 1741 slave.cpp:264] Agent using credential for: test-principal
I0811 01:54:29.080518 1741 credentials.hpp:37] Loading credentials for authentication from '/tmp/Endpoint_SlaveEndpointTest_AuthorizedRequest_2_WW9cU0/http_credentials'
I0811 01:54:29.080745 1741 http.cpp:975] Creating default 'basic' HTTP authenticator for realm 'mesos-agent-executor'
I0811 01:54:29.080891 1741 http.cpp:996] Creating default 'jwt' HTTP authenticator for realm 'mesos-agent-executor'
I0811 01:54:29.081048 1741 http.cpp:975] Creating default 'basic' HTTP authenticator for realm 'mesos-agent-readonly'
I0811 01:54:29.081212 1741 http.cpp:996] Creating default 'jwt' HTTP authenticator for realm 'mesos-agent-readonly'
I0811 01:54:29.081352 1741 http.cpp:975] Creating default 'basic' HTTP authenticator for realm 'mesos-agent-readwrite'
I0811 01:54:29.081485 1741 http.cpp:996] Creating default 'jwt' HTTP authenticator for realm 'mesos-agent-readwrite'
I0811 01:54:29.082051 1741 slave.cpp:531] Agent resources: cpus(*):2; mem(*):1024; disk(*):1024; ports(*):[31000-32000]
I0811 01:54:29.082233 1741 slave.cpp:539] Agent attributes: [ ]
I0811 01:54:29.082331 1741 slave.cpp:544] Agent hostname: 357a0dc71b66
I0811 01:54:29.082810 1741 status_update_manager.cpp:177] Pausing sending status updates
I0811 01:54:29.083133 1749 state.cpp:62] Recovering state from '/tmp/Endpoint_SlaveEndpointTest_AuthorizedRequest_2_Wroq1v/meta'
I0811 01:54:29.083454 1749 status_update_manager.cpp:203] Recovering status update manager
I0811 01:54:29.083597 1749 containerizer.cpp:608] Recovering containerizer
I0811 01:54:29.084198 1749 provisioner.cpp:410] Provisioner recovery complete
I0811 01:54:29.084435 1749 slave.cpp:6075] Finished recovery
I0811 01:54:29.085073 1749 slave.cpp:6257] Querying resource estimator for oversubscribable resources
I0811 01:54:29.085386 1746 slave.cpp:6271] Received oversubscribable resources {} from the resource estimator
I0811 01:54:29.086338 1748 process.cpp:3741] Handling HTTP event for process 'slave(743)' with path: '/slave(743)/containers'
I0811 01:54:29.086845 1748 http.cpp:1115] HTTP GET for /slave(743)/containers from 172.17.0.4:46272
I0811 01:54:29.086887 1748 http.cpp:936] Authorizing principal 'test-principal' to GET the '/containers' endpoint
I0811 01:54:29.088289 1730 slave.cpp:796] Agent terminating
I0811 01:54:29.094292 26717 containerizer.cpp:221] Using isolation: posix/cpu,posix/mem,filesystem/posix,network/cni
W0811 01:54:29.094712 26717 backend.cpp:76] Failed to create 'aufs' backend: AufsBackend requires root privileges
W0811 01:54:29.098493 26717 backend.cpp:76] Failed to create 'bind' backend: BindBackend requires root privileges
I0811 01:54:29.098534 26717 provisioner.cpp:249] Using default backend 'copy'
I0811 01:54:29.100122 1729 slave.cpp:231] Mesos agent started on (744)@172.17.0.4:35690
I0811 01:54:29.100154 1729 slave.cpp:232] Flags at startup: --acls="" --appc_simple_discovery_uri_prefix="http://" --appc_store_dir="/tmp/mesos/store/appc" --authenticate_http_executors="true" --authenticate_http_readonly="true" --authenticate_http_readwrite="true" --authenticatee="crammd5" --authentication_backoff_factor="1secs" --authorizer="local" --cgroups_cpu_enable_pids_and_tids_count="false" --cgroups_enable_cfs="false" --cgroups_hierarchy="/sys/fs/cgroup" --cgroups_limit_swap="false" --cgroups_root="mesos" --container_disk_watch_interval="15secs" --containerizers="mesos" --credential="/tmp/Endpoint_SlaveEndpointTest_UnauthorizedRequest_0_ZYyhA0/credential" --default_role="*" --disk_watch_interval="1mins" --docker="docker" --docker_kill_orphans="true" --docker_registry="https://registry-1.docker.io" --docker_remove_delay="6hrs" --docker_socket="/var/run/docker.sock" --docker_stop_timeout="0ns" --docker_store_dir="/tmp/mesos/store/docker" --docker_volume_checkpoint_dir="/var/run/mesos/isolators/docker/volume" --enforce_container_disk_quota="false" --executor_registration_timeout="1mins" --executor_reregistration_timeout="2secs" --executor_secret_key="/tmp/Endpoint_SlaveEndpointTest_UnauthorizedRequest_0_ZYyhA0/executor_secret_key" --executor_shutdown_grace_period="5secs" --fetcher_cache_dir="/tmp/Endpoint_SlaveEndpointTest_UnauthorizedRequest_0_ZYyhA0/fetch" --fetcher_cache_size="2GB" --frameworks_home="" --gc_delay="1weeks" --gc_disk_headroom="0.1" --hadoop_home="" --help="false" --hostname_lookup="true" --http_command_executor="false" --http_credentials="/tmp/Endpoint_SlaveEndpointTest_UnauthorizedRequest_0_ZYyhA0/http_credentials" --http_heartbeat_interval="30secs" --initialize_driver_logging="true" --isolation="posix/cpu,posix/mem" --launcher="posix" --launcher_dir="/mesos/build/src" --logbufsecs="0" --logging_level="INFO" --max_completed_executors_per_framework="150" --oversubscribed_resources_interval="15secs" --perf_duration="10secs" --perf_interval="1mins" --port="5051" --qos_correction_interval_min="0ns" --quiet="false" --recover="reconnect" --recovery_timeout="15mins" --registration_backoff_factor="10ms" --resources="cpus:2;gpus:0;mem:1024;disk:1024;ports:[31000-32000]" --revocable_cpu_low_priority="true" --runtime_dir="/tmp/Endpoint_SlaveEndpointTest_UnauthorizedRequest_0_ZYyhA0" --sandbox_directory="/mnt/mesos/sandbox" --strict="true" --switch_user="true" --systemd_enable_support="true" --systemd_runtime_directory="/run/systemd/system" --version="false" --work_dir="/tmp/Endpoint_SlaveEndpointTest_UnauthorizedRequest_0_jLbVEv"
I0811 01:54:29.100353 1729 credentials.hpp:86] Loading credential for authentication from '/tmp/Endpoint_SlaveEndpointTest_UnauthorizedRequest_0_ZYyhA0/credential'
I0811 01:54:29.100483 1729 slave.cpp:264] Agent using credential for: test-principal
I0811 01:54:29.100492 1729 credentials.hpp:37] Loading credentials for authentication from '/tmp/Endpoint_SlaveEndpointTest_UnauthorizedRequest_0_ZYyhA0/http_credentials'
I0811 01:54:29.100607 1729 http.cpp:975] Creating default 'basic' HTTP authenticator for realm 'mesos-agent-executor'
I0811 01:54:29.100648 1729 http.cpp:996] Creating default 'jwt' HTTP authenticator for realm 'mesos-agent-executor'
I0811 01:54:29.100891 1729 http.cpp:975] Creating default 'basic' HTTP authenticator for realm 'mesos-agent-readonly'
I0811 01:54:29.100932 1729 http.cpp:996] Creating default 'jwt' HTTP authenticator for realm 'mesos-agent-readonly'
I0811 01:54:29.100998 1729 http.cpp:975] Creating default 'basic' HTTP authenticator for realm 'mesos-agent-readwrite'
I0811 01:54:29.101043 1729 http.cpp:996] Creating default 'jwt' HTTP authenticator for realm 'mesos-agent-readwrite'
I0811 01:54:29.101584 1729 slave.cpp:531] Agent resources: cpus(*):2; mem(*):1024; disk(*):1024; ports(*):[31000-32000]
I0811 01:54:29.101636 1729 slave.cpp:539] Agent attributes: [ ]
I0811 01:54:29.101649 1729 slave.cpp:544] Agent hostname: 357a0dc71b66
I0811 01:54:29.101727 1737 status_update_manager.cpp:177] Pausing sending status updates
I0811 01:54:29.102422 1729 state.cpp:62] Recovering state from '/tmp/Endpoint_SlaveEndpointTest_UnauthorizedRequest_0_jLbVEv/meta'
I0811 01:54:29.102833 1729 status_update_manager.cpp:203] Recovering status update manager
I0811 01:54:29.103000 1729 containerizer.cpp:608] Recovering containerizer
I0811 01:54:29.103615 1729 provisioner.cpp:410] Provisioner recovery complete
I0811 01:54:29.103894 1735 slave.cpp:6075] Finished recovery
I0811 01:54:29.104377 1735 slave.cpp:6257] Querying resource estimator for oversubscribable resources
I0811 01:54:29.104490 1737 slave.cpp:6271] Received oversubscribable resources {} from the resource estimator
I0811 01:54:29.105222 1751 process.cpp:3741] Handling HTTP event for process 'slave(744)' with path: '/slave(744)/monitor/statistics'
I0811 01:54:29.106055 1743 http.cpp:1115] HTTP GET for /slave(744)/monitor/statistics from 172.17.0.4:46274
I0811 01:54:29.106130 1743 http.cpp:936] Authorizing principal 'test-principal' to GET the '/monitor/statistics' endpoint
I0811 01:54:29.107462 1733 slave.cpp:796] Agent terminating
I0811 01:54:29.113749 26717 containerizer.cpp:221] Using isolation: posix/cpu,posix/mem,filesystem/posix,network/cni
W0811 01:54:29.114553 26717 backend.cpp:76] Failed to create 'aufs' backend: AufsBackend requires root privileges
W0811 01:54:29.114706 26717 backend.cpp:76] Failed to create 'bind' backend: BindBackend requires root privileges
I0811 01:54:29.114830 26717 provisioner.cpp:249] Using default backend 'copy'
I0811 01:54:29.116660 1737 slave.cpp:231] Mesos agent started on (745)@172.17.0.4:35690
I0811 01:54:29.116834 1737 slave.cpp:232] Flags at startup: --acls="" --appc_simple_discovery_uri_prefix="http://" --appc_store_dir="/tmp/mesos/store/appc" --authenticate_http_executors="true" --authenticate_http_readonly="true" --authenticate_http_readwrite="true" --authenticatee="crammd5" --authentication_backoff_factor="1secs" --authorizer="local" --cgroups_cpu_enable_pids_and_tids_count="false" --cgroups_enable_cfs="false" --cgroups_hierarchy="/sys/fs/cgroup" --cgroups_limit_swap="false" --cgroups_root="mesos" --container_disk_watch_interval="15secs" --containerizers="mesos" --credential="/tmp/Endpoint_SlaveEndpointTest_UnauthorizedRequest_1_kjaTr0/credential" --default_role="*" --disk_watch_interval="1mins" --docker="docker" --docker_kill_orphans="true" --docker_registry="https://registry-1.docker.io" --docker_remove_delay="6hrs" --docker_socket="/var/run/docker.sock" --docker_stop_timeout="0ns" --docker_store_dir="/tmp/mesos/store/docker" --docker_volume_checkpoint_dir="/var/run/mesos/isolators/docker/volume" --enforce_container_disk_quota="false" --executor_registration_timeout="1mins" --executor_reregistration_timeout="2secs" --executor_secret_key="/tmp/Endpoint_SlaveEndpointTest_UnauthorizedRequest_1_kjaTr0/executor_secret_key" --executor_shutdown_grace_period="5secs" --fetcher_cache_dir="/tmp/Endpoint_SlaveEndpointTest_UnauthorizedRequest_1_kjaTr0/fetch" --fetcher_cache_size="2GB" --frameworks_home="" --gc_delay="1weeks" --gc_disk_headroom="0.1" --hadoop_home="" --help="false" --hostname_lookup="true" --http_command_executor="false" --http_credentials="/tmp/Endpoint_SlaveEndpointTest_UnauthorizedRequest_1_kjaTr0/http_credentials" --http_heartbeat_interval="30secs" --initialize_driver_logging="true" --isolation="posix/cpu,posix/mem" --launcher="posix" --launcher_dir="/mesos/build/src" --logbufsecs="0" --logging_level="INFO" --max_completed_executors_per_framework="150" --oversubscribed_resources_interval="15secs" --perf_duration="10secs" --perf_interval="1mins" --port="5051" --qos_correction_interval_min="0ns" --quiet="false" --recover="reconnect" --recovery_timeout="15mins" --registration_backoff_factor="10ms" --resources="cpus:2;gpus:0;mem:1024;disk:1024;ports:[31000-32000]" --revocable_cpu_low_priority="true" --runtime_dir="/tmp/Endpoint_SlaveEndpointTest_UnauthorizedRequest_1_kjaTr0" --sandbox_directory="/mnt/mesos/sandbox" --strict="true" --switch_user="true" --systemd_enable_support="true" --systemd_runtime_directory="/run/systemd/system" --version="false" --work_dir="/tmp/Endpoint_SlaveEndpointTest_UnauthorizedRequest_1_7OWDtv"
I0811 01:54:29.117197 1737 credentials.hpp:86] Loading credential for authentication from '/tmp/Endpoint_SlaveEndpointTest_UnauthorizedRequest_1_kjaTr0/credential'
I0811 01:54:29.117396 1737 slave.cpp:264] Agent using credential for: test-principal
I0811 01:54:29.117507 1737 credentials.hpp:37] Loading credentials for authentication from '/tmp/Endpoint_SlaveEndpointTest_UnauthorizedRequest_1_kjaTr0/http_credentials'
I0811 01:54:29.117735 1737 http.cpp:975] Creating default 'basic' HTTP authenticator for realm 'mesos-agent-executor'
I0811 01:54:29.117867 1737 http.cpp:996] Creating default 'jwt' HTTP authenticator for realm 'mesos-agent-executor'
I0811 01:54:29.118057 1737 http.cpp:975] Creating default 'basic' HTTP authenticator for realm 'mesos-agent-readonly'
I0811 01:54:29.118185 1737 http.cpp:996] Creating default 'jwt' HTTP authenticator for realm 'mesos-agent-readonly'
I0811 01:54:29.118326 1737 http.cpp:975] Creating default 'basic' HTTP authenticator for realm 'mesos-agent-readwrite'
I0811 01:54:29.118453 1737 http.cpp:996] Creating default 'jwt' HTTP authenticator for realm 'mesos-agent-readwrite'
I0811 01:54:29.119006 1737 slave.cpp:531] Agent resources: cpus(*):2; mem(*):1024; disk(*):1024; ports(*):[31000-32000]
I0811 01:54:29.119133 1737 slave.cpp:539] Agent attributes: [ ]
I0811 01:54:29.119215 1737 slave.cpp:544] Agent hostname: 357a0dc71b66
I0811 01:54:29.119387 1741 status_update_manager.cpp:177] Pausing sending status updates
I0811 01:54:29.119716 1749 state.cpp:62] Recovering state from '/tmp/Endpoint_SlaveEndpointTest_UnauthorizedRequest_1_7OWDtv/meta'
I0811 01:54:29.119909 1743 status_update_manager.cpp:203] Recovering status update manager
I0811 01:54:29.120067 1731 containerizer.cpp:608] Recovering containerizer
I0811 01:54:29.120649 1742 provisioner.cpp:410] Provisioner recovery complete
I0811 01:54:29.120795 1742 slave.cpp:6075] Finished recovery
I0811 01:54:29.121260 1742 slave.cpp:6257] Querying resource estimator for oversubscribable resources
I0811 01:54:29.121374 1742 slave.cpp:6271] Received oversubscribable resources {} from the resource estimator
I0811 01:54:29.122364 1735 process.cpp:3741] Handling HTTP event for process 'slave(745)' with path: '/slave(745)/monitor/statistics.json'
I0811 01:54:29.123082 1730 http.cpp:1115] HTTP GET for /slave(745)/monitor/statistics.json from 172.17.0.4:46276
I0811 01:54:29.123132 1730 http.cpp:936] Authorizing principal 'test-principal' to GET the '/monitor/statistics.json' endpoint
I0811 01:54:29.124894 1731 slave.cpp:796] Agent terminating
I0811 01:54:29.130991 26717 containerizer.cpp:221] Using isolation: posix/cpu,posix/mem,filesystem/posix,network/cni
W0811 01:54:29.131314 26717 backend.cpp:76] Failed to create 'aufs' backend: AufsBackend requires root privileges
W0811 01:54:29.131347 26717 backend.cpp:76] Failed to create 'bind' backend: BindBackend requires root privileges
I0811 01:54:29.131361 26717 provisioner.cpp:249] Using default backend 'copy'
I0811 01:54:29.132594 1729 slave.cpp:231] Mesos agent started on (746)@172.17.0.4:35690
I0811 01:54:29.132658 1729 slave.cpp:232] Flags at startup: --acls="" --appc_simple_discovery_uri_prefix="http://" --appc_store_dir="/tmp/mesos/store/appc" --authenticate_http_executors="true" --authenticate_http_readonly="true" --authenticate_http_readwrite="true" --authenticatee="crammd5" --authentication_backoff_factor="1secs" --authorizer="local" --cgroups_cpu_enable_pids_and_tids_count="false" --cgroups_enable_cfs="false" --cgroups_hierarchy="/sys/fs/cgroup" --cgroups_limit_swap="false" --cgroups_root="mesos" --container_disk_watch_interval="15secs" --containerizers="mesos" --credential="/tmp/Endpoint_SlaveEndpointTest_UnauthorizedRequest_2_hxbKt0/credential" --default_role="*" --disk_watch_interval="1mins" --docker="docker" --docker_kill_orphans="true" --docker_registry="https://registry-1.docker.io" --docker_remove_delay="6hrs" --docker_socket="/var/run/docker.sock" --docker_stop_timeout="0ns" --docker_store_dir="/tmp/mesos/store/docker" --docker_volume_checkpoint_dir="/var/run/mesos/isolators/docker/volume" --enforce_container_disk_quota="false" --executor_registration_timeout="1mins" --executor_reregistration_timeout="2secs" --executor_secret_key="/tmp/Endpoint_SlaveEndpointTest_UnauthorizedRequest_2_hxbKt0/executor_secret_key" --executor_shutdown_grace_period="5secs" --fetcher_cache_dir="/tmp/Endpoint_SlaveEndpointTest_UnauthorizedRequest_2_hxbKt0/fetch" --fetcher_cache_size="2GB" --frameworks_home="" --gc_delay="1weeks" --gc_disk_headroom="0.1" --hadoop_home="" --help="false" --hostname_lookup="true" --http_command_executor="false" --http_credentials="/tmp/Endpoint_SlaveEndpointTest_UnauthorizedRequest_2_hxbKt0/http_credentials" --http_heartbeat_interval="30secs" --initialize_driver_logging="true" --isolation="posix/cpu,posix/mem" --launcher="posix" --launcher_dir="/mesos/build/src" --logbufsecs="0" --logging_level="INFO" --max_completed_executors_per_framework="150" --oversubscribed_resources_interval="15secs" --perf_duration="10secs" --perf_interval="1mins" --port="5051" --qos_correction_interval_min="0ns" --quiet="false" --recover="reconnect" --recovery_timeout="15mins" --registration_backoff_factor="10ms" --resources="cpus:2;gpus:0;mem:1024;disk:1024;ports:[31000-32000]" --revocable_cpu_low_priority="true" --runtime_dir="/tmp/Endpoint_SlaveEndpointTest_UnauthorizedRequest_2_hxbKt0" --sandbox_directory="/mnt/mesos/sandbox" --strict="true" --switch_user="true" --systemd_enable_support="true" --systemd_runtime_directory="/run/systemd/system" --version="false" --work_dir="/tmp/Endpoint_SlaveEndpointTest_UnauthorizedRequest_2_MlZUsv"
I0811 01:54:29.132972 1729 credentials.hpp:86] Loading credential for authentication from '/tmp/Endpoint_SlaveEndpointTest_UnauthorizedRequest_2_hxbKt0/credential'
I0811 01:54:29.133162 1729 slave.cpp:264] Agent using credential for: test-principal
I0811 01:54:29.133179 1729 credentials.hpp:37] Loading credentials for authentication from '/tmp/Endpoint_SlaveEndpointTest_UnauthorizedRequest_2_hxbKt0/http_credentials'
I0811 01:54:29.133333 1729 http.cpp:975] Creating default 'basic' HTTP authenticator for realm 'mesos-agent-executor'
I0811 01:54:29.133401 1729 http.cpp:996] Creating default 'jwt' HTTP authenticator for realm 'mesos-agent-executor'
I0811 01:54:29.133456 1729 http.cpp:975] Creating default 'basic' HTTP authenticator for realm 'mesos-agent-readonly'
I0811 01:54:29.133476 1729 http.cpp:996] Creating default 'jwt' HTTP authenticator for realm 'mesos-agent-readonly'
I0811 01:54:29.133505 1729 http.cpp:975] Creating default 'basic' HTTP authenticator for realm 'mesos-agent-readwrite'
I0811 01:54:29.133522 1729 http.cpp:996] Creating default 'jwt' HTTP authenticator for realm 'mesos-agent-readwrite'
I0811 01:54:29.133975 1729 slave.cpp:531] Agent resources: cpus(*):2; mem(*):1024; disk(*):1024; ports(*):[31000-32000]
I0811 01:54:29.134011 1729 slave.cpp:539] Agent attributes: [ ]
I0811 01:54:29.134017 1729 slave.cpp:544] Agent hostname: 357a0dc71b66
I0811 01:54:29.134294 1738 status_update_manager.cpp:177] Pausing sending status updates
I0811 01:54:29.134495 1731 state.cpp:62] Recovering state from '/tmp/Endpoint_SlaveEndpointTest_UnauthorizedRequest_2_MlZUsv/meta'
I0811 01:54:29.134713 1731 status_update_manager.cpp:203] Recovering status update manager
I0811 01:54:29.134950 1751 containerizer.cpp:608] Recovering containerizer
I0811 01:54:29.135524 1751 provisioner.cpp:410] Provisioner recovery complete
I0811 01:54:29.135737 1751 slave.cpp:6075] Finished recovery
I0811 01:54:29.136282 1751 slave.cpp:6257] Querying resource estimator for oversubscribable resources
I0811 01:54:29.136624 1731 slave.cpp:6271] Received oversubscribable resources {} from the resource estimator
I0811 01:54:29.137784 1742 process.cpp:3741] Handling HTTP event for process 'slave(746)' with path: '/slave(746)/containers'
I0811 01:54:29.138417 1730 http.cpp:1115] HTTP GET for /slave(746)/containers from 172.17.0.4:46278
I0811 01:54:29.138463 1730 http.cpp:936] Authorizing principal 'test-principal' to GET the '/containers' endpoint
I0811 01:54:29.139822 1732 slave.cpp:796] Agent terminating
I0811 01:54:29.144632 26717 containerizer.cpp:221] Using isolation: posix/cpu,posix/mem,filesystem/posix,network/cni
W0811 01:54:29.144865 26717 backend.cpp:76] Failed to create 'aufs' backend: AufsBackend requires root privileges
W0811 01:54:29.144906 26717 backend.cpp:76] Failed to create 'bind' backend: BindBackend requires root privileges
I0811 01:54:29.144920 26717 provisioner.cpp:249] Using default backend 'copy'
I0811 01:54:29.145524 26717 cluster.cpp:448] Creating default 'local' authorizer
I0811 01:54:29.146045 1749 slave.cpp:231] Mesos agent started on (747)@172.17.0.4:35690
I0811 01:54:29.146090 1749 slave.cpp:232] Flags at startup: --acls="" --appc_simple_discovery_uri_prefix="http://" --appc_store_dir="/tmp/mesos/store/appc" --authenticate_http_executors="true" --authenticate_http_readonly="true" --authenticate_http_readwrite="true" --authenticatee="crammd5" --authentication_backoff_factor="1secs" --authorizer="local" --cgroups_cpu_enable_pids_and_tids_count="false" --cgroups_enable_cfs="false" --cgroups_hierarchy="/sys/fs/cgroup" --cgroups_limit_swap="false" --cgroups_root="mesos" --container_disk_watch_interval="15secs" --containerizers="mesos" --credential="/tmp/Endpoint_SlaveEndpointTest_NoAuthorizer_0_MCafE0/credential" --default_role="*" --disk_watch_interval="1mins" --docker="docker" --docker_kill_orphans="true" --docker_registry="https://registry-1.docker.io" --docker_remove_delay="6hrs" --docker_socket="/var/run/docker.sock" --docker_stop_timeout="0ns" --docker_store_dir="/tmp/mesos/store/docker" --docker_volume_checkpoint_dir="/var/run/mesos/isolators/docker/volume" --enforce_container_disk_quota="false" --executor_registration_timeout="1mins" --executor_reregistration_timeout="2secs" --executor_secret_key="/tmp/Endpoint_SlaveEndpointTest_NoAuthorizer_0_MCafE0/executor_secret_key" --executor_shutdown_grace_period="5secs" --fetcher_cache_dir="/tmp/Endpoint_SlaveEndpointTest_NoAuthorizer_0_MCafE0/fetch" --fetcher_cache_size="2GB" --frameworks_home="" --gc_delay="1weeks" --gc_disk_headroom="0.1" --hadoop_home="" --help="false" --hostname_lookup="true" --http_command_executor="false" --http_credentials="/tmp/Endpoint_SlaveEndpointTest_NoAuthorizer_0_MCafE0/http_credentials" --http_heartbeat_interval="30secs" --initialize_driver_logging="true" --isolation="posix/cpu,posix/mem" --launcher="posix" --launcher_dir="/mesos/build/src" --logbufsecs="0" --logging_level="INFO" --max_completed_executors_per_framework="150" --oversubscribed_resources_interval="15secs" --perf_duration="10secs" --perf_interval="1mins" --port="5051" --qos_correction_interval_min="0ns" --quiet="false" --recover="reconnect" --recovery_timeout="15mins" --registration_backoff_factor="10ms" --resources="cpus:2;gpus:0;mem:1024;disk:1024;ports:[31000-32000]" --revocable_cpu_low_priority="true" --runtime_dir="/tmp/Endpoint_SlaveEndpointTest_NoAuthorizer_0_MCafE0" --sandbox_directory="/mnt/mesos/sandbox" --strict="true" --switch_user="true" --systemd_enable_support="true" --systemd_runtime_directory="/run/systemd/system" --version="false" --work_dir="/tmp/Endpoint_SlaveEndpointTest_NoAuthorizer_0_bakjBv"
I0811 01:54:29.146458 1749 credentials.hpp:86] Loading credential for authentication from '/tmp/Endpoint_SlaveEndpointTest_NoAuthorizer_0_MCafE0/credential'
I0811 01:54:29.146585 1749 slave.cpp:264] Agent using credential for: test-principal
I0811 01:54:29.146600 1749 credentials.hpp:37] Loading credentials for authentication from '/tmp/Endpoint_SlaveEndpointTest_NoAuthorizer_0_MCafE0/http_credentials'
I0811 01:54:29.146759 1749 http.cpp:975] Creating default 'basic' HTTP authenticator for realm 'mesos-agent-executor'
I0811 01:54:29.146805 1749 http.cpp:996] Creating default 'jwt' HTTP authenticator for realm 'mesos-agent-executor'
I0811 01:54:29.147022 1749 http.cpp:975] Creating default 'basic' HTTP authenticator for realm 'mesos-agent-readonly'
I0811 01:54:29.147111 1749 http.cpp:996] Creating default 'jwt' HTTP authenticator for realm 'mesos-agent-readonly'
I0811 01:54:29.147320 1749 http.cpp:975] Creating default 'basic' HTTP authenticator for realm 'mesos-agent-readwrite'
I0811 01:54:29.147373 1749 http.cpp:996] Creating default 'jwt' HTTP authenticator for realm 'mesos-agent-readwrite'
I0811 01:54:29.147941 1749 slave.cpp:531] Agent resources: cpus(*):2; mem(*):1024; disk(*):1024; ports(*):[31000-32000]
I0811 01:54:29.147981 1749 slave.cpp:539] Agent attributes: [ ]
I0811 01:54:29.147991 1749 slave.cpp:544] Agent hostname: 357a0dc71b66
I0811 01:54:29.148044 1741 status_update_manager.cpp:177] Pausing sending status updates
I0811 01:54:29.148407 1738 state.cpp:62] Recovering state from '/tmp/Endpoint_SlaveEndpointTest_NoAuthorizer_0_bakjBv/meta'
I0811 01:54:29.148550 1738 status_update_manager.cpp:203] Recovering status update manager
I0811 01:54:29.148605 1738 containerizer.cpp:608] Recovering containerizer
I0811 01:54:29.149077 1738 provisioner.cpp:410] Provisioner recovery complete
I0811 01:54:29.149205 1738 slave.cpp:6075] Finished recovery
I0811 01:54:29.149507 1738 slave.cpp:6257] Querying resource estimator for oversubscribable resources
I0811 01:54:29.149636 1738 slave.cpp:6271] Received oversubscribable resources {} from the resource estimator
I0811 01:54:29.150686 1730 process.cpp:3741] Handling HTTP event for process 'slave(747)' with path: '/slave(747)/monitor/statistics'
I0811 01:54:29.151108 1730 http.cpp:1115] HTTP GET for /slave(747)/monitor/statistics from 172.17.0.4:46280
I0811 01:54:29.151140 1730 http.cpp:936] Authorizing principal 'test-principal' to GET the '/monitor/statistics' endpoint
I0811 01:54:29.152721 1730 slave.cpp:796] Agent terminating
I0811 01:54:29.157876 26717 containerizer.cpp:221] Using isolation: posix/cpu,posix/mem,filesystem/posix,network/cni
W0811 01:54:29.158124 26717 backend.cpp:76] Failed to create 'aufs' backend: AufsBackend requires root privileges
W0811 01:54:29.158161 26717 backend.cpp:76] Failed to create 'bind' backend: BindBackend requires root privileges
I0811 01:54:29.158174 26717 provisioner.cpp:249] Using default backend 'copy'
I0811 01:54:29.158623 26717 cluster.cpp:448] Creating default 'local' authorizer
I0811 01:54:29.159061 1745 slave.cpp:231] Mesos agent started on (748)@172.17.0.4:35690
I0811 01:54:29.159085 1745 slave.cpp:232] Flags at startup: --acls="" --appc_simple_discovery_uri_prefix="http://" --appc_store_dir="/tmp/mesos/store/appc" --authenticate_http_executors="true" --authenticate_http_readonly="true" --authenticate_http_readwrite="true" --authenticatee="crammd5" --authentication_backoff_factor="1secs" --authorizer="local" --cgroups_cpu_enable_pids_and_tids_count="false" --cgroups_enable_cfs="false" --cgroups_hierarchy="/sys/fs/cgroup" --cgroups_limit_swap="false" --cgroups_root="mesos" --container_disk_watch_interval="15secs" --containerizers="mesos" --credential="/tmp/Endpoint_SlaveEndpointTest_NoAuthorizer_1_vnbvW0/credential" --default_role="*" --disk_watch_interval="1mins" --docker="docker" --docker_kill_orphans="true" --docker_registry="https://registry-1.docker.io" --docker_remove_delay="6hrs" --docker_socket="/var/run/docker.sock" --docker_stop_timeout="0ns" --docker_store_dir="/tmp/mesos/store/docker" --docker_volume_checkpoint_dir="/var/run/mesos/isolators/docker/volume" --enforce_container_disk_quota="false" --executor_registration_timeout="1mins" --executor_reregistration_timeout="2secs" --executor_secret_key="/tmp/Endpoint_SlaveEndpointTest_NoAuthorizer_1_vnbvW0/executor_secret_key" --executor_shutdown_grace_period="5secs" --fetcher_cache_dir="/tmp/Endpoint_SlaveEndpointTest_NoAuthorizer_1_vnbvW0/fetch" --fetcher_cache_size="2GB" --frameworks_home="" --gc_delay="1weeks" --gc_disk_headroom="0.1" --hadoop_home="" --help="false" --hostname_lookup="true" --http_command_executor="false" --http_credentials="/tmp/Endpoint_SlaveEndpointTest_NoAuthorizer_1_vnbvW0/http_credentials" --http_heartbeat_interval="30secs" --initialize_driver_logging="true" --isolation="posix/cpu,posix/mem" --launcher="posix" --launcher_dir="/mesos/build/src" --logbufsecs="0" --logging_level="INFO" --max_completed_executors_per_framework="150" --oversubscribed_resources_interval="15secs" --perf_duration="10secs" --perf_interval="1mins" --port="5051" --qos_correction_interval_min="0ns" --quiet="false" --recover="reconnect" --recovery_timeout="15mins" --registration_backoff_factor="10ms" --resources="cpus:2;gpus:0;mem:1024;disk:1024;ports:[31000-32000]" --revocable_cpu_low_priority="true" --runtime_dir="/tmp/Endpoint_SlaveEndpointTest_NoAuthorizer_1_vnbvW0" --sandbox_directory="/mnt/mesos/sandbox" --strict="true" --switch_user="true" --systemd_enable_support="true" --systemd_runtime_directory="/run/systemd/system" --version="false" --work_dir="/tmp/Endpoint_SlaveEndpointTest_NoAuthorizer_1_j38CRv"
I0811 01:54:29.159253 1745 credentials.hpp:86] Loading credential for authentication from '/tmp/Endpoint_SlaveEndpointTest_NoAuthorizer_1_vnbvW0/credential'
I0811 01:54:29.159334 1745 slave.cpp:264] Agent using credential for: test-principal
I0811 01:54:29.159344 1745 credentials.hpp:37] Loading credentials for authentication from '/tmp/Endpoint_SlaveEndpointTest_NoAuthorizer_1_vnbvW0/http_credentials'
I0811 01:54:29.159448 1745 http.cpp:975] Creating default 'basic' HTTP authenticator for realm 'mesos-agent-executor'
I0811 01:54:29.159485 1745 http.cpp:996] Creating default 'jwt' HTTP authenticator for realm 'mesos-agent-executor'
I0811 01:54:29.159608 1745 http.cpp:975] Creating default 'basic' HTTP authenticator for realm 'mesos-agent-readonly'
I0811 01:54:29.159641 1745 http.cpp:996] Creating default 'jwt' HTTP authenticator for realm 'mesos-agent-readonly'
I0811 01:54:29.159785 1745 http.cpp:975] Creating default 'basic' HTTP authenticator for realm 'mesos-agent-readwrite'
I0811 01:54:29.159821 1745 http.cpp:996] Creating default 'jwt' HTTP authenticator for realm 'mesos-agent-readwrite'
I0811 01:54:29.160194 1745 slave.cpp:531] Agent resources: cpus(*):2; mem(*):1024; disk(*):1024; ports(*):[31000-32000]
I0811 01:54:29.160226 1745 slave.cpp:539] Agent attributes: [ ]
I0811 01:54:29.160233 1745 slave.cpp:544] Agent hostname: 357a0dc71b66
I0811 01:54:29.160285 1747 status_update_manager.cpp:177] Pausing sending status updates
I0811 01:54:29.160585 1749 state.cpp:62] Recovering state from '/tmp/Endpoint_SlaveEndpointTest_NoAuthorizer_1_j38CRv/meta'
I0811 01:54:29.160707 1742 status_update_manager.cpp:203] Recovering status update manager
I0811 01:54:29.160830 1730 containerizer.cpp:608] Recovering containerizer
I0811 01:54:29.161389 1743 provisioner.cpp:410] Provisioner recovery complete
I0811 01:54:29.161556 1744 slave.cpp:6075] Finished recovery
I0811 01:54:29.161902 1744 slave.cpp:6257] Querying resource estimator for oversubscribable resources
I0811 01:54:29.161999 1734 slave.cpp:6271] Received oversubscribable resources {} from the resource estimator
I0811 01:54:29.162629 1743 process.cpp:3741] Handling HTTP event for process 'slave(748)' with path: '/slave(748)/monitor/statistics.json'
I0811 01:54:29.163151 1733 http.cpp:1115] HTTP GET for /slave(748)/monitor/statistics.json from 172.17.0.4:46282
I0811 01:54:29.163188 1733 http.cpp:936] Authorizing principal 'test-principal' to GET the '/monitor/statistics.json' endpoint
I0811 01:54:29.164134 1736 slave.cpp:796] Agent terminating
I0811 01:54:29.168550 26717 containerizer.cpp:221] Using isolation: posix/cpu,posix/mem,filesystem/posix,network/cni
W0811 01:54:29.168769 26717 backend.cpp:76] Failed to create 'aufs' backend: AufsBackend requires root privileges
W0811 01:54:29.168802 26717 backend.cpp:76] Failed to create 'bind' backend: BindBackend requires root privileges
I0811 01:54:29.168812 26717 provisioner.cpp:249] Using default backend 'copy'
I0811 01:54:29.169325 26717 cluster.cpp:448] Creating default 'local' authorizer
I0811 01:54:29.169715 1732 slave.cpp:231] Mesos agent started on (749)@172.17.0.4:35690
I0811 01:54:29.169735 1732 slave.cpp:232] Flags at startup: --acls="" --appc_simple_discovery_uri_prefix="http://" --appc_store_dir="/tmp/mesos/store/appc" --authenticate_http_executors="true" --authenticate_http_readonly="true" --authenticate_http_readwrite="true" --authenticatee="crammd5" --authentication_backoff_factor="1secs" --authorizer="local" --cgroups_cpu_enable_pids_and_tids_count="false" --cgroups_enable_cfs="false" --cgroups_hierarchy="/sys/fs/cgroup" --cgroups_limit_swap="false" --cgroups_root="mesos" --container_disk_watch_interval="15secs" --containerizers="mesos" --credential="/tmp/Endpoint_SlaveEndpointTest_NoAuthorizer_2_p30sl1/credential" --default_role="*" --disk_watch_interval="1mins" --docker="docker" --docker_kill_orphans="true" --docker_registry="https://registry-1.docker.io" --docker_remove_delay="6hrs" --docker_socket="/var/run/docker.sock" --docker_stop_timeout="0ns" --docker_store_dir="/tmp/mesos/store/docker" --docker_volume_checkpoint_dir="/var/run/mesos/isolators/docker/volume" --enforce_container_disk_quota="false" --executor_registration_timeout="1mins" --executor_reregistration_timeout="2secs" --executor_secret_key="/tmp/Endpoint_SlaveEndpointTest_NoAuthorizer_2_p30sl1/executor_secret_key" --executor_shutdown_grace_period="5secs" --fetcher_cache_dir="/tmp/Endpoint_SlaveEndpointTest_NoAuthorizer_2_p30sl1/fetch" --fetcher_cache_size="2GB" --frameworks_home="" --gc_delay="1weeks" --gc_disk_headroom="0.1" --hadoop_home="" --help="false" --hostname_lookup="true" --http_command_executor="false" --http_credentials="/tmp/Endpoint_SlaveEndpointTest_NoAuthorizer_2_p30sl1/http_credentials" --http_heartbeat_interval="30secs" --initialize_driver_logging="true" --isolation="posix/cpu,posix/mem" --launcher="posix" --launcher_dir="/mesos/build/src" --logbufsecs="0" --logging_level="INFO" --max_completed_executors_per_framework="150" --oversubscribed_resources_interval="15secs" --perf_duration="10secs" --perf_interval="1mins" --port="5051" --qos_correction_interval_min="0ns" --quiet="false" --recover="reconnect" --recovery_timeout="15mins" --registration_backoff_factor="10ms" --resources="cpus:2;gpus:0;mem:1024;disk:1024;ports:[31000-32000]" --revocable_cpu_low_priority="true" --runtime_dir="/tmp/Endpoint_SlaveEndpointTest_NoAuthorizer_2_p30sl1" --sandbox_directory="/mnt/mesos/sandbox" --strict="true" --switch_user="true" --systemd_enable_support="true" --systemd_runtime_directory="/run/systemd/system" --version="false" --work_dir="/tmp/Endpoint_SlaveEndpointTest_NoAuthorizer_2_FvYYew"
I0811 01:54:29.169901 1732 credentials.hpp:86] Loading credential for authentication from '/tmp/Endpoint_SlaveEndpointTest_NoAuthorizer_2_p30sl1/credential'
I0811 01:54:29.169970 1732 slave.cpp:264] Agent using credential for: test-principal
I0811 01:54:29.169981 1732 credentials.hpp:37] Loading credentials for authentication from '/tmp/Endpoint_SlaveEndpointTest_NoAuthorizer_2_p30sl1/http_credentials'
I0811 01:54:29.170074 1732 http.cpp:975] Creating default 'basic' HTTP authenticator for realm 'mesos-agent-executor'
I0811 01:54:29.170106 1732 http.cpp:996] Creating default 'jwt' HTTP authenticator for realm 'mesos-agent-executor'
I0811 01:54:29.170248 1732 http.cpp:975] Creating default 'basic' HTTP authenticator for realm 'mesos-agent-readonly'
I0811 01:54:29.170302 1732 http.cpp:996] Creating default 'jwt' HTTP authenticator for realm 'mesos-agent-readonly'
I0811 01:54:29.170358 1732 http.cpp:975] Creating default 'basic' HTTP authenticator for realm 'mesos-agent-readwrite'
I0811 01:54:29.170491 1732 http.cpp:996] Creating default 'jwt' HTTP authenticator for realm 'mesos-agent-readwrite'
I0811 01:54:29.170907 1732 slave.cpp:531] Agent resources: cpus(*):2; mem(*):1024; disk(*):1024; ports(*):[31000-32000]
I0811 01:54:29.170938 1732 slave.cpp:539] Agent attributes: [ ]
I0811 01:54:29.170945 1732 slave.cpp:544] Agent hostname: 357a0dc71b66
I0811 01:54:29.170997 1744 status_update_manager.cpp:177] Pausing sending status updates
I0811 01:54:29.171273 1738 state.cpp:62] Recovering state from '/tmp/Endpoint_SlaveEndpointTest_NoAuthorizer_2_FvYYew/meta'
I0811 01:54:29.171380 1748 status_update_manager.cpp:203] Recovering status update manager
I0811 01:54:29.171509 1743 containerizer.cpp:608] Recovering containerizer
I0811 01:54:29.171962 1733 provisioner.cpp:410] Provisioner recovery complete
I0811 01:54:29.172142 1731 slave.cpp:6075] Finished recovery
I0811 01:54:29.172453 1731 slave.cpp:6257] Querying resource estimator for oversubscribable resources
I0811 01:54:29.172530 1729 slave.cpp:6271] Received oversubscribable resources {} from the resource estimator
I0811 01:54:29.172982 1738 process.cpp:3741] Handling HTTP event for process 'slave(749)' with path: '/slave(749)/containers'
I0811 01:54:29.173468 1731 http.cpp:1115] HTTP GET for /slave(749)/containers from 172.17.0.4:46284
I0811 01:54:29.173506 1731 http.cpp:936] Authorizing principal 'test-principal' to GET the '/containers' endpoint
I0811 01:54:29.174665 1731 slave.cpp:796] Agent terminating
E0811 01:54:29.222131 1753 process.cpp:956] Failed to accept socket: future discarded
make[3]: *** [CMakeFiles/check] Error 1
make[2]: *** [CMakeFiles/check.dir/all] Error 2
make[1]: *** [CMakeFiles/check.dir/rule] Error 2
make: *** [check] Error 2
+ docker rmi mesos-1502414233-12208
Untagged: mesos-1502414233-12208:latest
Deleted: sha256:6a5fc313f91567e63f350502cad68e2b408b6cd5a6d2c60a18ba44fb18766f25
Deleted: sha256:c2fa818ebdd62327d4f97a6d3feb022424a433c0ccda5a5ebcb1420e326ca009
Deleted: sha256:334c5a5814726fada19c6e8df1d6bcef92b071860d5e2eca3d372d334f34a300
Deleted: sha256:60f2dba1f7080bbca60edfa8b1d5aaa9d7d7ed3214b84eb874b6ced133c6af33
Deleted: sha256:9e2bb68c4473b7a500d3a37130d187fd9e0c4c8c1abb7c2a52f3f58aa9124b6d
Deleted: sha256:8d557e5d5df7fd4db95148851c714f322c601a0df94b6e5ba59bd272a705e063
Deleted: sha256:926e3e86aed2ad25d80df3cf2375099f79026be2157c6cb931d0d2ff1e652967
Deleted: sha256:162814a3b21d912994bb101134b311ec524a4c63c908942e28389a6746f1d059
Deleted: sha256:69d7e0e429ba7bc0831fafb3ee8d7d8aaf78b6eadaf69af606088fa48ec27b81
Deleted: sha256:57a011a2f13a1accf7448f6c1f54dba541e7f9d1f53b28a9cc2d168ef9fe9b8d
Deleted: sha256:e53b84134fea65240909be1ced07eaced577d00023ea9c5822041634b38492b5
Deleted: sha256:06464a4d1ecba91b40c1b7e4a2b12f3b5b2fa465f6573fba7fb5f970c74341cc
Deleted: sha256:0bbe139a252fd8aa9425475f3a527c8f723de9d75cc5134b4bff9a46eca7d467
Deleted: sha256:1df761fc4049c20ff70a109a0abede631cdf68861fdecdf5401b5f02f7a66fa0
Deleted: sha256:17a4aac0787b506e243421b801ce6a0b2392d333d20557ba7ace8fd04514a992
Deleted: sha256:23fe2259d60d7ca93162f0efbd8aac828741c10abea1ce39840e10d1f1fbaf9b
Deleted: sha256:602ad7b234497fc2f7aa4eee7c1722a381d37bd90199de2432121f714d01cbf1
Deleted: sha256:ab2ca34780dfc2c0d46fae925cdfbcc4927c74744dc70a868f58ff5e86c47447
Deleted: sha256:2eb4a39c7e7b09fa4882e71cfbf5f7631511ff44751a70fdaa3826651f254ffe
Deleted: sha256:16093c52b1a89623c2a0bb347d8dee52d1395d33b952f2e07f5d9fb149e02ba1
Deleted: sha256:235d0c4017a96ca4838e722d33242cf26e7291d5d3dbe1eead7b4f5ea95fb350
Deleted: sha256:c603d93e9af485b5ac17b2d9bde3c64aa276a76f43ff6ab4837634190d6aa15a
Deleted: sha256:0d0c2cffe0972c3fcd8a5a100fbcb6fc8e24cf7a73484f42927a3c5e79cc1943
Deleted: sha256:87727150c455922a4d98ebd44a7f2560f472268d6ba8352c8169f798e34c9366
Build step 'Execute shell' marked build as failure
Jenkins build is back to normal : Mesos-Buildbot » cmake,clang,--verbose --enable-libevent --enable-ssl,GLOG_v=1 MESOS_VERBOSE=1,ubuntu:14.04,(ubuntu)&&(!ubuntu-us1)&&(!ubuntu-eu2) #4095
Posted by Apache Jenkins Server <je...@builds.apache.org>.
See <https://builds.apache.org/job/Mesos-Buildbot/BUILDTOOL=cmake,COMPILER=clang,CONFIGURATION=--verbose%20--enable-libevent%20--enable-ssl,ENVIRONMENT=GLOG_v=1%20MESOS_VERBOSE=1,OS=ubuntu%3A14.04,label_exp=(ubuntu)&&(!ubuntu-us1)&&(!ubuntu-eu2)/4095/display/redirect?page=changes>