You are viewing a plain text version of this content. The canonical link for it is here.
Posted to commits@sling.apache.org by Apache Jenkins Server <je...@builds.apache.org> on 2018/10/09 04:48:02 UTC
Build failed in Jenkins:
sling-org-apache-sling-commons-cache-container-test-1.8 #56
See <https://builds.apache.org/job/sling-org-apache-sling-commons-cache-container-test-1.8/56/display/redirect>
------------------------------------------
Started by timer
[EnvInject] - Loading node environment variables.
Building remotely on ubuntu-1 (ubuntu trusty) in workspace <https://builds.apache.org/job/sling-org-apache-sling-commons-cache-container-test-1.8/ws/>
Cloning the remote Git repository
Cloning repository https://github.com/apache/sling-org-apache-sling-commons-cache-container-test.git
> git init <https://builds.apache.org/job/sling-org-apache-sling-commons-cache-container-test-1.8/ws/> # timeout=10
Fetching upstream changes from https://github.com/apache/sling-org-apache-sling-commons-cache-container-test.git
> git --version # timeout=10
> git fetch --tags --progress https://github.com/apache/sling-org-apache-sling-commons-cache-container-test.git +refs/heads/*:refs/remotes/origin/*
> git config remote.origin.url https://github.com/apache/sling-org-apache-sling-commons-cache-container-test.git # timeout=10
> git config --add remote.origin.fetch +refs/heads/*:refs/remotes/origin/* # timeout=10
> git config remote.origin.url https://github.com/apache/sling-org-apache-sling-commons-cache-container-test.git # timeout=10
Fetching upstream changes from https://github.com/apache/sling-org-apache-sling-commons-cache-container-test.git
> git fetch --tags --progress https://github.com/apache/sling-org-apache-sling-commons-cache-container-test.git +refs/heads/*:refs/remotes/origin/*
> git rev-parse origin/master^{commit} # timeout=10
Checking out Revision bded595cfbc220aaa08696d3725a6020a324e1fe (origin/master)
> git config core.sparsecheckout # timeout=10
> git checkout -f bded595cfbc220aaa08696d3725a6020a324e1fe
Commit message: "trivial: added license header to *.md files"
> git rev-list --no-walk bded595cfbc220aaa08696d3725a6020a324e1fe # timeout=10
Parsing POMs
Established TCP socket on 52206
maven33-agent.jar already up to date
maven33-interceptor.jar already up to date
maven3-interceptor-commons.jar already up to date
[sling-org-apache-sling-commons-cache-container-test-1.8] $ /home/jenkins/tools/java/latest1.8/bin/java -Xmx4g -Xms4g -cp /home/jenkins/jenkins-slave/maven33-agent.jar:/home/jenkins/tools/maven/apache-maven-3.3.9/boot/plexus-classworlds-2.5.2.jar:/home/jenkins/tools/maven/apache-maven-3.3.9/conf/logging jenkins.maven3.agent.Maven33Main /home/jenkins/tools/maven/apache-maven-3.3.9 /home/jenkins/jenkins-slave/slave.jar /home/jenkins/jenkins-slave/maven33-interceptor.jar /home/jenkins/jenkins-slave/maven3-interceptor-commons.jar 52206
<===[JENKINS REMOTING CAPACITY]===> channel started
Executing Maven: -B -f <https://builds.apache.org/job/sling-org-apache-sling-commons-cache-container-test-1.8/ws/pom.xml> -Dmaven.repo.local=/home/jenkins/jenkins-slave/maven-repositories/1 -U clean deploy
[INFO] Scanning for projects...
[INFO]
[INFO] ------------------------------------------------------------------------
[INFO] Building Apache Sling OSGi PAX Exam support library 0.1-SNAPSHOT
[INFO] ------------------------------------------------------------------------
[INFO]
[INFO] --- maven-clean-plugin:2.5:clean (default-clean) @ org.apache.sling.commons.cache.container-test ---
[INFO]
[INFO] --- maven-enforcer-plugin:1.0.1:enforce (enforce-java) @ org.apache.sling.commons.cache.container-test ---
[INFO]
[INFO] --- maven-antrun-plugin:1.7:run (set-bundle-required-execution-environment) @ org.apache.sling.commons.cache.container-test ---
[INFO] Executing tasks
main:
[INFO] Executed tasks
[INFO]
[INFO] --- maven-remote-resources-plugin:1.4:process (default) @ org.apache.sling.commons.cache.container-test ---
[INFO]
[INFO] --- maven-resources-plugin:2.6:resources (default-resources) @ org.apache.sling.commons.cache.container-test ---
[INFO] Using 'UTF-8' encoding to copy filtered resources.
[INFO] skip non existing resourceDirectory <https://builds.apache.org/job/sling-org-apache-sling-commons-cache-container-test-1.8/ws/src/main/resources>
[INFO] Copying 3 resources
[INFO]
[INFO] --- maven-antrun-plugin:1.7:run (check-memory-task) @ org.apache.sling.commons.cache.container-test ---
[INFO] Executing tasks
main:
[echo] **************** WARNING (SLING-443/SLING-1782) ******************************
[echo] On most platforms, you'll get OutOfMemoryErrors when building unless you set
[echo] on 32bit platforms: MAVEN_OPTS="-Xmx256M -XX:MaxPermSize=256M", see SLING-443
[echo] on 64bit platforms: MAVEN_OPTS="-Xmx512M -XX:MaxPermSize=512M", see SLING-1782
[echo] ******************************************************************************
[INFO] Executed tasks
[INFO]
[INFO] --- maven-compiler-plugin:2.5.1:compile (default-compile) @ org.apache.sling.commons.cache.container-test ---
[INFO] Compiling 1 source file to <https://builds.apache.org/job/sling-org-apache-sling-commons-cache-container-test-1.8/ws/target/classes>
[INFO]
[INFO] --- maven-resources-plugin:2.6:testResources (default-testResources) @ org.apache.sling.commons.cache.container-test ---
[INFO] Using 'UTF-8' encoding to copy filtered resources.
[INFO] skip non existing resourceDirectory <https://builds.apache.org/job/sling-org-apache-sling-commons-cache-container-test-1.8/ws/src/test/resources>
[INFO] Copying 3 resources
[INFO]
[INFO] --- maven-compiler-plugin:2.5.1:testCompile (default-testCompile) @ org.apache.sling.commons.cache.container-test ---
[INFO] No sources to compile
[INFO]
[INFO] --- maven-surefire-plugin:2.12.4:test (default-test) @ org.apache.sling.commons.cache.container-test ---
[JENKINS] Recording test results
[INFO]
[INFO] --- animal-sniffer-maven-plugin:1.9:check (default) @ org.apache.sling.commons.cache.container-test ---
[INFO] Checking unresolved references to org.codehaus.mojo.signature:java15:1.0
[WARNING] Attempt to (de-)serialize anonymous class hudson.maven.reporters.BuildInfoRecorder$1; see: https://jenkins.io/redirect/serialization-of-anonymous-classes/
[INFO]
[INFO] --- maven-jar-plugin:2.4:jar (default-jar) @ org.apache.sling.commons.cache.container-test ---
[INFO] Building jar: <https://builds.apache.org/job/sling-org-apache-sling-commons-cache-container-test-1.8/ws/target/org.apache.sling.commons.cache.container-test-0.1-SNAPSHOT.jar>
[INFO]
[INFO] >>> maven-source-plugin:2.2.1:jar (attach-sources) > generate-sources @ org.apache.sling.commons.cache.container-test >>>
[INFO]
[INFO] --- maven-enforcer-plugin:1.0.1:enforce (enforce-java) @ org.apache.sling.commons.cache.container-test ---
[INFO]
[INFO] --- maven-antrun-plugin:1.7:run (set-bundle-required-execution-environment) @ org.apache.sling.commons.cache.container-test ---
[INFO] Executing tasks
main:
[INFO] Executed tasks
[WARNING] Failed to getClass for org.apache.maven.plugin.source.SourceJarMojo
[INFO]
[INFO] <<< maven-source-plugin:2.2.1:jar (attach-sources) < generate-sources @ org.apache.sling.commons.cache.container-test <<<
[INFO]
[INFO] --- maven-source-plugin:2.2.1:jar (attach-sources) @ org.apache.sling.commons.cache.container-test ---
[INFO] Building jar: <https://builds.apache.org/job/sling-org-apache-sling-commons-cache-container-test-1.8/ws/target/org.apache.sling.commons.cache.container-test-0.1-SNAPSHOT-sources.jar>
[INFO]
[INFO] --- maven-site-plugin:3.2:attach-descriptor (attach-descriptor) @ org.apache.sling.commons.cache.container-test ---
[INFO]
[INFO] --- ianal-maven-plugin:1.0-alpha-1:verify-legal-files (default) @ org.apache.sling.commons.cache.container-test ---
[INFO] Checking legal files in: org.apache.sling.commons.cache.container-test-0.1-SNAPSHOT.jar
[INFO] Checking legal files in: org.apache.sling.commons.cache.container-test-0.1-SNAPSHOT-sources.jar
[INFO]
[INFO] --- maven-install-plugin:2.3.1:install (default-install) @ org.apache.sling.commons.cache.container-test ---
[INFO] Installing <https://builds.apache.org/job/sling-org-apache-sling-commons-cache-container-test-1.8/ws/target/org.apache.sling.commons.cache.container-test-0.1-SNAPSHOT.jar> to /home/jenkins/jenkins-slave/maven-repositories/1/org/apache/sling/org.apache.sling.commons.cache.container-test/0.1-SNAPSHOT/org.apache.sling.commons.cache.container-test-0.1-SNAPSHOT.jar
[INFO] Installing <https://builds.apache.org/job/sling-org-apache-sling-commons-cache-container-test-1.8/ws/pom.xml> to /home/jenkins/jenkins-slave/maven-repositories/1/org/apache/sling/org.apache.sling.commons.cache.container-test/0.1-SNAPSHOT/org.apache.sling.commons.cache.container-test-0.1-SNAPSHOT.pom
[INFO] Installing <https://builds.apache.org/job/sling-org-apache-sling-commons-cache-container-test-1.8/ws/target/org.apache.sling.commons.cache.container-test-0.1-SNAPSHOT-sources.jar> to /home/jenkins/jenkins-slave/maven-repositories/1/org/apache/sling/org.apache.sling.commons.cache.container-test/0.1-SNAPSHOT/org.apache.sling.commons.cache.container-test-0.1-SNAPSHOT-sources.jar
[INFO]
[INFO] --- maven-deploy-plugin:2.7:deploy (default-deploy) @ org.apache.sling.commons.cache.container-test ---
[INFO] Downloading: https://repository.apache.org/content/repositories/snapshots/org/apache/sling/org.apache.sling.commons.cache.container-test/0.1-SNAPSHOT/maven-metadata.xml
[INFO] Downloaded: https://repository.apache.org/content/repositories/snapshots/org/apache/sling/org.apache.sling.commons.cache.container-test/0.1-SNAPSHOT/maven-metadata.xml (1021 B at 1.1 KB/sec)
[INFO] Uploading: https://repository.apache.org/content/repositories/snapshots/org/apache/sling/org.apache.sling.commons.cache.container-test/0.1-SNAPSHOT/org.apache.sling.commons.cache.container-test-0.1-20181009.044754-53.jar
[INFO] Uploading: https://repository.apache.org/content/repositories/snapshots/org/apache/sling/org.apache.sling.commons.cache.container-test/0.1-SNAPSHOT/org.apache.sling.commons.cache.container-test-0.1-20181009.044754-53.pom
[WARNING] Attempt to (de-)serialize anonymous class hudson.maven.reporters.MavenArtifactArchiver$2; see: https://jenkins.io/redirect/serialization-of-anonymous-classes/
[JENKINS] Archiving disabled
[WARNING] Attempt to (de-)serialize anonymous class hudson.maven.reporters.MavenFingerprinter$1; see: https://jenkins.io/redirect/serialization-of-anonymous-classes/
[JENKINS] Archiving disabled
[INFO] ------------------------------------------------------------------------
[INFO] BUILD FAILURE
[INFO] ------------------------------------------------------------------------
[INFO] Total time: 28.300 s
[INFO] Finished at: 2018-10-09T04:48:00+00:00
[INFO] Final Memory: 98M/3925M
[INFO] ------------------------------------------------------------------------
Waiting for Jenkins to finish collecting data
[ERROR] Failed to execute goal org.apache.maven.plugins:maven-deploy-plugin:2.7:deploy (default-deploy) on project org.apache.sling.commons.cache.container-test: Failed to deploy artifacts: Could not transfer artifact org.apache.sling:org.apache.sling.commons.cache.container-test:jar:0.1-20181009.044754-53 from/to apache.snapshots.https (https://repository.apache.org/content/repositories/snapshots): Failed to transfer file: https://repository.apache.org/content/repositories/snapshots/org/apache/sling/org.apache.sling.commons.cache.container-test/0.1-SNAPSHOT/org.apache.sling.commons.cache.container-test-0.1-20181009.044754-53.jar. Return code is: 401, ReasonPhrase: Unauthorized. -> [Help 1]
[ERROR]
[ERROR] To see the full stack trace of the errors, re-run Maven with the -e switch.
[ERROR] Re-run Maven using the -X switch to enable full debug logging.
[ERROR]
[ERROR] For more information about the errors and possible solutions, please read the following articles:
[ERROR] [Help 1] http://cwiki.apache.org/confluence/display/MAVEN/MojoExecutionException
channel stopped
Recording test results
Jenkins build is back to normal :
sling-org-apache-sling-commons-cache-container-test-1.8 #57
Posted by Apache Jenkins Server <je...@builds.apache.org>.
See <https://builds.apache.org/job/sling-org-apache-sling-commons-cache-container-test-1.8/57/display/redirect>