You are viewing a plain text version of this content. The canonical link for it is here.
Posted to builds@beam.apache.org by Apache Jenkins Server <je...@builds.apache.org> on 2023/09/26 17:45:39 UTC

Build failed in Jenkins: beam_PostCommit_XVR_Direct #4646

See <https://ci-beam.apache.org/job/beam_PostCommit_XVR_Direct/4646/display/redirect?page=changes>

Changes:

[noreply] Filter out some warnings that aren't useful in pytest (#28622)


------------------------------------------
[...truncated 1.32 MB...]
        payload: "\202SNAPPY\000\000\000\000\001\000\000\000\001\000\000\000\210\330\001\350\254\355\000\005sr\000&org.apache.beam.sdk.coders.VarIntCoder\300K2\332\251KVh\002\000\000xrr5\000\024Atomic\0055 \307\354\265\314\205tPF\002\0055\000*jj\000$Structured\0059\034s\277\022\016\325\3246\021\t9\000 j9\000\005/0C\335\325\211\256\274~\370\002\000\000xp"
      >
    >
  >
  coders: <
    key: "ATtSdRZmLBVoidCoder"
    value: <
      spec: <
        urn: "beam:coders:javasdk:0.1"
        payload: "\202SNAPPY\000\000\000\000\001\000\000\000\001\000\000\000\210\326\001\350\254\355\000\005sr\000$org.apache.beam.sdk.coders.VoidCoder\271\277U\233\350\r\257U\002\000\000xr\000&j3\000\024Atomic\0055 \307\354\265\314\205tPF\002\0055\000*j5\000$Structured\0059\034s\277\022\016\325\3246\021\t9\000 j9\000\005/0C\335\325\211\256\274~\370\002\000\000xp"
      >
    >
  >
  coders: <
    key: "c0"
    value: <
      spec: <
        urn: "beam:coder:bytes:v1"
      >
    >
  >
  coders: <
    key: "c1"
    value: <
      spec: <
        urn: "beam:coder:global_window:v1"
      >
    >
  >
  coders: <
    key: "c2"
    value: <
      spec: <
        urn: "beam:coder:row:v1"
        payload: "\n\r\n\007role_id\032\002\020\003\022$abc5e222-ab8f-4f6f-800a-a58bb0f45675"
      >
    >
  >
  environments: <
    key: "ATtSdRZmLBbeam:env:docker:v1"
    value: <
      urn: "beam:env:docker:v1"
      payload: "\n apache/beam_java8_sdk:2.52.0.dev"
      capabilities: "beam:coder:bytes:v1"
      capabilities: "beam:coder:bool:v1"
      capabilities: "beam:coder:varint:v1"
      capabilities: "beam:coder:string_utf8:v1"
      capabilities: "beam:coder:iterable:v1"
      capabilities: "beam:coder:timer:v1"
      capabilities: "beam:coder:kv:v1"
      capabilities: "beam:coder:length_prefix:v1"
      capabilities: "beam:coder:global_window:v1"
      capabilities: "beam:coder:interval_window:v1"
      capabilities: "beam:coder:custom_window:v1"
      capabilities: "beam:coder:windowed_value:v1"
      capabilities: "beam:coder:double:v1"
      capabilities: "beam:coder:row:v1"
      capabilities: "beam:coder:param_windowed_value:v1"
      capabilities: "beam:coder:state_backed_iterable:v1"
      capabilities: "beam:coder:sharded_key:v1"
      capabilities: "beam:coder:nullable:v1"
      capabilities: "beam:protocol:multi_core_bundle_processing:v1"
      capabilities: "beam:protocol:progress_reporting:v1"
      capabilities: "beam:protocol:harness_monitoring_infos:v1"
      capabilities: "beam:protocol:control_request_elements_embedding:v1"
      capabilities: "beam:protocol:state_caching:v1"
      capabilities: "beam:version:sdk_base:apache/beam_java8_sdk:2.52.0.dev"
      capabilities: "beam:transform:sdf_truncate_sized_restrictions:v1"
      capabilities: "beam:transform:to_string:v1"
      capabilities: "beam:protocol:data_sampling:v1"
      dependencies: <
        type_urn: "beam:artifact:type:file:v1"
        type_payload: "\n\203\001/tmp/artifacts/beam-sdks-java-extensions-schemaio-expansion-service-2.52.0-SNAPSHOT-V9h8RCgF7xWCeGQwL0Rwu1_3aUKTc8SRTkft4DClHY0.jar\022@57d87c442805ef15827864302f4470bb5ff769429373c4914e47ede030a51d8d"
        role_urn: "beam:artifact:role:staging_to:v1"
        role_payload: "\ntbeam-sdks-java-extensions-schemaio-expansion-service-2.52.0-SNAPSHOT-V9h8RCgF7xWCeGQwL0Rwu1_3aUKTc8SRTkft4DClHY0.jar"
      >
    >
  >
  environments: <
    key: "go"
    value: <
      urn: "beam:env:docker:v1"
      payload: "\n\026apache/beam_go_sdk:dev"
      capabilities: "beam:protocol:progress_reporting:v1"
      capabilities: "beam:protocol:multi_core_bundle_processing:v1"
      capabilities: "beam:transform:sdf_truncate_sized_restrictions:v1"
      capabilities: "beam:protocol:worker_status:v1"
      capabilities: "beam:protocol:monitoring_info_short_ids:v1"
      capabilities: "beam:version:sdk_base:go:apache/beam_go_sdk:2.52.0.dev"
      capabilities: "beam:transform:to_string:v1"
      capabilities: "beam:coder:bytes:v1"
      capabilities: "beam:coder:bool:v1"
      capabilities: "beam:coder:varint:v1"
      capabilities: "beam:coder:double:v1"
      capabilities: "beam:coder:string_utf8:v1"
      capabilities: "beam:coder:length_prefix:v1"
      capabilities: "beam:coder:kv:v1"
      capabilities: "beam:coder:iterable:v1"
      capabilities: "beam:coder:state_backed_iterable:v1"
      capabilities: "beam:coder:windowed_value:v1"
      capabilities: "beam:coder:global_window:v1"
      capabilities: "beam:coder:interval_window:v1"
      capabilities: "beam:coder:row:v1"
      capabilities: "beam:coder:nullable:v1"
      capabilities: "beam:coder:timer:v1"
      dependencies: <
        type_urn: "beam:artifact:type:file:v1"
        role_urn: "beam:artifact:role:go_worker_binary:v1"
      >
    >
  >
>
root_transform_ids: "s1"
root_transform_ids: "e2"
root_transform_ids: "e3"
root_transform_ids: "s3"
2023/09/26 17:23:13 Cross-compiling <https://ci-beam.apache.org/job/beam_PostCommit_XVR_Direct/ws/src/sdks/go/test/integration/io/xlang/jdbc/jdbc_test.go> with GOOS=linux GOARCH=amd64 CGO_ENABLED=0 as /tmp/worker-4-1695748993680923606
2023/09/26 17:23:16 Prepared job with id: go-testjdbcio_postgresreadwrite-189-42b27bdf-c3ec-4575-8032-5ec888e5c5e3 and staging token: go-testjdbcio_postgresreadwrite-189-42b27bdf-c3ec-4575-8032-5ec888e5c5e3
2023/09/26 17:23:16 Staged binary artifact with token: go-testjdbcio_postgresreadwrite-189-42b27bdf-c3ec-4575-8032-5ec888e5c5e3
2023/09/26 17:23:16 Submitted job: go-testjdbcio_postgresreadwrite-189-42b27bdf-c3ec-4575-8032-5ec888e5c5e3
2023/09/26 17:23:16 2023-09-26 17:23:16. (1): ==================== <function annotate_downstream_side_inputs at 0x7f8ad74f93a0> ====================
2023/09/26 17:23:16 2023-09-26 17:23:16. (2): ==================== <function fix_side_input_pcoll_coders at 0x7f8ad74f94c0> ====================
2023/09/26 17:23:16 Job[go-testjdbcio_postgresreadwrite-189-42b27bdf-c3ec-4575-8032-5ec888e5c5e3] state: STOPPED
2023/09/26 17:23:16 Job[go-testjdbcio_postgresreadwrite-189-42b27bdf-c3ec-4575-8032-5ec888e5c5e3] state: STARTING
2023/09/26 17:23:16 Job[go-testjdbcio_postgresreadwrite-189-42b27bdf-c3ec-4575-8032-5ec888e5c5e3] state: RUNNING
2023/09/26 17:23:16 2023-09-26 17:23:16. (3): ==================== <function pack_combiners at 0x7f8ad74f99d0> ====================
2023/09/26 17:23:16 2023-09-26 17:23:16. (4): ==================== <function lift_combiners at 0x7f8ad74f9a60> ====================
2023/09/26 17:23:16 2023-09-26 17:23:16. (5): ==================== <function expand_sdf at 0x7f8ad74f9c10> ====================
2023/09/26 17:23:16 2023-09-26 17:23:16. (6): ==================== <function expand_gbk at 0x7f8ad74f9ca0> ====================
2023/09/26 17:23:16 2023-09-26 17:23:16. (7): ==================== <function sink_flattens at 0x7f8ad74f9dc0> ====================
2023/09/26 17:23:16 2023-09-26 17:23:16. (8): ==================== <function greedily_fuse at 0x7f8ad74f9e50> ====================
2023/09/26 17:23:16 2023-09-26 17:23:16. (9): ==================== <function read_to_impulse at 0x7f8ad74f9ee0> ====================
2023/09/26 17:23:16 2023-09-26 17:23:16. (10): ==================== <function impulse_to_input at 0x7f8ad74f9f70> ====================
2023/09/26 17:23:16 2023-09-26 17:23:16. (11): ==================== <function sort_stages at 0x7f8ad74fd1f0> ====================
2023/09/26 17:23:16 2023-09-26 17:23:16. (12): ==================== <function add_impulse_to_dangling_transforms at 0x7f8ad74fd310> ====================
2023/09/26 17:23:16 2023-09-26 17:23:16. (13): ==================== <function setup_timer_mapping at 0x7f8ad74fd160> ====================
2023/09/26 17:23:16 2023-09-26 17:23:16. (14): ==================== <function populate_data_channel_coders at 0x7f8ad74fd280> ====================
2023/09/26 17:23:16 2023-09-26 17:23:16. (15): starting control server on port 41669
2023/09/26 17:23:16 2023-09-26 17:23:16. (16): starting data server on port 40937
2023/09/26 17:23:16 2023-09-26 17:23:16. (17): starting state server on port 33681
2023/09/26 17:23:16 2023-09-26 17:23:16. (18): starting logging server on port 36321
2023/09/26 17:23:16 2023-09-26 17:23:16. (19): Created Worker handler <apache_beam.runners.portability.fn_api_runner.worker_handlers.DockerSdkWorkerHandler object at 0x7f8b0c5d2c40> for environment ATtSdRZmLBbeam:env:docker:v1 (beam:env:docker:v1, b'\n apache/beam_java8_sdk:2.52.0.dev')
2023/09/26 17:23:21 2023-09-26 17:23:21. (20): Attempting to pull image apache/beam_java8_sdk:2.52.0.dev
2023/09/26 17:23:22 2023-09-26 17:23:22. (21): Unable to pull image apache/beam_java8_sdk:2.52.0.dev, defaulting to local image if it exists
2023/09/26 17:23:23 2023-09-26 17:23:23. (22): Waiting for docker to start up. Current status is running
2023/09/26 17:23:23 2023-09-26 17:23:23. (23): Docker container is running. container_id = b'64da79fcda8be58397a89414681a0c02172e6ed7ecb0ad4de24a0b131cc696d7', worker_id = worker_17
2023/09/26 17:23:24 2023-09-26 17:23:24. (24): Created Worker handler <apache_beam.runners.portability.fn_api_runner.worker_handlers.DockerSdkWorkerHandler object at 0x7f8b0c5db9d0> for environment go (beam:env:docker:v1, b'\n\x16apache/beam_go_sdk:dev')
2023/09/26 17:23:26 2023-09-26 17:23:26. (25): Attempting to pull image apache/beam_go_sdk:dev
2023/09/26 17:23:26 2023-09-26 17:23:26. (26): Unable to pull image apache/beam_go_sdk:dev, defaulting to local image if it exists
2023/09/26 17:23:28 2023-09-26 17:23:28. (27): Waiting for docker to start up. Current status is running
2023/09/26 17:23:28 2023-09-26 17:23:28. (28): Docker container is running. container_id = b'e8b28cd31ba2af79757d13492ae5c4490362ccf20528f318aba415d0f2ff7e3c', worker_id = worker_19
2023/09/26 17:23:31 2023-09-26 17:23:31. (29): Completed job in 15.160681009292603 seconds with state DONE.
2023/09/26 17:23:31 Job[go-testjdbcio_postgresreadwrite-189-42b27bdf-c3ec-4575-8032-5ec888e5c5e3] state: DONE
2023/09/26 17:23:31 🐳 Terminating container: 99c3766605be
2023/09/26 17:23:32 🚫 Container terminated: 99c3766605be
--- PASS: TestJDBCIO_PostgresReadWrite (44.65s)
FAIL
FAIL	github.com/apache/beam/sdks/v2/go/test/integration/io/xlang/jdbc	131.053s
=== RUN   TestKafkaIO_BasicReadWrite
    integration.go:364: Test TestKafkaIO_BasicReadWrite is currently filtered for runner portable
--- SKIP: TestKafkaIO_BasicReadWrite (0.00s)
PASS
ok  	github.com/apache/beam/sdks/v2/go/test/integration/io/xlang/kafka	6.133s
FAIL

> Task :sdks:python:test-suites:direct:xlang:validatesCrossLanguageRunnerGoUsingJava FAILED
> Task :sdks:python:test-suites:direct:xlang:validatesCrossLanguageRunnerJavaUsingPython
INFO:root:No image given, using default Python SDK image
INFO:root:Python SDK container image set to "apache/beam_python3.8_sdk:2.50.0" for Docker environment
INFO:__main__:Listening for expansion requests at 37443
INFO:root:Missing pipeline option (runner). Executing pipeline using the default runner: DirectRunner.
INFO:__main__:Shutting down expansion service.
INFO:apache_beam.runners.portability.stager:Executing command: ['/home/jenkins/.apache_beam/cache/venvs/py-3.8-beam-2.50.0-743bdccef67087512a7a190820e727aab7bdcb14/bin/python', '-m', 'pip', 'download', '--dest', '/tmp/dataflow-requirements-cache', '-r', '/tmp/tmpv6boqf05/tmp_requirements.txt', '--exists-action', 'i', '--no-deps', '--implementation', 'cp', '--abi', 'cp38', '--platform', 'manylinux2014_x86_64']
INFO:root:No image given, using default Python SDK image
INFO:root:Python SDK container image set to "apache/beam_python3.8_sdk:2.50.0" for Docker environment
INFO:__main__:Listening for expansion requests at 46879
INFO:root:Missing pipeline option (runner). Executing pipeline using the default runner: DirectRunner.
INFO:__main__:Shutting down expansion service.

> Task :sdks:python:test-suites:direct:xlang:validatesCrossLanguageRunnerPythonUsingJava
Exception in thread wait_until_finish_read:
Traceback (most recent call last):
  File "/usr/lib/python3.8/threading.py", line 932, in _bootstrap_inner
    self.run()
  File "/usr/lib/python3.8/threading.py", line 870, in run
    self._target(*self._args, **self._kwargs)
  File "<https://ci-beam.apache.org/job/beam_PostCommit_XVR_Direct/ws/src/sdks/python/apache_beam/runners/portability/portable_runner.py",> line 540, in read_messages
    for message in self._message_stream:
  File "<https://ci-beam.apache.org/job/beam_PostCommit_XVR_Direct/ws/src/build/gradleenv/1922375555/lib/python3.8/site-packages/grpc/_channel.py",> line 541, in __next__
    return self._next()
  File "<https://ci-beam.apache.org/job/beam_PostCommit_XVR_Direct/ws/src/build/gradleenv/1922375555/lib/python3.8/site-packages/grpc/_channel.py",> line 967, in _next
    raise self
grpc._channel._MultiThreadedRendezvous: <_MultiThreadedRendezvous of RPC that terminated with:
	status = StatusCode.DEADLINE_EXCEEDED
	details = "Deadline Exceeded"
	debug_error_string = "UNKNOWN:Error received from peer ipv4:127.0.0.1:46191 {grpc_message:"Deadline Exceeded", grpc_status:4, created_time:"2023-09-26T17:37:10.373197197+00:00"}"
>

> Task :sdks:python:test-suites:direct:xlang:validatesCrossLanguageRunnerPythonUsingJava FAILED
> Task :sdks:python:test-suites:direct:xlang:validatesCrossLanguageRunnerPythonUsingSql
> Task :sdks:python:test-suites:direct:xlang:fnApiJobServerCleanup
> Task :sdks:python:test-suites:direct:xlang:validatesCrossLanguageRunnerCleanup

FAILURE: Build completed with 2 failures.

1: Task failed with an exception.
-----------
* Where:
Build file '<https://ci-beam.apache.org/job/beam_PostCommit_XVR_Direct/ws/src/sdks/go/test/build.gradle'> line: 235

* What went wrong:
Execution failed for task ':sdks:python:test-suites:direct:xlang:validatesCrossLanguageRunnerGoUsingJava'.
> Process 'command 'sh'' finished with non-zero exit value 1

* Try:
> Run with --stacktrace option to get the stack trace.
> Run with --info or --debug option to get more log output.
==============================================================================

2: Task failed with an exception.
-----------
* What went wrong:
Execution failed for task ':sdks:python:test-suites:direct:xlang:validatesCrossLanguageRunnerPythonUsingJava'.
> Process 'command 'sh'' finished with non-zero exit value 1

* Try:
> Run with --stacktrace option to get the stack trace.
> Run with --info or --debug option to get more log output.
==============================================================================

* Get more help at https://help.gradle.org

Deprecated Gradle features were used in this build, making it incompatible with Gradle 8.0.

You can use '--warning-mode all' to show the individual deprecation warnings and determine if they come from your own scripts or plugins.

See https://docs.gradle.org/7.6.2/userguide/command_line_interface.html#sec:command_line_warnings

Execution optimizations have been disabled for 1 invalid unit(s) of work during this build to ensure correctness.
Please consult deprecation warnings for more details.

BUILD FAILED in 35m 11s
258 actionable tasks: 171 executed, 75 from cache, 12 up-to-date

Publishing build scan...
https://ge.apache.org/s/qgscpxs5zqg3a

Build step 'Invoke Gradle script' changed build result to FAILURE
Build step 'Invoke Gradle script' marked build as failure

---------------------------------------------------------------------
To unsubscribe, e-mail: builds-unsubscribe@beam.apache.org
For additional commands, e-mail: builds-help@beam.apache.org


Jenkins build is back to normal : beam_PostCommit_XVR_Direct #4649

Posted by Apache Jenkins Server <je...@builds.apache.org>.
See <https://ci-beam.apache.org/job/beam_PostCommit_XVR_Direct/4649/display/redirect>


---------------------------------------------------------------------
To unsubscribe, e-mail: builds-unsubscribe@beam.apache.org
For additional commands, e-mail: builds-help@beam.apache.org


Build failed in Jenkins: beam_PostCommit_XVR_Direct #4648

Posted by Apache Jenkins Server <je...@builds.apache.org>.
See <https://ci-beam.apache.org/job/beam_PostCommit_XVR_Direct/4648/display/redirect>

Changes:


------------------------------------------
[...truncated 1.56 MB...]
INFO     apache_beam.utils.subprocess_server:subprocess_server.py:126 Registered transforms:
INFO     apache_beam.utils.subprocess_server:subprocess_server.py:126 	beam:external:java:sql:v1: org.apache.beam.sdk.expansion.service.ExpansionService$ExternalTransformRegistrarLoader$1@3c46e67a
INFO     apache_beam.utils.subprocess_server:subprocess_server.py:126 	beam:transform:org.apache.beam:pubsub_read:v1: org.apache.beam.sdk.expansion.service.ExpansionService$ExternalTransformRegistrarLoader$1@c730b35
INFO     apache_beam.utils.subprocess_server:subprocess_server.py:126 	beam:transform:org.apache.beam:pubsub_write:v1: org.apache.beam.sdk.expansion.service.ExpansionService$ExternalTransformRegistrarLoader$1@206a70ef
INFO     apache_beam.utils.subprocess_server:subprocess_server.py:126 	beam:transform:org.apache.beam:pubsublite_write:v1: org.apache.beam.sdk.expansion.service.ExpansionService$ExternalTransformRegistrarLoader$1@292b08d6
INFO     apache_beam.utils.subprocess_server:subprocess_server.py:126 	beam:transform:org.apache.beam:pubsublite_read:v1: org.apache.beam.sdk.expansion.service.ExpansionService$ExternalTransformRegistrarLoader$1@22555ebf
INFO     apache_beam.utils.subprocess_server:subprocess_server.py:126 	beam:transform:org.apache.beam:spanner_insert:v1: org.apache.beam.sdk.expansion.service.ExpansionService$ExternalTransformRegistrarLoader$1@36ebc363
INFO     apache_beam.utils.subprocess_server:subprocess_server.py:126 	beam:transform:org.apache.beam:spanner_update:v1: org.apache.beam.sdk.expansion.service.ExpansionService$ExternalTransformRegistrarLoader$1@45752059
INFO     apache_beam.utils.subprocess_server:subprocess_server.py:126 	beam:transform:org.apache.beam:spanner_replace:v1: org.apache.beam.sdk.expansion.service.ExpansionService$ExternalTransformRegistrarLoader$1@34e9fd99
INFO     apache_beam.utils.subprocess_server:subprocess_server.py:126 	beam:transform:org.apache.beam:spanner_insert_or_update:v1: org.apache.beam.sdk.expansion.service.ExpansionService$ExternalTransformRegistrarLoader$1@3c41ed1d
INFO     apache_beam.utils.subprocess_server:subprocess_server.py:126 	beam:transform:org.apache.beam:spanner_delete:v1: org.apache.beam.sdk.expansion.service.ExpansionService$ExternalTransformRegistrarLoader$1@54d9d12d
INFO     apache_beam.utils.subprocess_server:subprocess_server.py:126 	beam:transform:org.apache.beam:spanner_read:v1: org.apache.beam.sdk.expansion.service.ExpansionService$ExternalTransformRegistrarLoader$1@38425407
INFO     apache_beam.utils.subprocess_server:subprocess_server.py:126 	beam:transform:org.apache.beam:kafka_read_with_metadata:v1: org.apache.beam.sdk.expansion.service.ExpansionService$ExternalTransformRegistrarLoader$1@43bc63a3
INFO     apache_beam.utils.subprocess_server:subprocess_server.py:126 	beam:transform:org.apache.beam:kafka_read_without_metadata:v1: org.apache.beam.sdk.expansion.service.ExpansionService$ExternalTransformRegistrarLoader$1@702657cc
INFO     apache_beam.utils.subprocess_server:subprocess_server.py:126 	beam:transform:org.apache.beam:kafka_write:v1: org.apache.beam.sdk.expansion.service.ExpansionService$ExternalTransformRegistrarLoader$1@6a6cb05c
INFO     apache_beam.utils.subprocess_server:subprocess_server.py:126 	beam:external:java:generate_sequence:v1: org.apache.beam.sdk.expansion.service.ExpansionService$ExternalTransformRegistrarLoader$1@40a4337a
INFO     apache_beam.utils.subprocess_server:subprocess_server.py:126 
INFO     apache_beam.utils.subprocess_server:subprocess_server.py:126 Registered SchemaTransformProviders:
INFO     apache_beam.utils.subprocess_server:subprocess_server.py:126 	beam:schematransform:org.apache.beam:spanner_cdc_read:v1
INFO     apache_beam.utils.subprocess_server:subprocess_server.py:126 	beam:schematransform:org.apache.beam:bigtable_write:v1
INFO     apache_beam.utils.subprocess_server:subprocess_server.py:126 	beam:schematransform:org.apache.beam:spanner_write:v1
INFO     apache_beam.utils.subprocess_server:subprocess_server.py:126 	beam:schematransform:org.apache.beam:pubsublite_read:v1
INFO     apache_beam.utils.subprocess_server:subprocess_server.py:126 	beam:schematransform:org.apache.beam:bigquery_storage_read:v1
INFO     apache_beam.utils.subprocess_server:subprocess_server.py:126 	beam:schematransform:org.apache.beam:bigquery_fileloads_write:v1
INFO     apache_beam.utils.subprocess_server:subprocess_server.py:126 	beam:schematransform:org.apache.beam:bigquery_export_read:v1
INFO     apache_beam.utils.subprocess_server:subprocess_server.py:126 	beam:schematransform:org.apache.beam:kafka_read:v1
INFO     apache_beam.utils.subprocess_server:subprocess_server.py:126 	beam:schematransform:org.apache.beam:kafka_write:v1
INFO     apache_beam.utils.subprocess_server:subprocess_server.py:126 	beam:schematransform:org.apache.beam:bigquery_storage_write:v2
INFO     apache_beam.utils.subprocess_server:subprocess_server.py:126 	schematransform:org.apache.beam:sql_transform:v1
INFO     apache_beam.utils.subprocess_server:subprocess_server.py:126 	beam:schematransform:org.apache.beam:pubsub_read:v1
INFO     apache_beam.utils.subprocess_server:subprocess_server.py:126 	beam:schematransform:org.apache.beam:pubsub_write:v1
INFO     apache_beam.utils.subprocess_server:subprocess_server.py:126 	beam:schematransform:org.apache.beam:bigtable_read:v1
INFO     apache_beam.utils.subprocess_server:subprocess_server.py:126 	beam:schematransform:org.apache.beam:pubsublite_write:v1
INFO     apache_beam.utils.subprocess_server:subprocess_server.py:126 Sep 27, 2023 5:36:50 AM org.apache.beam.sdk.expansion.service.ExpansionService expand
INFO     apache_beam.utils.subprocess_server:subprocess_server.py:126 INFO: Expanding 'SqlTransform(beam:external:java:sql:v1)' with URN 'beam:external:java:sql:v1'
INFO     apache_beam.utils.subprocess_server:subprocess_server.py:126 Dependencies list: {}
INFO     apache_beam.utils.subprocess_server:subprocess_server.py:126 Sep 27, 2023 5:36:50 AM org.apache.beam.sdk.expansion.service.ExpansionService$ExternalTransformRegistrarLoader payloadToConfig
INFO     apache_beam.utils.subprocess_server:subprocess_server.py:126 WARNING: Configuration class 'org.apache.beam.sdk.extensions.sql.expansion.ExternalSqlTransformRegistrar$Configuration' has no schema registered. Attempting to construct with setter approach.
INFO     apache_beam.utils.subprocess_server:subprocess_server.py:126 Sep 27, 2023 5:36:51 AM org.apache.beam.sdk.expansion.service.ExpansionService$ExternalTransformRegistrarLoader payloadToConfig
INFO     apache_beam.utils.subprocess_server:subprocess_server.py:126 WARNING: Configuration class 'org.apache.beam.sdk.extensions.sql.expansion.ExternalSqlTransformRegistrar$Configuration' has no schema registered. Attempting to construct with setter approach.
INFO     apache_beam.utils.subprocess_server:subprocess_server.py:126 Sep 27, 2023 5:36:52 AM org.apache.beam.sdk.extensions.sql.impl.CalciteQueryPlanner convertToBeamRel
INFO     apache_beam.utils.subprocess_server:subprocess_server.py:126 INFO: SQL:
INFO     apache_beam.utils.subprocess_server:subprocess_server.py:126 SELECT COUNT(*) AS `count`
INFO     apache_beam.utils.subprocess_server:subprocess_server.py:126 FROM `beam`.`PCOLLECTION` AS `PCOLLECTION`
INFO     apache_beam.utils.subprocess_server:subprocess_server.py:126 Sep 27, 2023 5:36:53 AM org.apache.beam.sdk.extensions.sql.impl.CalciteQueryPlanner convertToBeamRel
INFO     apache_beam.utils.subprocess_server:subprocess_server.py:126 INFO: SQLPlan>
INFO     apache_beam.utils.subprocess_server:subprocess_server.py:126 LogicalAggregate(group=[{}], count=[COUNT()])
INFO     apache_beam.utils.subprocess_server:subprocess_server.py:126   BeamIOSourceRel(table=[[beam, PCOLLECTION]])
INFO     apache_beam.utils.subprocess_server:subprocess_server.py:126 
INFO     apache_beam.utils.subprocess_server:subprocess_server.py:126 Sep 27, 2023 5:36:53 AM org.apache.beam.sdk.extensions.sql.impl.CalciteQueryPlanner convertToBeamRel
INFO     apache_beam.utils.subprocess_server:subprocess_server.py:126 INFO: BEAMPlan>
INFO     apache_beam.utils.subprocess_server:subprocess_server.py:126 BeamAggregationRel(group=[{}], count=[COUNT()])
INFO     apache_beam.utils.subprocess_server:subprocess_server.py:126   BeamIOSourceRel(table=[[beam, PCOLLECTION]])
INFO     apache_beam.utils.subprocess_server:subprocess_server.py:126 
INFO     root:environments.py:317 No image given, using default Python SDK image
INFO     root:environments.py:320 Python SDK container image set to "apache/beam_python3.8_sdk:2.52.0.dev" for Docker environment
INFO     apache_beam.runners.portability.fn_api_runner.translations:translations.py:712 ==================== <function pack_combiners at 0x7f961ddef790> ====================
INFO     apache_beam.runners.portability.fn_api_runner.translations:translations.py:712 ==================== <function lift_combiners at 0x7f961ddef820> ====================
INFO     apache_beam.runners.portability.fn_api_runner.translations:translations.py:712 ==================== <function sort_stages at 0x7f961ddeff70> ====================
INFO     apache_beam.runners.portability.portable_runner:portable_runner.py:549 Job state changed to STOPPED
INFO     apache_beam.runners.portability.portable_runner:portable_runner.py:549 Job state changed to STARTING
INFO     apache_beam.runners.portability.portable_runner:portable_runner.py:549 Job state changed to RUNNING
INFO     root:portable_runner.py:542 ==================== <function annotate_downstream_side_inputs at 0x7fb39dd7c3a0> ====================
INFO     root:portable_runner.py:542 ==================== <function fix_side_input_pcoll_coders at 0x7fb39dd7c4c0> ====================
INFO     root:portable_runner.py:542 ==================== <function pack_combiners at 0x7fb39dd7c9d0> ====================
INFO     root:portable_runner.py:542 ==================== <function lift_combiners at 0x7fb39dd7ca60> ====================
INFO     root:portable_runner.py:542 ==================== <function expand_sdf at 0x7fb39dd7cc10> ====================
INFO     root:portable_runner.py:542 ==================== <function expand_gbk at 0x7fb39dd7cca0> ====================
INFO     root:portable_runner.py:542 ==================== <function sink_flattens at 0x7fb39dd7cdc0> ====================
INFO     root:portable_runner.py:542 ==================== <function greedily_fuse at 0x7fb39dd7ce50> ====================
INFO     root:portable_runner.py:542 ==================== <function read_to_impulse at 0x7fb39dd7cee0> ====================
INFO     root:portable_runner.py:542 ==================== <function impulse_to_input at 0x7fb39dd7cf70> ====================
INFO     root:portable_runner.py:542 ==================== <function sort_stages at 0x7fb39dd7d1f0> ====================
INFO     root:portable_runner.py:542 ==================== <function add_impulse_to_dangling_transforms at 0x7fb39dd7d310> ====================
INFO     root:portable_runner.py:542 ==================== <function setup_timer_mapping at 0x7fb39dd7d160> ====================
INFO     root:portable_runner.py:542 ==================== <function populate_data_channel_coders at 0x7fb39dd7d280> ====================
INFO     root:portable_runner.py:542 starting control server on port 45965
INFO     root:portable_runner.py:542 starting data server on port 43847
INFO     root:portable_runner.py:542 starting state server on port 46063
INFO     root:portable_runner.py:542 starting logging server on port 40993
INFO     root:portable_runner.py:542 Created Worker handler <apache_beam.runners.portability.fn_api_runner.worker_handlers.DockerSdkWorkerHandler object at 0x7fb3d2f37f10> for environment ref_Environment_default_environment_2 (beam:env:docker:v1, b'\n$apache/beam_python3.8_sdk:2.52.0.dev')
INFO     root:portable_runner.py:542 Attempting to pull image apache/beam_python3.8_sdk:2.52.0.dev
INFO     root:portable_runner.py:542 Unable to pull image apache/beam_python3.8_sdk:2.52.0.dev, defaulting to local image if it exists
INFO     root:portable_runner.py:542 Waiting for docker to start up. Current status is running
INFO     root:portable_runner.py:542 Docker container is running. container_id = b'4653a2b717cdfdf8cbeaab4e1e81e996cc0259ccd82ed352dd24ebed8613277a', worker_id = worker_85
INFO     root:portable_runner.py:542 Created Worker handler <apache_beam.runners.portability.fn_api_runner.worker_handlers.DockerSdkWorkerHandler object at 0x7fb3d3ae9520> for environment external_8beam:env:docker:v1 (beam:env:docker:v1, b'\n apache/beam_java8_sdk:2.52.0.dev')
INFO     root:portable_runner.py:542 Attempting to pull image apache/beam_java8_sdk:2.52.0.dev
INFO     root:portable_runner.py:542 Unable to pull image apache/beam_java8_sdk:2.52.0.dev, defaulting to local image if it exists
INFO     root:portable_runner.py:542 Waiting for docker to start up. Current status is running
INFO     root:portable_runner.py:542 Docker container is running. container_id = b'068950ac774114b35deef8e54d829442eba58fae3f4bb7598376ac810dd8df6d', worker_id = worker_86
INFO     root:portable_runner.py:542 Completed job in 14.783877849578857 seconds with state DONE.
INFO     apache_beam.runners.portability.portable_runner:portable_runner.py:549 Job state changed to DONE
PASSED                                                                   [ 88%]
apache_beam/transforms/sql_test.py::SqlTransformTest::test_zetasql_generate_data 
-------------------------------- live log call ---------------------------------
INFO     apache_beam.utils.subprocess_server:subprocess_server.py:239 Using pre-built snapshot at <https://ci-beam.apache.org/job/beam_PostCommit_XVR_Direct/ws/src/sdks/java/extensions/sql/expansion-service/build/libs/beam-sdks-java-extensions-sql-expansion-service-2.52.0-SNAPSHOT.jar>
INFO     root:external.py:978 Starting a JAR-based expansion service from JAR <https://ci-beam.apache.org/job/beam_PostCommit_XVR_Direct/ws/src/sdks/java/extensions/sql/expansion-service/build/libs/beam-sdks-java-extensions-sql-expansion-service-2.52.0-SNAPSHOT.jar> 
INFO     apache_beam.utils.subprocess_server:subprocess_server.py:116 Starting service with ['java' '-jar' '<https://ci-beam.apache.org/job/beam_PostCommit_XVR_Direct/ws/src/sdks/java/extensions/sql/expansion-service/build/libs/beam-sdks-java-extensions-sql-expansion-service-2.52.0-SNAPSHOT.jar'> '41625' '--filesToStage=<https://ci-beam.apache.org/job/beam_PostCommit_XVR_Direct/ws/src/sdks/java/extensions/sql/expansion-service/build/libs/beam-sdks-java-extensions-sql-expansion-service-2.52.0-SNAPSHOT.jar']>
INFO     apache_beam.utils.subprocess_server:subprocess_server.py:126 Starting expansion service at localhost:41625
INFO     apache_beam.utils.subprocess_server:subprocess_server.py:126 Sep 27, 2023 5:37:16 AM org.apache.beam.sdk.expansion.service.ExpansionService loadRegisteredTransforms
INFO     apache_beam.utils.subprocess_server:subprocess_server.py:126 INFO: Registering external transforms: [beam:external:java:sql:v1, beam:transform:org.apache.beam:pubsub_read:v1, beam:transform:org.apache.beam:pubsub_write:v1, beam:transform:org.apache.beam:pubsublite_write:v1, beam:transform:org.apache.beam:pubsublite_read:v1, beam:transform:org.apache.beam:spanner_insert:v1, beam:transform:org.apache.beam:spanner_update:v1, beam:transform:org.apache.beam:spanner_replace:v1, beam:transform:org.apache.beam:spanner_insert_or_update:v1, beam:transform:org.apache.beam:spanner_delete:v1, beam:transform:org.apache.beam:spanner_read:v1, beam:transform:org.apache.beam:kafka_read_with_metadata:v1, beam:transform:org.apache.beam:kafka_read_without_metadata:v1, beam:transform:org.apache.beam:kafka_write:v1, beam:external:java:generate_sequence:v1]
INFO     apache_beam.utils.subprocess_server:subprocess_server.py:126 
INFO     apache_beam.utils.subprocess_server:subprocess_server.py:126 Registered transforms:
INFO     apache_beam.utils.subprocess_server:subprocess_server.py:126 	beam:external:java:sql:v1: org.apache.beam.sdk.expansion.service.ExpansionService$ExternalTransformRegistrarLoader$1@3c46e67a
INFO     apache_beam.utils.subprocess_server:subprocess_server.py:126 	beam:transform:org.apache.beam:pubsub_read:v1: org.apache.beam.sdk.expansion.service.ExpansionService$ExternalTransformRegistrarLoader$1@c730b35
INFO     apache_beam.utils.subprocess_server:subprocess_server.py:126 	beam:transform:org.apache.beam:pubsub_write:v1: org.apache.beam.sdk.expansion.service.ExpansionService$ExternalTransformRegistrarLoader$1@206a70ef
INFO     apache_beam.utils.subprocess_server:subprocess_server.py:126 	beam:transform:org.apache.beam:pubsublite_write:v1: org.apache.beam.sdk.expansion.service.ExpansionService$ExternalTransformRegistrarLoader$1@292b08d6
INFO     apache_beam.utils.subprocess_server:subprocess_server.py:126 	beam:transform:org.apache.beam:pubsublite_read:v1: org.apache.beam.sdk.expansion.service.ExpansionService$ExternalTransformRegistrarLoader$1@22555ebf
INFO     apache_beam.utils.subprocess_server:subprocess_server.py:126 	beam:transform:org.apache.beam:spanner_insert:v1: org.apache.beam.sdk.expansion.service.ExpansionService$ExternalTransformRegistrarLoader$1@36ebc363
INFO     apache_beam.utils.subprocess_server:subprocess_server.py:126 	beam:transform:org.apache.beam:spanner_update:v1: org.apache.beam.sdk.expansion.service.ExpansionService$ExternalTransformRegistrarLoader$1@45752059
INFO     apache_beam.utils.subprocess_server:subprocess_server.py:126 	beam:transform:org.apache.beam:spanner_replace:v1: org.apache.beam.sdk.expansion.service.ExpansionService$ExternalTransformRegistrarLoader$1@34e9fd99
INFO     apache_beam.utils.subprocess_server:subprocess_server.py:126 	beam:transform:org.apache.beam:spanner_insert_or_update:v1: org.apache.beam.sdk.expansion.service.ExpansionService$ExternalTransformRegistrarLoader$1@3c41ed1d
INFO     apache_beam.utils.subprocess_server:subprocess_server.py:126 	beam:transform:org.apache.beam:spanner_delete:v1: org.apache.beam.sdk.expansion.service.ExpansionService$ExternalTransformRegistrarLoader$1@54d9d12d
INFO     apache_beam.utils.subprocess_server:subprocess_server.py:126 	beam:transform:org.apache.beam:spanner_read:v1: org.apache.beam.sdk.expansion.service.ExpansionService$ExternalTransformRegistrarLoader$1@38425407
INFO     apache_beam.utils.subprocess_server:subprocess_server.py:126 	beam:transform:org.apache.beam:kafka_read_with_metadata:v1: org.apache.beam.sdk.expansion.service.ExpansionService$ExternalTransformRegistrarLoader$1@43bc63a3
INFO     apache_beam.utils.subprocess_server:subprocess_server.py:126 	beam:transform:org.apache.beam:kafka_read_without_metadata:v1: org.apache.beam.sdk.expansion.service.ExpansionService$ExternalTransformRegistrarLoader$1@702657cc
INFO     apache_beam.utils.subprocess_server:subprocess_server.py:126 	beam:transform:org.apache.beam:kafka_write:v1: org.apache.beam.sdk.expansion.service.ExpansionService$ExternalTransformRegistrarLoader$1@6a6cb05c
INFO     apache_beam.utils.subprocess_server:subprocess_server.py:126 	beam:external:java:generate_sequence:v1: org.apache.beam.sdk.expansion.service.ExpansionService$ExternalTransformRegistrarLoader$1@40a4337a
INFO     apache_beam.utils.subprocess_server:subprocess_server.py:126 
INFO     apache_beam.utils.subprocess_server:subprocess_server.py:126 Registered SchemaTransformProviders:
INFO     apache_beam.utils.subprocess_server:subprocess_server.py:126 	beam:schematransform:org.apache.beam:spanner_cdc_read:v1
INFO     apache_beam.utils.subprocess_server:subprocess_server.py:126 	beam:schematransform:org.apache.beam:bigtable_write:v1
INFO     apache_beam.utils.subprocess_server:subprocess_server.py:126 	beam:schematransform:org.apache.beam:spanner_write:v1
INFO     apache_beam.utils.subprocess_server:subprocess_server.py:126 	beam:schematransform:org.apache.beam:pubsublite_read:v1
INFO     apache_beam.utils.subprocess_server:subprocess_server.py:126 	beam:schematransform:org.apache.beam:bigquery_storage_read:v1
INFO     apache_beam.utils.subprocess_server:subprocess_server.py:126 	beam:schematransform:org.apache.beam:bigquery_fileloads_write:v1
INFO     apache_beam.utils.subprocess_server:subprocess_server.py:126 	beam:schematransform:org.apache.beam:bigquery_export_read:v1
INFO     apache_beam.utils.subprocess_server:subprocess_server.py:126 	beam:schematransform:org.apache.beam:kafka_read:v1
INFO     apache_beam.utils.subprocess_server:subprocess_server.py:126 	beam:schematransform:org.apache.beam:kafka_write:v1
INFO     apache_beam.utils.subprocess_server:subprocess_server.py:126 	beam:schematransform:org.apache.beam:bigquery_storage_write:v2
INFO     apache_beam.utils.subprocess_server:subprocess_server.py:126 	schematransform:org.apache.beam:sql_transform:v1
INFO     apache_beam.utils.subprocess_server:subprocess_server.py:126 	beam:schematransform:org.apache.beam:pubsub_read:v1
INFO     apache_beam.utils.subprocess_server:subprocess_server.py:126 	beam:schematransform:org.apache.beam:pubsub_write:v1
INFO     apache_beam.utils.subprocess_server:subprocess_server.py:126 	beam:schematransform:org.apache.beam:bigtable_read:v1
INFO     apache_beam.utils.subprocess_server:subprocess_server.py:126 	beam:schematransform:org.apache.beam:pubsublite_write:v1
INFO     apache_beam.utils.subprocess_server:subprocess_server.py:126 Sep 27, 2023 5:37:18 AM org.apache.beam.sdk.expansion.service.ExpansionService expand
INFO     apache_beam.utils.subprocess_server:subprocess_server.py:126 INFO: Expanding 'SqlTransform(beam:external:java:sql:v1)' with URN 'beam:external:java:sql:v1'
INFO     apache_beam.utils.subprocess_server:subprocess_server.py:126 Dependencies list: {}
INFO     apache_beam.utils.subprocess_server:subprocess_server.py:126 Sep 27, 2023 5:37:18 AM org.apache.beam.sdk.expansion.service.ExpansionService$ExternalTransformRegistrarLoader payloadToConfig
INFO     apache_beam.utils.subprocess_server:subprocess_server.py:126 WARNING: Configuration class 'org.apache.beam.sdk.extensions.sql.expansion.ExternalSqlTransformRegistrar$Configuration' has no schema registered. Attempting to construct with setter approach.
INFO     apache_beam.utils.subprocess_server:subprocess_server.py:126 Sep 27, 2023 5:37:18 AM org.apache.beam.sdk.expansion.service.ExpansionService$ExternalTransformRegistrarLoader payloadToConfig
INFO     apache_beam.utils.subprocess_server:subprocess_server.py:126 WARNING: Configuration class 'org.apache.beam.sdk.extensions.sql.expansion.ExternalSqlTransformRegistrar$Configuration' has no schema registered. Attempting to construct with setter approach.
INFO     apache_beam.utils.subprocess_server:subprocess_server.py:126 Sep 27, 2023 5:37:20 AM com.google.zetasql.io.grpc.NameResolverRegistry getDefaultRegistry
INFO     apache_beam.utils.subprocess_server:subprocess_server.py:126 WARNING: No NameResolverProviders found via ServiceLoader, including for DNS. This is probably due to a broken build. If using ProGuard, check your configuration
INFO     apache_beam.utils.subprocess_server:subprocess_server.py:126 Sep 27, 2023 5:37:22 AM org.apache.beam.sdk.extensions.sql.zetasql.ZetaSQLQueryPlanner convertToBeamRelInternal
INFO     apache_beam.utils.subprocess_server:subprocess_server.py:126 INFO: BEAMPlan>
INFO     apache_beam.utils.subprocess_server:subprocess_server.py:126 BeamZetaSqlCalcRel(expr#0=[{inputs}], expr#1=[1:BIGINT], expr#2=['foo':VARCHAR], expr#3=[3.1400000000000001243E0:DOUBLE], int=[$t1], str=[$t2], flt=[$t3])
INFO     apache_beam.utils.subprocess_server:subprocess_server.py:126   BeamValuesRel(tuples=[[{ 0 }]])
INFO     apache_beam.utils.subprocess_server:subprocess_server.py:126 
INFO     root:environments.py:317 No image given, using default Python SDK image
INFO     root:environments.py:320 Python SDK container image set to "apache/beam_python3.8_sdk:2.52.0.dev" for Docker environment
INFO     apache_beam.runners.portability.fn_api_runner.translations:translations.py:712 ==================== <function pack_combiners at 0x7f961ddef790> ====================
INFO     apache_beam.runners.portability.fn_api_runner.translations:translations.py:712 ==================== <function lift_combiners at 0x7f961ddef820> ====================
INFO     apache_beam.runners.portability.fn_api_runner.translations:translations.py:712 ==================== <function sort_stages at 0x7f961ddeff70> ====================
INFO     apache_beam.runners.portability.portable_runner:portable_runner.py:549 Job state changed to STOPPED
INFO     apache_beam.runners.portability.portable_runner:portable_runner.py:549 Job state changed to STARTING
INFO     apache_beam.runners.portability.portable_runner:portable_runner.py:549 Job state changed to RUNNING
INFO     root:portable_runner.py:542 ==================== <function annotate_downstream_side_inputs at 0x7fb39dd7c3a0> ====================
INFO     root:portable_runner.py:542 ==================== <function fix_side_input_pcoll_coders at 0x7fb39dd7c4c0> ====================
INFO     root:portable_runner.py:542 ==================== <function pack_combiners at 0x7fb39dd7c9d0> ====================
INFO     root:portable_runner.py:542 ==================== <function lift_combiners at 0x7fb39dd7ca60> ====================
INFO     root:portable_runner.py:542 ==================== <function expand_sdf at 0x7fb39dd7cc10> ====================
INFO     root:portable_runner.py:542 ==================== <function expand_gbk at 0x7fb39dd7cca0> ====================
INFO     root:portable_runner.py:542 ==================== <function sink_flattens at 0x7fb39dd7cdc0> ====================
INFO     root:portable_runner.py:542 ==================== <function greedily_fuse at 0x7fb39dd7ce50> ====================
INFO     root:portable_runner.py:542 ==================== <function read_to_impulse at 0x7fb39dd7cee0> ====================
INFO     root:portable_runner.py:542 ==================== <function impulse_to_input at 0x7fb39dd7cf70> ====================
INFO     root:portable_runner.py:542 ==================== <function sort_stages at 0x7fb39dd7d1f0> ====================
INFO     root:portable_runner.py:542 ==================== <function add_impulse_to_dangling_transforms at 0x7fb39dd7d310> ====================
INFO     root:portable_runner.py:542 ==================== <function setup_timer_mapping at 0x7fb39dd7d160> ====================
INFO     root:portable_runner.py:542 ==================== <function populate_data_channel_coders at 0x7fb39dd7d280> ====================
INFO     root:portable_runner.py:542 starting control server on port 34203
INFO     root:portable_runner.py:542 starting data server on port 32823
INFO     root:portable_runner.py:542 starting state server on port 46317
INFO     root:portable_runner.py:542 starting logging server on port 45923
INFO     root:portable_runner.py:542 Created Worker handler <apache_beam.runners.portability.fn_api_runner.worker_handlers.DockerSdkWorkerHandler object at 0x7fb39c3acfa0> for environment external_9beam:env:docker:v1 (beam:env:docker:v1, b'\n apache/beam_java8_sdk:2.52.0.dev')
INFO     root:portable_runner.py:542 Attempting to pull image apache/beam_java8_sdk:2.52.0.dev
INFO     root:portable_runner.py:542 Unable to pull image apache/beam_java8_sdk:2.52.0.dev, defaulting to local image if it exists
INFO     root:portable_runner.py:542 Waiting for docker to start up. Current status is running
INFO     root:portable_runner.py:542 Docker container is running. container_id = b'7e6c57214c65e38babe5357dc796c6e7e12e25381df98338962af77e6c820e4f', worker_id = worker_87
INFO     root:portable_runner.py:542 Created Worker handler <apache_beam.runners.portability.fn_api_runner.worker_handlers.DockerSdkWorkerHandler object at 0x7fb3d2fe1e20> for environment ref_Environment_default_environment_2 (beam:env:docker:v1, b'\n$apache/beam_python3.8_sdk:2.52.0.dev')
INFO     root:portable_runner.py:542 Attempting to pull image apache/beam_python3.8_sdk:2.52.0.dev
INFO     root:portable_runner.py:542 Unable to pull image apache/beam_python3.8_sdk:2.52.0.dev, defaulting to local image if it exists
INFO     root:portable_runner.py:542 Waiting for docker to start up. Current status is running
INFO     root:portable_runner.py:542 Docker container is running. container_id = b'58fb2d96ac54f20a7155a591fa37ad43beb346d00291c4a14014fc231a326cf8', worker_id = worker_88
INFO     root:portable_runner.py:542 Completed job in 15.219808340072632 seconds with state DONE.
INFO     apache_beam.runners.portability.portable_runner:portable_runner.py:549 Job state changed to DONE
PASSED                                                                   [100%]

=============================== warnings summary ===============================
../../build/gradleenv/1922375555/lib/python3.8/site-packages/hdfs/config.py:28
  <https://ci-beam.apache.org/job/beam_PostCommit_XVR_Direct/ws/src/build/gradleenv/1922375555/lib/python3.8/site-packages/hdfs/config.py>:28: DeprecationWarning: the imp module is deprecated in favour of importlib; see the module's documentation for alternative uses
    from imp import load_source

apache_beam/transforms/sql_test.py::SqlTransformTest::test_agg
apache_beam/transforms/sql_test.py::SqlTransformTest::test_filter
apache_beam/transforms/sql_test.py::SqlTransformTest::test_generate_data
apache_beam/transforms/sql_test.py::SqlTransformTest::test_map
apache_beam/transforms/sql_test.py::SqlTransformTest::test_project
apache_beam/transforms/sql_test.py::SqlTransformTest::test_row
apache_beam/transforms/sql_test.py::SqlTransformTest::test_tagged_join
apache_beam/transforms/sql_test.py::SqlTransformTest::test_windowing_before_sql
apache_beam/transforms/sql_test.py::SqlTransformTest::test_zetasql_generate_data
  <https://ci-beam.apache.org/job/beam_PostCommit_XVR_Direct/ws/src/sdks/python/apache_beam/transforms/external.py>:725: BeamDeprecationWarning: options is deprecated since First stable release. References to <pipeline>.options will not be supported
    self._expansion_service, pipeline.options)

-- Docs: https://docs.pytest.org/en/stable/how-to/capture-warnings.html
- generated xml file: <https://ci-beam.apache.org/job/beam_PostCommit_XVR_Direct/ws/src/sdks/python/pytest_xlangSqlValidateRunner.xml> -
=== 9 passed, 17 skipped, 7175 deselected, 10 warnings in 256.67s (0:04:16) ====

> Task :sdks:python:test-suites:direct:xlang:fnApiJobServerCleanup
Killing process at 1496248

> Task :sdks:python:test-suites:direct:xlang:validatesCrossLanguageRunnerCleanup
Stopping expansion service pid: 1498685.
Stopping expansion service pid: 1498686.

FAILURE: Build failed with an exception.

* Where:
Build file '<https://ci-beam.apache.org/job/beam_PostCommit_XVR_Direct/ws/src/sdks/go/test/build.gradle'> line: 235

* What went wrong:
Execution failed for task ':sdks:python:test-suites:direct:xlang:validatesCrossLanguageRunnerGoUsingJava'.
> Process 'command 'sh'' finished with non-zero exit value 1

* Try:
> Run with --stacktrace option to get the stack trace.
> Run with --info or --debug option to get more log output.

* Get more help at https://help.gradle.org

Deprecated Gradle features were used in this build, making it incompatible with Gradle 8.0.

You can use '--warning-mode all' to show the individual deprecation warnings and determine if they come from your own scripts or plugins.

See https://docs.gradle.org/7.6.2/userguide/command_line_interface.html#sec:command_line_warnings

Execution optimizations have been disabled for 1 invalid unit(s) of work during this build to ensure correctness.
Please consult deprecation warnings for more details.

BUILD FAILED in 27m 21s
258 actionable tasks: 167 executed, 79 from cache, 12 up-to-date

Publishing build scan...
https://ge.apache.org/s/pl2zjlobisvg4

Build step 'Invoke Gradle script' changed build result to FAILURE
Build step 'Invoke Gradle script' marked build as failure

---------------------------------------------------------------------
To unsubscribe, e-mail: builds-unsubscribe@beam.apache.org
For additional commands, e-mail: builds-help@beam.apache.org


Build failed in Jenkins: beam_PostCommit_XVR_Direct #4647

Posted by Apache Jenkins Server <je...@builds.apache.org>.
See <https://ci-beam.apache.org/job/beam_PostCommit_XVR_Direct/4647/display/redirect>

Changes:


------------------------------------------
[...truncated 1.55 MB...]
INFO     apache_beam.utils.subprocess_server:subprocess_server.py:126 Registered transforms:
INFO     apache_beam.utils.subprocess_server:subprocess_server.py:126 	beam:external:java:sql:v1: org.apache.beam.sdk.expansion.service.ExpansionService$ExternalTransformRegistrarLoader$1@3c46e67a
INFO     apache_beam.utils.subprocess_server:subprocess_server.py:126 	beam:transform:org.apache.beam:pubsub_read:v1: org.apache.beam.sdk.expansion.service.ExpansionService$ExternalTransformRegistrarLoader$1@c730b35
INFO     apache_beam.utils.subprocess_server:subprocess_server.py:126 	beam:transform:org.apache.beam:pubsub_write:v1: org.apache.beam.sdk.expansion.service.ExpansionService$ExternalTransformRegistrarLoader$1@206a70ef
INFO     apache_beam.utils.subprocess_server:subprocess_server.py:126 	beam:transform:org.apache.beam:pubsublite_write:v1: org.apache.beam.sdk.expansion.service.ExpansionService$ExternalTransformRegistrarLoader$1@292b08d6
INFO     apache_beam.utils.subprocess_server:subprocess_server.py:126 	beam:transform:org.apache.beam:pubsublite_read:v1: org.apache.beam.sdk.expansion.service.ExpansionService$ExternalTransformRegistrarLoader$1@22555ebf
INFO     apache_beam.utils.subprocess_server:subprocess_server.py:126 	beam:transform:org.apache.beam:spanner_insert:v1: org.apache.beam.sdk.expansion.service.ExpansionService$ExternalTransformRegistrarLoader$1@36ebc363
INFO     apache_beam.utils.subprocess_server:subprocess_server.py:126 	beam:transform:org.apache.beam:spanner_update:v1: org.apache.beam.sdk.expansion.service.ExpansionService$ExternalTransformRegistrarLoader$1@45752059
INFO     apache_beam.utils.subprocess_server:subprocess_server.py:126 	beam:transform:org.apache.beam:spanner_replace:v1: org.apache.beam.sdk.expansion.service.ExpansionService$ExternalTransformRegistrarLoader$1@34e9fd99
INFO     apache_beam.utils.subprocess_server:subprocess_server.py:126 	beam:transform:org.apache.beam:spanner_insert_or_update:v1: org.apache.beam.sdk.expansion.service.ExpansionService$ExternalTransformRegistrarLoader$1@3c41ed1d
INFO     apache_beam.utils.subprocess_server:subprocess_server.py:126 	beam:transform:org.apache.beam:spanner_delete:v1: org.apache.beam.sdk.expansion.service.ExpansionService$ExternalTransformRegistrarLoader$1@54d9d12d
INFO     apache_beam.utils.subprocess_server:subprocess_server.py:126 	beam:transform:org.apache.beam:spanner_read:v1: org.apache.beam.sdk.expansion.service.ExpansionService$ExternalTransformRegistrarLoader$1@38425407
INFO     apache_beam.utils.subprocess_server:subprocess_server.py:126 	beam:transform:org.apache.beam:kafka_read_with_metadata:v1: org.apache.beam.sdk.expansion.service.ExpansionService$ExternalTransformRegistrarLoader$1@43bc63a3
INFO     apache_beam.utils.subprocess_server:subprocess_server.py:126 	beam:transform:org.apache.beam:kafka_read_without_metadata:v1: org.apache.beam.sdk.expansion.service.ExpansionService$ExternalTransformRegistrarLoader$1@702657cc
INFO     apache_beam.utils.subprocess_server:subprocess_server.py:126 	beam:transform:org.apache.beam:kafka_write:v1: org.apache.beam.sdk.expansion.service.ExpansionService$ExternalTransformRegistrarLoader$1@6a6cb05c
INFO     apache_beam.utils.subprocess_server:subprocess_server.py:126 	beam:external:java:generate_sequence:v1: org.apache.beam.sdk.expansion.service.ExpansionService$ExternalTransformRegistrarLoader$1@40a4337a
INFO     apache_beam.utils.subprocess_server:subprocess_server.py:126 
INFO     apache_beam.utils.subprocess_server:subprocess_server.py:126 Registered SchemaTransformProviders:
INFO     apache_beam.utils.subprocess_server:subprocess_server.py:126 	beam:schematransform:org.apache.beam:spanner_cdc_read:v1
INFO     apache_beam.utils.subprocess_server:subprocess_server.py:126 	beam:schematransform:org.apache.beam:bigtable_write:v1
INFO     apache_beam.utils.subprocess_server:subprocess_server.py:126 	beam:schematransform:org.apache.beam:spanner_write:v1
INFO     apache_beam.utils.subprocess_server:subprocess_server.py:126 	beam:schematransform:org.apache.beam:pubsublite_read:v1
INFO     apache_beam.utils.subprocess_server:subprocess_server.py:126 	beam:schematransform:org.apache.beam:bigquery_storage_read:v1
INFO     apache_beam.utils.subprocess_server:subprocess_server.py:126 	beam:schematransform:org.apache.beam:bigquery_fileloads_write:v1
INFO     apache_beam.utils.subprocess_server:subprocess_server.py:126 	beam:schematransform:org.apache.beam:bigquery_export_read:v1
INFO     apache_beam.utils.subprocess_server:subprocess_server.py:126 	beam:schematransform:org.apache.beam:kafka_read:v1
INFO     apache_beam.utils.subprocess_server:subprocess_server.py:126 	beam:schematransform:org.apache.beam:kafka_write:v1
INFO     apache_beam.utils.subprocess_server:subprocess_server.py:126 	beam:schematransform:org.apache.beam:bigquery_storage_write:v2
INFO     apache_beam.utils.subprocess_server:subprocess_server.py:126 	schematransform:org.apache.beam:sql_transform:v1
INFO     apache_beam.utils.subprocess_server:subprocess_server.py:126 	beam:schematransform:org.apache.beam:pubsub_read:v1
INFO     apache_beam.utils.subprocess_server:subprocess_server.py:126 	beam:schematransform:org.apache.beam:pubsub_write:v1
INFO     apache_beam.utils.subprocess_server:subprocess_server.py:126 	beam:schematransform:org.apache.beam:bigtable_read:v1
INFO     apache_beam.utils.subprocess_server:subprocess_server.py:126 	beam:schematransform:org.apache.beam:pubsublite_write:v1
INFO     apache_beam.utils.subprocess_server:subprocess_server.py:126 Sep 26, 2023 11:42:22 PM org.apache.beam.sdk.expansion.service.ExpansionService expand
INFO     apache_beam.utils.subprocess_server:subprocess_server.py:126 INFO: Expanding 'SqlTransform(beam:external:java:sql:v1)' with URN 'beam:external:java:sql:v1'
INFO     apache_beam.utils.subprocess_server:subprocess_server.py:126 Dependencies list: {}
INFO     apache_beam.utils.subprocess_server:subprocess_server.py:126 Sep 26, 2023 11:42:23 PM org.apache.beam.sdk.expansion.service.ExpansionService$ExternalTransformRegistrarLoader payloadToConfig
INFO     apache_beam.utils.subprocess_server:subprocess_server.py:126 WARNING: Configuration class 'org.apache.beam.sdk.extensions.sql.expansion.ExternalSqlTransformRegistrar$Configuration' has no schema registered. Attempting to construct with setter approach.
INFO     apache_beam.utils.subprocess_server:subprocess_server.py:126 Sep 26, 2023 11:42:23 PM org.apache.beam.sdk.expansion.service.ExpansionService$ExternalTransformRegistrarLoader payloadToConfig
INFO     apache_beam.utils.subprocess_server:subprocess_server.py:126 WARNING: Configuration class 'org.apache.beam.sdk.extensions.sql.expansion.ExternalSqlTransformRegistrar$Configuration' has no schema registered. Attempting to construct with setter approach.
INFO     apache_beam.utils.subprocess_server:subprocess_server.py:126 Sep 26, 2023 11:42:24 PM org.apache.beam.sdk.extensions.sql.impl.CalciteQueryPlanner convertToBeamRel
INFO     apache_beam.utils.subprocess_server:subprocess_server.py:126 INFO: SQL:
INFO     apache_beam.utils.subprocess_server:subprocess_server.py:126 SELECT COUNT(*) AS `count`
INFO     apache_beam.utils.subprocess_server:subprocess_server.py:126 FROM `beam`.`PCOLLECTION` AS `PCOLLECTION`
INFO     apache_beam.utils.subprocess_server:subprocess_server.py:126 Sep 26, 2023 11:42:25 PM org.apache.beam.sdk.extensions.sql.impl.CalciteQueryPlanner convertToBeamRel
INFO     apache_beam.utils.subprocess_server:subprocess_server.py:126 INFO: SQLPlan>
INFO     apache_beam.utils.subprocess_server:subprocess_server.py:126 LogicalAggregate(group=[{}], count=[COUNT()])
INFO     apache_beam.utils.subprocess_server:subprocess_server.py:126   BeamIOSourceRel(table=[[beam, PCOLLECTION]])
INFO     apache_beam.utils.subprocess_server:subprocess_server.py:126 
INFO     apache_beam.utils.subprocess_server:subprocess_server.py:126 Sep 26, 2023 11:42:25 PM org.apache.beam.sdk.extensions.sql.impl.CalciteQueryPlanner convertToBeamRel
INFO     apache_beam.utils.subprocess_server:subprocess_server.py:126 INFO: BEAMPlan>
INFO     apache_beam.utils.subprocess_server:subprocess_server.py:126 BeamAggregationRel(group=[{}], count=[COUNT()])
INFO     apache_beam.utils.subprocess_server:subprocess_server.py:126   BeamIOSourceRel(table=[[beam, PCOLLECTION]])
INFO     apache_beam.utils.subprocess_server:subprocess_server.py:126 
INFO     root:environments.py:317 No image given, using default Python SDK image
INFO     root:environments.py:320 Python SDK container image set to "apache/beam_python3.8_sdk:2.52.0.dev" for Docker environment
INFO     apache_beam.runners.portability.fn_api_runner.translations:translations.py:712 ==================== <function pack_combiners at 0x7f28c2f53790> ====================
INFO     apache_beam.runners.portability.fn_api_runner.translations:translations.py:712 ==================== <function lift_combiners at 0x7f28c2f53820> ====================
INFO     apache_beam.runners.portability.fn_api_runner.translations:translations.py:712 ==================== <function sort_stages at 0x7f28c2f53f70> ====================
INFO     apache_beam.runners.portability.portable_runner:portable_runner.py:549 Job state changed to STOPPED
INFO     apache_beam.runners.portability.portable_runner:portable_runner.py:549 Job state changed to STARTING
INFO     apache_beam.runners.portability.portable_runner:portable_runner.py:549 Job state changed to RUNNING
INFO     root:portable_runner.py:542 ==================== <function annotate_downstream_side_inputs at 0x7f93e80093a0> ====================
INFO     root:portable_runner.py:542 ==================== <function fix_side_input_pcoll_coders at 0x7f93e80094c0> ====================
INFO     root:portable_runner.py:542 ==================== <function pack_combiners at 0x7f93e80099d0> ====================
INFO     root:portable_runner.py:542 ==================== <function lift_combiners at 0x7f93e8009a60> ====================
INFO     root:portable_runner.py:542 ==================== <function expand_sdf at 0x7f93e8009c10> ====================
INFO     root:portable_runner.py:542 ==================== <function expand_gbk at 0x7f93e8009ca0> ====================
INFO     root:portable_runner.py:542 ==================== <function sink_flattens at 0x7f93e8009dc0> ====================
INFO     root:portable_runner.py:542 ==================== <function greedily_fuse at 0x7f93e8009e50> ====================
INFO     root:portable_runner.py:542 ==================== <function read_to_impulse at 0x7f93e8009ee0> ====================
INFO     root:portable_runner.py:542 ==================== <function impulse_to_input at 0x7f93e8009f70> ====================
INFO     root:portable_runner.py:542 ==================== <function sort_stages at 0x7f93e800d1f0> ====================
INFO     root:portable_runner.py:542 ==================== <function add_impulse_to_dangling_transforms at 0x7f93e800d310> ====================
INFO     root:portable_runner.py:542 ==================== <function setup_timer_mapping at 0x7f93e800d160> ====================
INFO     root:portable_runner.py:542 ==================== <function populate_data_channel_coders at 0x7f93e800d280> ====================
INFO     root:portable_runner.py:542 starting control server on port 34649
INFO     root:portable_runner.py:542 starting data server on port 35753
INFO     root:portable_runner.py:542 starting state server on port 39143
INFO     root:portable_runner.py:542 starting logging server on port 45149
INFO     root:portable_runner.py:542 Created Worker handler <apache_beam.runners.portability.fn_api_runner.worker_handlers.DockerSdkWorkerHandler object at 0x7f941dd027f0> for environment ref_Environment_default_environment_2 (beam:env:docker:v1, b'\n$apache/beam_python3.8_sdk:2.52.0.dev')
INFO     root:portable_runner.py:542 Attempting to pull image apache/beam_python3.8_sdk:2.52.0.dev
INFO     root:portable_runner.py:542 Unable to pull image apache/beam_python3.8_sdk:2.52.0.dev, defaulting to local image if it exists
INFO     root:portable_runner.py:542 Waiting for docker to start up. Current status is running
INFO     root:portable_runner.py:542 Docker container is running. container_id = b'6cf4720f05306261a1423d7e06cfd74ffe643281c6bc75c6507117be73007b0d', worker_id = worker_85
INFO     root:portable_runner.py:542 Created Worker handler <apache_beam.runners.portability.fn_api_runner.worker_handlers.DockerSdkWorkerHandler object at 0x7f941dc07d90> for environment external_8beam:env:docker:v1 (beam:env:docker:v1, b'\n apache/beam_java8_sdk:2.52.0.dev')
INFO     root:portable_runner.py:542 Attempting to pull image apache/beam_java8_sdk:2.52.0.dev
INFO     root:portable_runner.py:542 Unable to pull image apache/beam_java8_sdk:2.52.0.dev, defaulting to local image if it exists
INFO     root:portable_runner.py:542 Waiting for docker to start up. Current status is running
INFO     root:portable_runner.py:542 Docker container is running. container_id = b'95f2db8fe21998b27fc880d0afeebcddc59d5a9e91612fcca386f8d0b5fefac5', worker_id = worker_86
INFO     root:portable_runner.py:542 Completed job in 14.419197082519531 seconds with state DONE.
INFO     apache_beam.runners.portability.portable_runner:portable_runner.py:549 Job state changed to DONE
PASSED                                                                   [ 88%]
apache_beam/transforms/sql_test.py::SqlTransformTest::test_zetasql_generate_data 
-------------------------------- live log call ---------------------------------
INFO     apache_beam.utils.subprocess_server:subprocess_server.py:239 Using pre-built snapshot at <https://ci-beam.apache.org/job/beam_PostCommit_XVR_Direct/ws/src/sdks/java/extensions/sql/expansion-service/build/libs/beam-sdks-java-extensions-sql-expansion-service-2.52.0-SNAPSHOT.jar>
INFO     root:external.py:978 Starting a JAR-based expansion service from JAR <https://ci-beam.apache.org/job/beam_PostCommit_XVR_Direct/ws/src/sdks/java/extensions/sql/expansion-service/build/libs/beam-sdks-java-extensions-sql-expansion-service-2.52.0-SNAPSHOT.jar> 
INFO     apache_beam.utils.subprocess_server:subprocess_server.py:116 Starting service with ['java' '-jar' '<https://ci-beam.apache.org/job/beam_PostCommit_XVR_Direct/ws/src/sdks/java/extensions/sql/expansion-service/build/libs/beam-sdks-java-extensions-sql-expansion-service-2.52.0-SNAPSHOT.jar'> '35421' '--filesToStage=<https://ci-beam.apache.org/job/beam_PostCommit_XVR_Direct/ws/src/sdks/java/extensions/sql/expansion-service/build/libs/beam-sdks-java-extensions-sql-expansion-service-2.52.0-SNAPSHOT.jar']>
INFO     apache_beam.utils.subprocess_server:subprocess_server.py:126 Starting expansion service at localhost:35421
INFO     apache_beam.utils.subprocess_server:subprocess_server.py:126 Sep 26, 2023 11:42:48 PM org.apache.beam.sdk.expansion.service.ExpansionService loadRegisteredTransforms
INFO     apache_beam.utils.subprocess_server:subprocess_server.py:126 INFO: Registering external transforms: [beam:external:java:sql:v1, beam:transform:org.apache.beam:pubsub_read:v1, beam:transform:org.apache.beam:pubsub_write:v1, beam:transform:org.apache.beam:pubsublite_write:v1, beam:transform:org.apache.beam:pubsublite_read:v1, beam:transform:org.apache.beam:spanner_insert:v1, beam:transform:org.apache.beam:spanner_update:v1, beam:transform:org.apache.beam:spanner_replace:v1, beam:transform:org.apache.beam:spanner_insert_or_update:v1, beam:transform:org.apache.beam:spanner_delete:v1, beam:transform:org.apache.beam:spanner_read:v1, beam:transform:org.apache.beam:kafka_read_with_metadata:v1, beam:transform:org.apache.beam:kafka_read_without_metadata:v1, beam:transform:org.apache.beam:kafka_write:v1, beam:external:java:generate_sequence:v1]
INFO     apache_beam.utils.subprocess_server:subprocess_server.py:126 
INFO     apache_beam.utils.subprocess_server:subprocess_server.py:126 Registered transforms:
INFO     apache_beam.utils.subprocess_server:subprocess_server.py:126 	beam:external:java:sql:v1: org.apache.beam.sdk.expansion.service.ExpansionService$ExternalTransformRegistrarLoader$1@3c46e67a
INFO     apache_beam.utils.subprocess_server:subprocess_server.py:126 	beam:transform:org.apache.beam:pubsub_read:v1: org.apache.beam.sdk.expansion.service.ExpansionService$ExternalTransformRegistrarLoader$1@c730b35
INFO     apache_beam.utils.subprocess_server:subprocess_server.py:126 	beam:transform:org.apache.beam:pubsub_write:v1: org.apache.beam.sdk.expansion.service.ExpansionService$ExternalTransformRegistrarLoader$1@206a70ef
INFO     apache_beam.utils.subprocess_server:subprocess_server.py:126 	beam:transform:org.apache.beam:pubsublite_write:v1: org.apache.beam.sdk.expansion.service.ExpansionService$ExternalTransformRegistrarLoader$1@292b08d6
INFO     apache_beam.utils.subprocess_server:subprocess_server.py:126 	beam:transform:org.apache.beam:pubsublite_read:v1: org.apache.beam.sdk.expansion.service.ExpansionService$ExternalTransformRegistrarLoader$1@22555ebf
INFO     apache_beam.utils.subprocess_server:subprocess_server.py:126 	beam:transform:org.apache.beam:spanner_insert:v1: org.apache.beam.sdk.expansion.service.ExpansionService$ExternalTransformRegistrarLoader$1@36ebc363
INFO     apache_beam.utils.subprocess_server:subprocess_server.py:126 	beam:transform:org.apache.beam:spanner_update:v1: org.apache.beam.sdk.expansion.service.ExpansionService$ExternalTransformRegistrarLoader$1@45752059
INFO     apache_beam.utils.subprocess_server:subprocess_server.py:126 	beam:transform:org.apache.beam:spanner_replace:v1: org.apache.beam.sdk.expansion.service.ExpansionService$ExternalTransformRegistrarLoader$1@34e9fd99
INFO     apache_beam.utils.subprocess_server:subprocess_server.py:126 	beam:transform:org.apache.beam:spanner_insert_or_update:v1: org.apache.beam.sdk.expansion.service.ExpansionService$ExternalTransformRegistrarLoader$1@3c41ed1d
INFO     apache_beam.utils.subprocess_server:subprocess_server.py:126 	beam:transform:org.apache.beam:spanner_delete:v1: org.apache.beam.sdk.expansion.service.ExpansionService$ExternalTransformRegistrarLoader$1@54d9d12d
INFO     apache_beam.utils.subprocess_server:subprocess_server.py:126 	beam:transform:org.apache.beam:spanner_read:v1: org.apache.beam.sdk.expansion.service.ExpansionService$ExternalTransformRegistrarLoader$1@38425407
INFO     apache_beam.utils.subprocess_server:subprocess_server.py:126 	beam:transform:org.apache.beam:kafka_read_with_metadata:v1: org.apache.beam.sdk.expansion.service.ExpansionService$ExternalTransformRegistrarLoader$1@43bc63a3
INFO     apache_beam.utils.subprocess_server:subprocess_server.py:126 	beam:transform:org.apache.beam:kafka_read_without_metadata:v1: org.apache.beam.sdk.expansion.service.ExpansionService$ExternalTransformRegistrarLoader$1@702657cc
INFO     apache_beam.utils.subprocess_server:subprocess_server.py:126 	beam:transform:org.apache.beam:kafka_write:v1: org.apache.beam.sdk.expansion.service.ExpansionService$ExternalTransformRegistrarLoader$1@6a6cb05c
INFO     apache_beam.utils.subprocess_server:subprocess_server.py:126 	beam:external:java:generate_sequence:v1: org.apache.beam.sdk.expansion.service.ExpansionService$ExternalTransformRegistrarLoader$1@40a4337a
INFO     apache_beam.utils.subprocess_server:subprocess_server.py:126 
INFO     apache_beam.utils.subprocess_server:subprocess_server.py:126 Registered SchemaTransformProviders:
INFO     apache_beam.utils.subprocess_server:subprocess_server.py:126 	beam:schematransform:org.apache.beam:spanner_cdc_read:v1
INFO     apache_beam.utils.subprocess_server:subprocess_server.py:126 	beam:schematransform:org.apache.beam:bigtable_write:v1
INFO     apache_beam.utils.subprocess_server:subprocess_server.py:126 	beam:schematransform:org.apache.beam:spanner_write:v1
INFO     apache_beam.utils.subprocess_server:subprocess_server.py:126 	beam:schematransform:org.apache.beam:pubsublite_read:v1
INFO     apache_beam.utils.subprocess_server:subprocess_server.py:126 	beam:schematransform:org.apache.beam:bigquery_storage_read:v1
INFO     apache_beam.utils.subprocess_server:subprocess_server.py:126 	beam:schematransform:org.apache.beam:bigquery_fileloads_write:v1
INFO     apache_beam.utils.subprocess_server:subprocess_server.py:126 	beam:schematransform:org.apache.beam:bigquery_export_read:v1
INFO     apache_beam.utils.subprocess_server:subprocess_server.py:126 	beam:schematransform:org.apache.beam:kafka_read:v1
INFO     apache_beam.utils.subprocess_server:subprocess_server.py:126 	beam:schematransform:org.apache.beam:kafka_write:v1
INFO     apache_beam.utils.subprocess_server:subprocess_server.py:126 	beam:schematransform:org.apache.beam:bigquery_storage_write:v2
INFO     apache_beam.utils.subprocess_server:subprocess_server.py:126 	schematransform:org.apache.beam:sql_transform:v1
INFO     apache_beam.utils.subprocess_server:subprocess_server.py:126 	beam:schematransform:org.apache.beam:pubsub_read:v1
INFO     apache_beam.utils.subprocess_server:subprocess_server.py:126 	beam:schematransform:org.apache.beam:pubsub_write:v1
INFO     apache_beam.utils.subprocess_server:subprocess_server.py:126 	beam:schematransform:org.apache.beam:bigtable_read:v1
INFO     apache_beam.utils.subprocess_server:subprocess_server.py:126 	beam:schematransform:org.apache.beam:pubsublite_write:v1
INFO     apache_beam.utils.subprocess_server:subprocess_server.py:126 Sep 26, 2023 11:42:49 PM org.apache.beam.sdk.expansion.service.ExpansionService expand
INFO     apache_beam.utils.subprocess_server:subprocess_server.py:126 INFO: Expanding 'SqlTransform(beam:external:java:sql:v1)' with URN 'beam:external:java:sql:v1'
INFO     apache_beam.utils.subprocess_server:subprocess_server.py:126 Dependencies list: {}
INFO     apache_beam.utils.subprocess_server:subprocess_server.py:126 Sep 26, 2023 11:42:49 PM org.apache.beam.sdk.expansion.service.ExpansionService$ExternalTransformRegistrarLoader payloadToConfig
INFO     apache_beam.utils.subprocess_server:subprocess_server.py:126 WARNING: Configuration class 'org.apache.beam.sdk.extensions.sql.expansion.ExternalSqlTransformRegistrar$Configuration' has no schema registered. Attempting to construct with setter approach.
INFO     apache_beam.utils.subprocess_server:subprocess_server.py:126 Sep 26, 2023 11:42:49 PM org.apache.beam.sdk.expansion.service.ExpansionService$ExternalTransformRegistrarLoader payloadToConfig
INFO     apache_beam.utils.subprocess_server:subprocess_server.py:126 WARNING: Configuration class 'org.apache.beam.sdk.extensions.sql.expansion.ExternalSqlTransformRegistrar$Configuration' has no schema registered. Attempting to construct with setter approach.
INFO     apache_beam.utils.subprocess_server:subprocess_server.py:126 Sep 26, 2023 11:42:51 PM com.google.zetasql.io.grpc.NameResolverRegistry getDefaultRegistry
INFO     apache_beam.utils.subprocess_server:subprocess_server.py:126 WARNING: No NameResolverProviders found via ServiceLoader, including for DNS. This is probably due to a broken build. If using ProGuard, check your configuration
INFO     apache_beam.utils.subprocess_server:subprocess_server.py:126 Sep 26, 2023 11:42:52 PM org.apache.beam.sdk.extensions.sql.zetasql.ZetaSQLQueryPlanner convertToBeamRelInternal
INFO     apache_beam.utils.subprocess_server:subprocess_server.py:126 INFO: BEAMPlan>
INFO     apache_beam.utils.subprocess_server:subprocess_server.py:126 BeamZetaSqlCalcRel(expr#0=[{inputs}], expr#1=[1:BIGINT], expr#2=['foo':VARCHAR], expr#3=[3.1400000000000001243E0:DOUBLE], int=[$t1], str=[$t2], flt=[$t3])
INFO     apache_beam.utils.subprocess_server:subprocess_server.py:126   BeamValuesRel(tuples=[[{ 0 }]])
INFO     apache_beam.utils.subprocess_server:subprocess_server.py:126 
INFO     root:environments.py:317 No image given, using default Python SDK image
INFO     root:environments.py:320 Python SDK container image set to "apache/beam_python3.8_sdk:2.52.0.dev" for Docker environment
INFO     apache_beam.runners.portability.fn_api_runner.translations:translations.py:712 ==================== <function pack_combiners at 0x7f28c2f53790> ====================
INFO     apache_beam.runners.portability.fn_api_runner.translations:translations.py:712 ==================== <function lift_combiners at 0x7f28c2f53820> ====================
INFO     apache_beam.runners.portability.fn_api_runner.translations:translations.py:712 ==================== <function sort_stages at 0x7f28c2f53f70> ====================
INFO     apache_beam.runners.portability.portable_runner:portable_runner.py:549 Job state changed to STOPPED
INFO     apache_beam.runners.portability.portable_runner:portable_runner.py:549 Job state changed to STARTING
INFO     apache_beam.runners.portability.portable_runner:portable_runner.py:549 Job state changed to RUNNING
INFO     root:portable_runner.py:542 ==================== <function annotate_downstream_side_inputs at 0x7f93e80093a0> ====================
INFO     root:portable_runner.py:542 ==================== <function fix_side_input_pcoll_coders at 0x7f93e80094c0> ====================
INFO     root:portable_runner.py:542 ==================== <function pack_combiners at 0x7f93e80099d0> ====================
INFO     root:portable_runner.py:542 ==================== <function lift_combiners at 0x7f93e8009a60> ====================
INFO     root:portable_runner.py:542 ==================== <function expand_sdf at 0x7f93e8009c10> ====================
INFO     root:portable_runner.py:542 ==================== <function expand_gbk at 0x7f93e8009ca0> ====================
INFO     root:portable_runner.py:542 ==================== <function sink_flattens at 0x7f93e8009dc0> ====================
INFO     root:portable_runner.py:542 ==================== <function greedily_fuse at 0x7f93e8009e50> ====================
INFO     root:portable_runner.py:542 ==================== <function read_to_impulse at 0x7f93e8009ee0> ====================
INFO     root:portable_runner.py:542 ==================== <function impulse_to_input at 0x7f93e8009f70> ====================
INFO     root:portable_runner.py:542 ==================== <function sort_stages at 0x7f93e800d1f0> ====================
INFO     root:portable_runner.py:542 ==================== <function add_impulse_to_dangling_transforms at 0x7f93e800d310> ====================
INFO     root:portable_runner.py:542 ==================== <function setup_timer_mapping at 0x7f93e800d160> ====================
INFO     root:portable_runner.py:542 ==================== <function populate_data_channel_coders at 0x7f93e800d280> ====================
INFO     root:portable_runner.py:542 starting control server on port 39279
INFO     root:portable_runner.py:542 starting data server on port 34715
INFO     root:portable_runner.py:542 starting state server on port 37627
INFO     root:portable_runner.py:542 starting logging server on port 46689
INFO     root:portable_runner.py:542 Created Worker handler <apache_beam.runners.portability.fn_api_runner.worker_handlers.DockerSdkWorkerHandler object at 0x7f941dc575b0> for environment external_9beam:env:docker:v1 (beam:env:docker:v1, b'\n apache/beam_java8_sdk:2.52.0.dev')
INFO     root:portable_runner.py:542 Attempting to pull image apache/beam_java8_sdk:2.52.0.dev
INFO     root:portable_runner.py:542 Unable to pull image apache/beam_java8_sdk:2.52.0.dev, defaulting to local image if it exists
INFO     root:portable_runner.py:542 Waiting for docker to start up. Current status is running
INFO     root:portable_runner.py:542 Docker container is running. container_id = b'd351f7e24a2421ff24631478c68e987b895df72cfef3f59aa715c83b4b6d8689', worker_id = worker_87
INFO     root:portable_runner.py:542 Created Worker handler <apache_beam.runners.portability.fn_api_runner.worker_handlers.DockerSdkWorkerHandler object at 0x7f941d1d7850> for environment ref_Environment_default_environment_2 (beam:env:docker:v1, b'\n$apache/beam_python3.8_sdk:2.52.0.dev')
INFO     root:portable_runner.py:542 Attempting to pull image apache/beam_python3.8_sdk:2.52.0.dev
INFO     root:portable_runner.py:542 Unable to pull image apache/beam_python3.8_sdk:2.52.0.dev, defaulting to local image if it exists
INFO     root:portable_runner.py:542 Waiting for docker to start up. Current status is running
INFO     root:portable_runner.py:542 Docker container is running. container_id = b'3b4d0bb9ac71bd6fbe684a2013dbda8154891c3b98a18f5dc62681a57d72131c', worker_id = worker_88
INFO     root:portable_runner.py:542 Completed job in 15.680291652679443 seconds with state DONE.
INFO     apache_beam.runners.portability.portable_runner:portable_runner.py:549 Job state changed to DONE
PASSED                                                                   [100%]

=============================== warnings summary ===============================
../../build/gradleenv/1922375555/lib/python3.8/site-packages/hdfs/config.py:28
  <https://ci-beam.apache.org/job/beam_PostCommit_XVR_Direct/ws/src/build/gradleenv/1922375555/lib/python3.8/site-packages/hdfs/config.py>:28: DeprecationWarning: the imp module is deprecated in favour of importlib; see the module's documentation for alternative uses
    from imp import load_source

apache_beam/transforms/sql_test.py::SqlTransformTest::test_agg
apache_beam/transforms/sql_test.py::SqlTransformTest::test_filter
apache_beam/transforms/sql_test.py::SqlTransformTest::test_generate_data
apache_beam/transforms/sql_test.py::SqlTransformTest::test_map
apache_beam/transforms/sql_test.py::SqlTransformTest::test_project
apache_beam/transforms/sql_test.py::SqlTransformTest::test_row
apache_beam/transforms/sql_test.py::SqlTransformTest::test_tagged_join
apache_beam/transforms/sql_test.py::SqlTransformTest::test_windowing_before_sql
apache_beam/transforms/sql_test.py::SqlTransformTest::test_zetasql_generate_data
  <https://ci-beam.apache.org/job/beam_PostCommit_XVR_Direct/ws/src/sdks/python/apache_beam/transforms/external.py>:725: BeamDeprecationWarning: options is deprecated since First stable release. References to <pipeline>.options will not be supported
    self._expansion_service, pipeline.options)

-- Docs: https://docs.pytest.org/en/stable/how-to/capture-warnings.html
- generated xml file: <https://ci-beam.apache.org/job/beam_PostCommit_XVR_Direct/ws/src/sdks/python/pytest_xlangSqlValidateRunner.xml> -
=== 9 passed, 17 skipped, 7175 deselected, 10 warnings in 254.88s (0:04:14) ====

> Task :sdks:python:test-suites:direct:xlang:fnApiJobServerCleanup
Killing process at 22998

> Task :sdks:python:test-suites:direct:xlang:validatesCrossLanguageRunnerCleanup
Stopping expansion service pid: 25641.
Stopping expansion service pid: 25642.

FAILURE: Build failed with an exception.

* Where:
Build file '<https://ci-beam.apache.org/job/beam_PostCommit_XVR_Direct/ws/src/sdks/go/test/build.gradle'> line: 235

* What went wrong:
Execution failed for task ':sdks:python:test-suites:direct:xlang:validatesCrossLanguageRunnerGoUsingJava'.
> Process 'command 'sh'' finished with non-zero exit value 1

* Try:
> Run with --stacktrace option to get the stack trace.
> Run with --info or --debug option to get more log output.

* Get more help at https://help.gradle.org

Deprecated Gradle features were used in this build, making it incompatible with Gradle 8.0.

You can use '--warning-mode all' to show the individual deprecation warnings and determine if they come from your own scripts or plugins.

See https://docs.gradle.org/7.6.2/userguide/command_line_interface.html#sec:command_line_warnings

Execution optimizations have been disabled for 1 invalid unit(s) of work during this build to ensure correctness.
Please consult deprecation warnings for more details.

BUILD FAILED in 32m 51s
258 actionable tasks: 167 executed, 79 from cache, 12 up-to-date

Publishing build scan...
https://ge.apache.org/s/ft2sfsmcqytzy

Build step 'Invoke Gradle script' changed build result to FAILURE
Build step 'Invoke Gradle script' marked build as failure

---------------------------------------------------------------------
To unsubscribe, e-mail: builds-unsubscribe@beam.apache.org
For additional commands, e-mail: builds-help@beam.apache.org