You are viewing a plain text version of this content. The canonical link for it is here.
Posted to oak-dev@jackrabbit.apache.org by Apache Jenkins Server <je...@builds.apache.org> on 2017/10/12 08:33:18 UTC
BUILD FAILURE: Jackrabbit Oak - Build # 864 - Failure
The Apache Jenkins build system has built Jackrabbit Oak (build #864)
Status: Failure
Check console output at https://builds.apache.org/job/Jackrabbit%20Oak/864/ to view the results.
Changes:
[chetanm] OAK-6803 - Provide a way to for persistent cache to determine which all nodes can be cached
Modify fixture to allow perf impact checks for this
[chetanm] OAK-6803 - Provide a way to for persistent cache to determine which all nodes can be cached
[mreutegg] OAK-301: Document Oak
Add note about Continuous Revision GC
[amitj] OAK-5983: BlobGC should log the amount of space reclaimed after GC run is done
- Logging the total size that's cleaned up only for cases where the length is encoded in the ids.
[amitj] OAK-5546: [BlobGC] Adapt time to delete blobs based on lucene indexing activity
- Fixed minor typo
Test results:
6 tests failed.
FAILED: org.apache.jackrabbit.oak.plugins.blob.datastore.DataStoreTrackerGCTest.gcForcedRetrieve
Error Message:
expected:<[11c204b9b6643011609d0b3cb9455382c4339d2993580d3625c9d947da84713e#16516, b75830d8ffe3c185f45205394914c014f4126e7cd0791a14f964f8d421aa922e#16516, 4d1e041599cd209fd548323678c9fdb78d437b3963381b44d73d3bd103838488#16516, 45d0f37c6a6dcabf99bc490da6e4797c73d81135ca8bacdecb8b595c8446d4e7#16516, acf34593abde794d27f1271148fc90feede460601d74ac5413ed14ef8274b6f5#18432, a3fb542c03bc6239227185b691601c9af2c209aa81842c84b6849fd017ecf6e0#18432, 9bea83700bd3875460b296e9c49a24705146acc0a7506bf3333882f0661dcccb#16516, 0d731c4d98ed2fadf04397fad13f8183a1372082445a1fbf2a7620d5ef30ea4a#16516, fdc8f7ad511a4b7d3292b3054a74ddce15f36acdd6f5ae8efe45c610bea99e40#18432]> but was:<[11c204b9b6643011609d0b3cb9455382c4339d2993580d3625c9d947da84713e#16516, 066960df84c6aae52ceab4c234e764cf1628b07ea040c604b49fc968cc041f4e#16516, 79f2b78a0e4c225cf92fb3ec22f5265c0044a286dce4501ae6446c803d847760#18432, a10f7f080e82cd062df29e11862d09a018b76aa16a556829c1b35a74dc94ac9e#16516, 9bea83700bd3875460b296e9c49a24705146acc0a7506bf3333882f0661dcccb#16516, b75830d8ffe3c185f45205394914c014f4126e7cd0791a14f964f8d421aa922e#16516, 4d1e041599cd209fd548323678c9fdb78d437b3963381b44d73d3bd103838488#16516, f3d7697f7f6c06d0e3c25f6b8d8a79e7ef19a80b6d0468f8c04a11593293cfa5#16516, 45d0f37c6a6dcabf99bc490da6e4797c73d81135ca8bacdecb8b595c8446d4e7#16516, acf34593abde794d27f1271148fc90feede460601d74ac5413ed14ef8274b6f5#18432, a3fb542c03bc6239227185b691601c9af2c209aa81842c84b6849fd017ecf6e0#18432, 0d731c4d98ed2fadf04397fad13f8183a1372082445a1fbf2a7620d5ef30ea4a#16516, dc0398ea1b350cf8d3cdce503102a9b7336e326844cccd96b83e0d54fc655b63#16516, fdc8f7ad511a4b7d3292b3054a74ddce15f36acdd6f5ae8efe45c610bea99e40#18432]>
Stack Trace:
java.lang.AssertionError: expected:<[11c204b9b6643011609d0b3cb9455382c4339d2993580d3625c9d947da84713e#16516, b75830d8ffe3c185f45205394914c014f4126e7cd0791a14f964f8d421aa922e#16516, 4d1e041599cd209fd548323678c9fdb78d437b3963381b44d73d3bd103838488#16516, 45d0f37c6a6dcabf99bc490da6e4797c73d81135ca8bacdecb8b595c8446d4e7#16516, acf34593abde794d27f1271148fc90feede460601d74ac5413ed14ef8274b6f5#18432, a3fb542c03bc6239227185b691601c9af2c209aa81842c84b6849fd017ecf6e0#18432, 9bea83700bd3875460b296e9c49a24705146acc0a7506bf3333882f0661dcccb#16516, 0d731c4d98ed2fadf04397fad13f8183a1372082445a1fbf2a7620d5ef30ea4a#16516, fdc8f7ad511a4b7d3292b3054a74ddce15f36acdd6f5ae8efe45c610bea99e40#18432]> but was:<[11c204b9b6643011609d0b3cb9455382c4339d2993580d3625c9d947da84713e#16516, 066960df84c6aae52ceab4c234e764cf1628b07ea040c604b49fc968cc041f4e#16516, 79f2b78a0e4c225cf92fb3ec22f5265c0044a286dce4501ae6446c803d847760#18432, a10f7f080e82cd062df29e11862d09a018b76aa16a556829c1b35a74dc94ac9e#16516, 9bea83700bd3875460b296e9c49a24705146acc0a7506bf3333882f0661dcccb#16516, b75830d8ffe3c185f45205394914c014f4126e7cd0791a14f964f8d421aa922e#16516, 4d1e041599cd209fd548323678c9fdb78d437b3963381b44d73d3bd103838488#16516, f3d7697f7f6c06d0e3c25f6b8d8a79e7ef19a80b6d0468f8c04a11593293cfa5#16516, 45d0f37c6a6dcabf99bc490da6e4797c73d81135ca8bacdecb8b595c8446d4e7#16516, acf34593abde794d27f1271148fc90feede460601d74ac5413ed14ef8274b6f5#18432, a3fb542c03bc6239227185b691601c9af2c209aa81842c84b6849fd017ecf6e0#18432, 0d731c4d98ed2fadf04397fad13f8183a1372082445a1fbf2a7620d5ef30ea4a#16516, dc0398ea1b350cf8d3cdce503102a9b7336e326844cccd96b83e0d54fc655b63#16516, fdc8f7ad511a4b7d3292b3054a74ddce15f36acdd6f5ae8efe45c610bea99e40#18432]>
at org.apache.jackrabbit.oak.plugins.blob.datastore.DataStoreTrackerGCTest.gcForcedRetrieve(DataStoreTrackerGCTest.java:225)
FAILED: org.apache.jackrabbit.oak.plugins.blob.datastore.DataStoreTrackerGCTest.gcWithInlined
Error Message:
expected:<[11c204b9b6643011609d0b3cb9455382c4339d2993580d3625c9d947da84713e#16516, b75830d8ffe3c185f45205394914c014f4126e7cd0791a14f964f8d421aa922e#16516, 4d1e041599cd209fd548323678c9fdb78d437b3963381b44d73d3bd103838488#16516, 45d0f37c6a6dcabf99bc490da6e4797c73d81135ca8bacdecb8b595c8446d4e7#16516, 9bea83700bd3875460b296e9c49a24705146acc0a7506bf3333882f0661dcccb#16516, 0d731c4d98ed2fadf04397fad13f8183a1372082445a1fbf2a7620d5ef30ea4a#16516]> but was:<[11c204b9b6643011609d0b3cb9455382c4339d2993580d3625c9d947da84713e#16516, b75830d8ffe3c185f45205394914c014f4126e7cd0791a14f964f8d421aa922e#16516, 066960df84c6aae52ceab4c234e764cf1628b07ea040c604b49fc968cc041f4e#16516, 4d1e041599cd209fd548323678c9fdb78d437b3963381b44d73d3bd103838488#16516, f3d7697f7f6c06d0e3c25f6b8d8a79e7ef19a80b6d0468f8c04a11593293cfa5#16516, 45d0f37c6a6dcabf99bc490da6e4797c73d81135ca8bacdecb8b595c8446d4e7#16516, a10f7f080e82cd062df29e11862d09a018b76aa16a556829c1b35a74dc94ac9e#16516, 0d731c4d98ed2fadf04397fad13f8183a1372082445a1fbf2a7620d5ef30ea4a#16516, 9bea83700bd3875460b296e9c49a24705146acc0a7506bf3333882f0661dcccb#16516, dc0398ea1b350cf8d3cdce503102a9b7336e326844cccd96b83e0d54fc655b63#16516]>
Stack Trace:
java.lang.AssertionError: expected:<[11c204b9b6643011609d0b3cb9455382c4339d2993580d3625c9d947da84713e#16516, b75830d8ffe3c185f45205394914c014f4126e7cd0791a14f964f8d421aa922e#16516, 4d1e041599cd209fd548323678c9fdb78d437b3963381b44d73d3bd103838488#16516, 45d0f37c6a6dcabf99bc490da6e4797c73d81135ca8bacdecb8b595c8446d4e7#16516, 9bea83700bd3875460b296e9c49a24705146acc0a7506bf3333882f0661dcccb#16516, 0d731c4d98ed2fadf04397fad13f8183a1372082445a1fbf2a7620d5ef30ea4a#16516]> but was:<[11c204b9b6643011609d0b3cb9455382c4339d2993580d3625c9d947da84713e#16516, b75830d8ffe3c185f45205394914c014f4126e7cd0791a14f964f8d421aa922e#16516, 066960df84c6aae52ceab4c234e764cf1628b07ea040c604b49fc968cc041f4e#16516, 4d1e041599cd209fd548323678c9fdb78d437b3963381b44d73d3bd103838488#16516, f3d7697f7f6c06d0e3c25f6b8d8a79e7ef19a80b6d0468f8c04a11593293cfa5#16516, 45d0f37c6a6dcabf99bc490da6e4797c73d81135ca8bacdecb8b595c8446d4e7#16516, a10f7f080e82cd062df29e11862d09a018b76aa16a556829c1b35a74dc94ac9e#16516, 0d731c4d98ed2fadf04397fad13f8183a1372082445a1fbf2a7620d5ef30ea4a#16516, 9bea83700bd3875460b296e9c49a24705146acc0a7506bf3333882f0661dcccb#16516, dc0398ea1b350cf8d3cdce503102a9b7336e326844cccd96b83e0d54fc655b63#16516]>
at org.apache.jackrabbit.oak.plugins.blob.datastore.DataStoreTrackerGCTest.gcWithInlined(DataStoreTrackerGCTest.java:253)
FAILED: org.apache.jackrabbit.oak.plugins.blob.datastore.DataStoreTrackerGCTest.gc
Error Message:
expected:<[11c204b9b6643011609d0b3cb9455382c4339d2993580d3625c9d947da84713e#16516, b75830d8ffe3c185f45205394914c014f4126e7cd0791a14f964f8d421aa922e#16516, 4d1e041599cd209fd548323678c9fdb78d437b3963381b44d73d3bd103838488#16516, 45d0f37c6a6dcabf99bc490da6e4797c73d81135ca8bacdecb8b595c8446d4e7#16516, 9bea83700bd3875460b296e9c49a24705146acc0a7506bf3333882f0661dcccb#16516, 0d731c4d98ed2fadf04397fad13f8183a1372082445a1fbf2a7620d5ef30ea4a#16516]> but was:<[11c204b9b6643011609d0b3cb9455382c4339d2993580d3625c9d947da84713e#16516, b75830d8ffe3c185f45205394914c014f4126e7cd0791a14f964f8d421aa922e#16516, 066960df84c6aae52ceab4c234e764cf1628b07ea040c604b49fc968cc041f4e#16516, 4d1e041599cd209fd548323678c9fdb78d437b3963381b44d73d3bd103838488#16516, f3d7697f7f6c06d0e3c25f6b8d8a79e7ef19a80b6d0468f8c04a11593293cfa5#16516, 45d0f37c6a6dcabf99bc490da6e4797c73d81135ca8bacdecb8b595c8446d4e7#16516, a10f7f080e82cd062df29e11862d09a018b76aa16a556829c1b35a74dc94ac9e#16516, 0d731c4d98ed2fadf04397fad13f8183a1372082445a1fbf2a7620d5ef30ea4a#16516, 9bea83700bd3875460b296e9c49a24705146acc0a7506bf3333882f0661dcccb#16516, dc0398ea1b350cf8d3cdce503102a9b7336e326844cccd96b83e0d54fc655b63#16516]>
Stack Trace:
java.lang.AssertionError: expected:<[11c204b9b6643011609d0b3cb9455382c4339d2993580d3625c9d947da84713e#16516, b75830d8ffe3c185f45205394914c014f4126e7cd0791a14f964f8d421aa922e#16516, 4d1e041599cd209fd548323678c9fdb78d437b3963381b44d73d3bd103838488#16516, 45d0f37c6a6dcabf99bc490da6e4797c73d81135ca8bacdecb8b595c8446d4e7#16516, 9bea83700bd3875460b296e9c49a24705146acc0a7506bf3333882f0661dcccb#16516, 0d731c4d98ed2fadf04397fad13f8183a1372082445a1fbf2a7620d5ef30ea4a#16516]> but was:<[11c204b9b6643011609d0b3cb9455382c4339d2993580d3625c9d947da84713e#16516, b75830d8ffe3c185f45205394914c014f4126e7cd0791a14f964f8d421aa922e#16516, 066960df84c6aae52ceab4c234e764cf1628b07ea040c604b49fc968cc041f4e#16516, 4d1e041599cd209fd548323678c9fdb78d437b3963381b44d73d3bd103838488#16516, f3d7697f7f6c06d0e3c25f6b8d8a79e7ef19a80b6d0468f8c04a11593293cfa5#16516, 45d0f37c6a6dcabf99bc490da6e4797c73d81135ca8bacdecb8b595c8446d4e7#16516, a10f7f080e82cd062df29e11862d09a018b76aa16a556829c1b35a74dc94ac9e#16516, 0d731c4d98ed2fadf04397fad13f8183a1372082445a1fbf2a7620d5ef30ea4a#16516, 9bea83700bd3875460b296e9c49a24705146acc0a7506bf3333882f0661dcccb#16516, dc0398ea1b350cf8d3cdce503102a9b7336e326844cccd96b83e0d54fc655b63#16516]>
at org.apache.jackrabbit.oak.plugins.blob.datastore.DataStoreTrackerGCTest.gc(DataStoreTrackerGCTest.java:137)
FAILED: org.apache.jackrabbit.oak.plugins.blob.datastore.DataStoreTrackerGCTest.differentClusterGC
Error Message:
expected:<[11c204b9b6643011609d0b3cb9455382c4339d2993580d3625c9d947da84713e#16516, b75830d8ffe3c185f45205394914c014f4126e7cd0791a14f964f8d421aa922e#16516, 4d1e041599cd209fd548323678c9fdb78d437b3963381b44d73d3bd103838488#16516, 45d0f37c6a6dcabf99bc490da6e4797c73d81135ca8bacdecb8b595c8446d4e7#16516, 9bea83700bd3875460b296e9c49a24705146acc0a7506bf3333882f0661dcccb#16516, 0d731c4d98ed2fadf04397fad13f8183a1372082445a1fbf2a7620d5ef30ea4a#16516, 256b83a0a09b3a4aeaf776e560d2a6fb0671d4ccd4975a4f51d2d14bbeccd1a1#16516, 8c2e6c4af8e8571a35c974b935c40a3d522b198752336d213515ac0dc4cc88cf#16516, a5883b9ab3d3fd2472eb14ba750a29c0c0280009df949b43dd058397f3920c6a#16516, cf1c26522b76e808c64386c94c2c6b1f20e18b701c89ec19765ce600113ea040#16516, de41718d242b195c5c69f2ce98d1a3346d39129dfd2e2df397f1478ab90f48b9#16516, 5cf1d5ba1938503e781bad52186722fe9bda30a009f9296077610b89889a43da#16516]> but was:<[11c204b9b6643011609d0b3cb9455382c4339d2993580d3625c9d947da84713e#16516, 256b83a0a09b3a4aeaf776e560d2a6fb0671d4ccd4975a4f51d2d14bbeccd1a1#16516, cac686805099443e8b86ff2b92edff533cefbf96a262bf843929b71cee8bface#16516, 066960df84c6aae52ceab4c234e764cf1628b07ea040c604b49fc968cc041f4e#16516, 8c2e6c4af8e8571a35c974b935c40a3d522b198752336d213515ac0dc4cc88cf#16516, a5883b9ab3d3fd2472eb14ba750a29c0c0280009df949b43dd058397f3920c6a#16516, cf1c26522b76e808c64386c94c2c6b1f20e18b701c89ec19765ce600113ea040#16516, 91e0f8a2cb38c5bbdd2cdfa3285b3505d7242718c441259cde38ac20a93e60ea#16516, de41718d242b195c5c69f2ce98d1a3346d39129dfd2e2df397f1478ab90f48b9#16516, a10f7f080e82cd062df29e11862d09a018b76aa16a556829c1b35a74dc94ac9e#16516, 9bea83700bd3875460b296e9c49a24705146acc0a7506bf3333882f0661dcccb#16516, 16c5e1d51f9376c09f998afa228c05485933e3e01f80f4dd3130bece08810f61#16516, 58608d6af15ec1b48a22d66981c146d5c9b6d63be1d88cce49e2657aea29b0e8#16516, b75830d8ffe3c185f45205394914c014f4126e7cd0791a14f964f8d421aa922e#16516, 4d1e041599cd209fd548323678c9fdb78d437b3963381b44d73d3bd103838488#16516, f3d7697f7f6c06d0e3c25f6b8d8a79e7ef19a80b6d0468f8c04a11593293cfa5#16516, 45d0f37c6a6dcabf99bc490da6e4797c73d81135ca8bacdecb8b595c8446d4e7#16516, 5cf1d5ba1938503e781bad52186722fe9bda30a009f9296077610b89889a43da#16516, 0d731c4d98ed2fadf04397fad13f8183a1372082445a1fbf2a7620d5ef30ea4a#16516, dc0398ea1b350cf8d3cdce503102a9b7336e326844cccd96b83e0d54fc655b63#16516]>
Stack Trace:
java.lang.AssertionError: expected:<[11c204b9b6643011609d0b3cb9455382c4339d2993580d3625c9d947da84713e#16516, b75830d8ffe3c185f45205394914c014f4126e7cd0791a14f964f8d421aa922e#16516, 4d1e041599cd209fd548323678c9fdb78d437b3963381b44d73d3bd103838488#16516, 45d0f37c6a6dcabf99bc490da6e4797c73d81135ca8bacdecb8b595c8446d4e7#16516, 9bea83700bd3875460b296e9c49a24705146acc0a7506bf3333882f0661dcccb#16516, 0d731c4d98ed2fadf04397fad13f8183a1372082445a1fbf2a7620d5ef30ea4a#16516, 256b83a0a09b3a4aeaf776e560d2a6fb0671d4ccd4975a4f51d2d14bbeccd1a1#16516, 8c2e6c4af8e8571a35c974b935c40a3d522b198752336d213515ac0dc4cc88cf#16516, a5883b9ab3d3fd2472eb14ba750a29c0c0280009df949b43dd058397f3920c6a#16516, cf1c26522b76e808c64386c94c2c6b1f20e18b701c89ec19765ce600113ea040#16516, de41718d242b195c5c69f2ce98d1a3346d39129dfd2e2df397f1478ab90f48b9#16516, 5cf1d5ba1938503e781bad52186722fe9bda30a009f9296077610b89889a43da#16516]> but was:<[11c204b9b6643011609d0b3cb9455382c4339d2993580d3625c9d947da84713e#16516, 256b83a0a09b3a4aeaf776e560d2a6fb0671d4ccd4975a4f51d2d14bbeccd1a1#16516, cac686805099443e8b86ff2b92edff533cefbf96a262bf843929b71cee8bface#16516, 066960df84c6aae52ceab4c234e764cf1628b07ea040c604b49fc968cc041f4e#16516, 8c2e6c4af8e8571a35c974b935c40a3d522b198752336d213515ac0dc4cc88cf#16516, a5883b9ab3d3fd2472eb14ba750a29c0c0280009df949b43dd058397f3920c6a#16516, cf1c26522b76e808c64386c94c2c6b1f20e18b701c89ec19765ce600113ea040#16516, 91e0f8a2cb38c5bbdd2cdfa3285b3505d7242718c441259cde38ac20a93e60ea#16516, de41718d242b195c5c69f2ce98d1a3346d39129dfd2e2df397f1478ab90f48b9#16516, a10f7f080e82cd062df29e11862d09a018b76aa16a556829c1b35a74dc94ac9e#16516, 9bea83700bd3875460b296e9c49a24705146acc0a7506bf3333882f0661dcccb#16516, 16c5e1d51f9376c09f998afa228c05485933e3e01f80f4dd3130bece08810f61#16516, 58608d6af15ec1b48a22d66981c146d5c9b6d63be1d88cce49e2657aea29b0e8#16516, b75830d8ffe3c185f45205394914c014f4126e7cd0791a14f964f8d421aa922e#16516, 4d1e041599cd209fd548323678c9fdb78d437b3963381b44d73d3bd103838488#16516, f3d7697f7f6c06d0e3c25f6b8d8a79e7ef19a80b6d0468f8c04a11593293cfa5#16516, 45d0f37c6a6dcabf99bc490da6e4797c73d81135ca8bacdecb8b595c8446d4e7#16516, 5cf1d5ba1938503e781bad52186722fe9bda30a009f9296077610b89889a43da#16516, 0d731c4d98ed2fadf04397fad13f8183a1372082445a1fbf2a7620d5ef30ea4a#16516, dc0398ea1b350cf8d3cdce503102a9b7336e326844cccd96b83e0d54fc655b63#16516]>
at org.apache.jackrabbit.oak.plugins.blob.datastore.DataStoreTrackerGCTest.clusterGCInternal(DataStoreTrackerGCTest.java:302)
at org.apache.jackrabbit.oak.plugins.blob.datastore.DataStoreTrackerGCTest.differentClusterGC(DataStoreTrackerGCTest.java:348)
FAILED: org.apache.jackrabbit.oak.plugins.blob.datastore.DataStoreTrackerGCTest.gcColdStart
Error Message:
expected:<[11c204b9b6643011609d0b3cb9455382c4339d2993580d3625c9d947da84713e#16516, b75830d8ffe3c185f45205394914c014f4126e7cd0791a14f964f8d421aa922e#16516, 4d1e041599cd209fd548323678c9fdb78d437b3963381b44d73d3bd103838488#16516, 45d0f37c6a6dcabf99bc490da6e4797c73d81135ca8bacdecb8b595c8446d4e7#16516, 9bea83700bd3875460b296e9c49a24705146acc0a7506bf3333882f0661dcccb#16516, 0d731c4d98ed2fadf04397fad13f8183a1372082445a1fbf2a7620d5ef30ea4a#16516]> but was:<[11c204b9b6643011609d0b3cb9455382c4339d2993580d3625c9d947da84713e#16516, b75830d8ffe3c185f45205394914c014f4126e7cd0791a14f964f8d421aa922e#16516, 066960df84c6aae52ceab4c234e764cf1628b07ea040c604b49fc968cc041f4e#16516, 4d1e041599cd209fd548323678c9fdb78d437b3963381b44d73d3bd103838488#16516, f3d7697f7f6c06d0e3c25f6b8d8a79e7ef19a80b6d0468f8c04a11593293cfa5#16516, 45d0f37c6a6dcabf99bc490da6e4797c73d81135ca8bacdecb8b595c8446d4e7#16516, a10f7f080e82cd062df29e11862d09a018b76aa16a556829c1b35a74dc94ac9e#16516, 0d731c4d98ed2fadf04397fad13f8183a1372082445a1fbf2a7620d5ef30ea4a#16516, 9bea83700bd3875460b296e9c49a24705146acc0a7506bf3333882f0661dcccb#16516, dc0398ea1b350cf8d3cdce503102a9b7336e326844cccd96b83e0d54fc655b63#16516]>
Stack Trace:
java.lang.AssertionError: expected:<[11c204b9b6643011609d0b3cb9455382c4339d2993580d3625c9d947da84713e#16516, b75830d8ffe3c185f45205394914c014f4126e7cd0791a14f964f8d421aa922e#16516, 4d1e041599cd209fd548323678c9fdb78d437b3963381b44d73d3bd103838488#16516, 45d0f37c6a6dcabf99bc490da6e4797c73d81135ca8bacdecb8b595c8446d4e7#16516, 9bea83700bd3875460b296e9c49a24705146acc0a7506bf3333882f0661dcccb#16516, 0d731c4d98ed2fadf04397fad13f8183a1372082445a1fbf2a7620d5ef30ea4a#16516]> but was:<[11c204b9b6643011609d0b3cb9455382c4339d2993580d3625c9d947da84713e#16516, b75830d8ffe3c185f45205394914c014f4126e7cd0791a14f964f8d421aa922e#16516, 066960df84c6aae52ceab4c234e764cf1628b07ea040c604b49fc968cc041f4e#16516, 4d1e041599cd209fd548323678c9fdb78d437b3963381b44d73d3bd103838488#16516, f3d7697f7f6c06d0e3c25f6b8d8a79e7ef19a80b6d0468f8c04a11593293cfa5#16516, 45d0f37c6a6dcabf99bc490da6e4797c73d81135ca8bacdecb8b595c8446d4e7#16516, a10f7f080e82cd062df29e11862d09a018b76aa16a556829c1b35a74dc94ac9e#16516, 0d731c4d98ed2fadf04397fad13f8183a1372082445a1fbf2a7620d5ef30ea4a#16516, 9bea83700bd3875460b296e9c49a24705146acc0a7506bf3333882f0661dcccb#16516, dc0398ea1b350cf8d3cdce503102a9b7336e326844cccd96b83e0d54fc655b63#16516]>
at org.apache.jackrabbit.oak.plugins.blob.datastore.DataStoreTrackerGCTest.gcColdStart(DataStoreTrackerGCTest.java:155)
FAILED: org.apache.jackrabbit.oak.plugins.blob.datastore.DataStoreTrackerGCTest.sameClusterGC
Error Message:
expected:<[11c204b9b6643011609d0b3cb9455382c4339d2993580d3625c9d947da84713e#16516, b75830d8ffe3c185f45205394914c014f4126e7cd0791a14f964f8d421aa922e#16516, 4d1e041599cd209fd548323678c9fdb78d437b3963381b44d73d3bd103838488#16516, 45d0f37c6a6dcabf99bc490da6e4797c73d81135ca8bacdecb8b595c8446d4e7#16516, 9bea83700bd3875460b296e9c49a24705146acc0a7506bf3333882f0661dcccb#16516, 0d731c4d98ed2fadf04397fad13f8183a1372082445a1fbf2a7620d5ef30ea4a#16516, 256b83a0a09b3a4aeaf776e560d2a6fb0671d4ccd4975a4f51d2d14bbeccd1a1#16516, 8c2e6c4af8e8571a35c974b935c40a3d522b198752336d213515ac0dc4cc88cf#16516, a5883b9ab3d3fd2472eb14ba750a29c0c0280009df949b43dd058397f3920c6a#16516, cf1c26522b76e808c64386c94c2c6b1f20e18b701c89ec19765ce600113ea040#16516, de41718d242b195c5c69f2ce98d1a3346d39129dfd2e2df397f1478ab90f48b9#16516, 5cf1d5ba1938503e781bad52186722fe9bda30a009f9296077610b89889a43da#16516]> but was:<[11c204b9b6643011609d0b3cb9455382c4339d2993580d3625c9d947da84713e#16516, 256b83a0a09b3a4aeaf776e560d2a6fb0671d4ccd4975a4f51d2d14bbeccd1a1#16516, cac686805099443e8b86ff2b92edff533cefbf96a262bf843929b71cee8bface#16516, 066960df84c6aae52ceab4c234e764cf1628b07ea040c604b49fc968cc041f4e#16516, 8c2e6c4af8e8571a35c974b935c40a3d522b198752336d213515ac0dc4cc88cf#16516, a5883b9ab3d3fd2472eb14ba750a29c0c0280009df949b43dd058397f3920c6a#16516, cf1c26522b76e808c64386c94c2c6b1f20e18b701c89ec19765ce600113ea040#16516, 91e0f8a2cb38c5bbdd2cdfa3285b3505d7242718c441259cde38ac20a93e60ea#16516, de41718d242b195c5c69f2ce98d1a3346d39129dfd2e2df397f1478ab90f48b9#16516, a10f7f080e82cd062df29e11862d09a018b76aa16a556829c1b35a74dc94ac9e#16516, 9bea83700bd3875460b296e9c49a24705146acc0a7506bf3333882f0661dcccb#16516, 16c5e1d51f9376c09f998afa228c05485933e3e01f80f4dd3130bece08810f61#16516, 58608d6af15ec1b48a22d66981c146d5c9b6d63be1d88cce49e2657aea29b0e8#16516, b75830d8ffe3c185f45205394914c014f4126e7cd0791a14f964f8d421aa922e#16516, 4d1e041599cd209fd548323678c9fdb78d437b3963381b44d73d3bd103838488#16516, f3d7697f7f6c06d0e3c25f6b8d8a79e7ef19a80b6d0468f8c04a11593293cfa5#16516, 45d0f37c6a6dcabf99bc490da6e4797c73d81135ca8bacdecb8b595c8446d4e7#16516, 5cf1d5ba1938503e781bad52186722fe9bda30a009f9296077610b89889a43da#16516, 0d731c4d98ed2fadf04397fad13f8183a1372082445a1fbf2a7620d5ef30ea4a#16516, dc0398ea1b350cf8d3cdce503102a9b7336e326844cccd96b83e0d54fc655b63#16516]>
Stack Trace:
java.lang.AssertionError: expected:<[11c204b9b6643011609d0b3cb9455382c4339d2993580d3625c9d947da84713e#16516, b75830d8ffe3c185f45205394914c014f4126e7cd0791a14f964f8d421aa922e#16516, 4d1e041599cd209fd548323678c9fdb78d437b3963381b44d73d3bd103838488#16516, 45d0f37c6a6dcabf99bc490da6e4797c73d81135ca8bacdecb8b595c8446d4e7#16516, 9bea83700bd3875460b296e9c49a24705146acc0a7506bf3333882f0661dcccb#16516, 0d731c4d98ed2fadf04397fad13f8183a1372082445a1fbf2a7620d5ef30ea4a#16516, 256b83a0a09b3a4aeaf776e560d2a6fb0671d4ccd4975a4f51d2d14bbeccd1a1#16516, 8c2e6c4af8e8571a35c974b935c40a3d522b198752336d213515ac0dc4cc88cf#16516, a5883b9ab3d3fd2472eb14ba750a29c0c0280009df949b43dd058397f3920c6a#16516, cf1c26522b76e808c64386c94c2c6b1f20e18b701c89ec19765ce600113ea040#16516, de41718d242b195c5c69f2ce98d1a3346d39129dfd2e2df397f1478ab90f48b9#16516, 5cf1d5ba1938503e781bad52186722fe9bda30a009f9296077610b89889a43da#16516]> but was:<[11c204b9b6643011609d0b3cb9455382c4339d2993580d3625c9d947da84713e#16516, 256b83a0a09b3a4aeaf776e560d2a6fb0671d4ccd4975a4f51d2d14bbeccd1a1#16516, cac686805099443e8b86ff2b92edff533cefbf96a262bf843929b71cee8bface#16516, 066960df84c6aae52ceab4c234e764cf1628b07ea040c604b49fc968cc041f4e#16516, 8c2e6c4af8e8571a35c974b935c40a3d522b198752336d213515ac0dc4cc88cf#16516, a5883b9ab3d3fd2472eb14ba750a29c0c0280009df949b43dd058397f3920c6a#16516, cf1c26522b76e808c64386c94c2c6b1f20e18b701c89ec19765ce600113ea040#16516, 91e0f8a2cb38c5bbdd2cdfa3285b3505d7242718c441259cde38ac20a93e60ea#16516, de41718d242b195c5c69f2ce98d1a3346d39129dfd2e2df397f1478ab90f48b9#16516, a10f7f080e82cd062df29e11862d09a018b76aa16a556829c1b35a74dc94ac9e#16516, 9bea83700bd3875460b296e9c49a24705146acc0a7506bf3333882f0661dcccb#16516, 16c5e1d51f9376c09f998afa228c05485933e3e01f80f4dd3130bece08810f61#16516, 58608d6af15ec1b48a22d66981c146d5c9b6d63be1d88cce49e2657aea29b0e8#16516, b75830d8ffe3c185f45205394914c014f4126e7cd0791a14f964f8d421aa922e#16516, 4d1e041599cd209fd548323678c9fdb78d437b3963381b44d73d3bd103838488#16516, f3d7697f7f6c06d0e3c25f6b8d8a79e7ef19a80b6d0468f8c04a11593293cfa5#16516, 45d0f37c6a6dcabf99bc490da6e4797c73d81135ca8bacdecb8b595c8446d4e7#16516, 5cf1d5ba1938503e781bad52186722fe9bda30a009f9296077610b89889a43da#16516, 0d731c4d98ed2fadf04397fad13f8183a1372082445a1fbf2a7620d5ef30ea4a#16516, dc0398ea1b350cf8d3cdce503102a9b7336e326844cccd96b83e0d54fc655b63#16516]>
at org.apache.jackrabbit.oak.plugins.blob.datastore.DataStoreTrackerGCTest.clusterGCInternal(DataStoreTrackerGCTest.java:302)
at org.apache.jackrabbit.oak.plugins.blob.datastore.DataStoreTrackerGCTest.sameClusterGC(DataStoreTrackerGCTest.java:361)
Re: BUILD FAILURE: Jackrabbit Oak - Build # 878 - Still Failing
Posted by Michael Dürig <md...@apache.org>.
Hi,
Recent failures seem to be caused by the JIRA plugin. See
https://issues.apache.org/jira/browse/INFRA-15290#
I disabled that plugin for now:
https://builds.apache.org/job/Jackrabbit%20Oak/jobConfigHistory/showDiffFiles?timestamp1=2017-10-01_03-35-21×tamp2=2017-10-16_11-54-27
Michael
On 16.10.17 13:29, Apache Jenkins Server wrote:
> The Apache Jenkins build system has built Jackrabbit Oak (build #878)
>
> Status: Still Failing
>
> Check console output at https://builds.apache.org/job/Jackrabbit%20Oak/878/ to view the results.
>
> Changes:
> [chetanm] OAK-6832 - Synchronous nodetype lucene index support
>
> [chetanm] OAK-6831 - Nodetype index support in Lucene Index
>
> Ensure that if jcr:primaryType is indexed then jcr:mixins is also indexed
> This is required to ensure consistency when multiple index rules for different
> types are defined
>
> [chetanm] OAK-6831 - Nodetype index support in Lucene Index
>
> -- For 'nodeTypeIndex' case disable aggregates
>
> [chetanm] OAK-6831 - Nodetype index support in Lucene Index
>
> -- Support for 'nodeTypeIndex' property at index definition node
> -- Support for 'sync' indexRules to indicate that nodeTypeIndex for that
> node is to be indexed in 'sync' mode
>
>
>
> Test results:
> All tests passed
>
BUILD FAILURE: Jackrabbit Oak - Build # 878 - Still Failing
Posted by Apache Jenkins Server <je...@builds.apache.org>.
The Apache Jenkins build system has built Jackrabbit Oak (build #878)
Status: Still Failing
Check console output at https://builds.apache.org/job/Jackrabbit%20Oak/878/ to view the results.
Changes:
[chetanm] OAK-6832 - Synchronous nodetype lucene index support
[chetanm] OAK-6831 - Nodetype index support in Lucene Index
Ensure that if jcr:primaryType is indexed then jcr:mixins is also indexed
This is required to ensure consistency when multiple index rules for different
types are defined
[chetanm] OAK-6831 - Nodetype index support in Lucene Index
-- For 'nodeTypeIndex' case disable aggregates
[chetanm] OAK-6831 - Nodetype index support in Lucene Index
-- Support for 'nodeTypeIndex' property at index definition node
-- Support for 'sync' indexRules to indicate that nodeTypeIndex for that
node is to be indexed in 'sync' mode
Test results:
All tests passed
BUILD FAILURE: Jackrabbit Oak - Build # 877 - Still Failing
Posted by Apache Jenkins Server <je...@builds.apache.org>.
The Apache Jenkins build system has built Jackrabbit Oak (build #877)
Status: Still Failing
Check console output at https://builds.apache.org/job/Jackrabbit%20Oak/877/ to view the results.
Changes:
[chetanm] OAK-6832 - Synchronous nodetype lucene index support
Prepration step for nodetype support
Remove usage of property definition from lookup as its not required
in lookup flow
Test results:
All tests passed
BUILD FAILURE: Jackrabbit Oak - Build # 876 - Still Failing
Posted by Apache Jenkins Server <je...@builds.apache.org>.
The Apache Jenkins build system has built Jackrabbit Oak (build #876)
Status: Still Failing
Check console output at https://builds.apache.org/job/Jackrabbit%20Oak/876/ to view the results.
Changes:
[chetanm] OAK-6820 - Implement support for disabling indexes which are replaced with newer index
Test results:
All tests passed
BUILD FAILURE: Jackrabbit Oak - Build # 875 - Still Failing
Posted by Apache Jenkins Server <je...@builds.apache.org>.
The Apache Jenkins build system has built Jackrabbit Oak (build #875)
Status: Still Failing
Check console output at https://builds.apache.org/job/Jackrabbit%20Oak/875/ to view the results.
Changes:
[reschke] OAK-6833: LuceneIndex*Test failures
Disable testLuceneWithRelativeProperty on Windows
Test results:
All tests passed
BUILD FAILURE: Jackrabbit Oak - Build # 874 - Still Failing
Posted by Apache Jenkins Server <je...@builds.apache.org>.
The Apache Jenkins build system has built Jackrabbit Oak (build #874)
Status: Still Failing
Check console output at https://builds.apache.org/job/Jackrabbit%20Oak/874/ to view the results.
Changes:
[reschke] OAK-6829: ExternalPrivateStoreIT/ExternalSharedStoreIT.testSyncBigBlob failures - disable test case on Windows
Test results:
All tests passed
BUILD FAILURE: Jackrabbit Oak - Build # 873 - Still Failing
Posted by Apache Jenkins Server <je...@builds.apache.org>.
The Apache Jenkins build system has built Jackrabbit Oak (build #873)
Status: Still Failing
Check console output at https://builds.apache.org/job/Jackrabbit%20Oak/873/ to view the results.
Changes:
[amitj] OAK-6802: Manage 'secret' property internally in S3/AzureDataStore
- Azure - Closing stream and rereading the stored value such that the only key associated with the actual stored value used
[amitj] OAK-6802: Manage 'secret' property internally in S3/AzureDataStore
- S3 - Closing stream and rereading the stored value such that the only key associated with the actual stored value used
[amitj] OAK-6550: Make BlobTracker snapshot process smarter
- Enabled snapshot after removal
- And skipping regular snapshot if happened within the last interval
Test results:
All tests passed
BUILD FAILURE: Jackrabbit Oak - Build # 872 - Still Failing
Posted by Apache Jenkins Server <je...@builds.apache.org>.
The Apache Jenkins build system has built Jackrabbit Oak (build #872)
Status: Still Failing
Check console output at https://builds.apache.org/job/Jackrabbit%20Oak/872/ to view the results.
Changes:
[chetanm] OAK-6113 - update spring to 1.5.x release
Update to Spring 1.5.7 release
Test results:
All tests passed
BUILD FAILURE: Jackrabbit Oak - Build # 871 - Still Failing
Posted by Apache Jenkins Server <je...@builds.apache.org>.
The Apache Jenkins build system has built Jackrabbit Oak (build #871)
Status: Still Failing
Check console output at https://builds.apache.org/job/Jackrabbit%20Oak/871/ to view the results.
Changes:
[chetanm] OAK-6810 - oak-pojosr tests fail with java 9
Updated to latest Groovy 2.4.12 with which build passes
[reschke] OAK-6745: update maven-war-plugin for JDK 9 compliance
[catholicon] OAK-6792: rep:facet not supported in xpath
fixing setup/tearDown issues leading to build failure
[reschke] OAK-6822: RevisionGC: measure timeToDeleteSplitDocs separately (when possible)
Test results:
2 tests failed.
FAILED: org.apache.jackrabbit.oak.segment.standby.ExternalSharedStoreIT.testSyncBigBlob
Error Message:
expected:<{ root = { ... } }> but was:<{ root : { } }>
Stack Trace:
java.lang.AssertionError: expected:<{ root = { ... } }> but was:<{ root : { } }>
FAILED: org.apache.jackrabbit.oak.segment.standby.StandbyTestIT.testSyncLoop
Error Message:
expected: org.apache.jackrabbit.oak.segment.SegmentNodeState<{ checkpoints = { ... }, root = { ... } }> but was: org.apache.jackrabbit.oak.segment.SegmentNodeState<{ checkpoints = { ... }, root = { ... } }>
Stack Trace:
java.lang.AssertionError: expected: org.apache.jackrabbit.oak.segment.SegmentNodeState<{ checkpoints = { ... }, root = { ... } }> but was: org.apache.jackrabbit.oak.segment.SegmentNodeState<{ checkpoints = { ... }, root = { ... } }>
at org.apache.jackrabbit.oak.segment.standby.StandbyTestIT.testSyncLoop(StandbyTestIT.java:126)
BUILD FAILURE: Jackrabbit Oak - Build # 870 - Still Failing
Posted by Apache Jenkins Server <je...@builds.apache.org>.
The Apache Jenkins build system has built Jackrabbit Oak (build #870)
Status: Still Failing
Check console output at https://builds.apache.org/job/Jackrabbit%20Oak/870/ to view the results.
Changes:
[tommaso] OAK-6710 - added setting for max segs per mitigation, included query evaluation in benchmark
[angela] OAK-6821 : Enforce minimum line coverage for oak-security-spi
[mreutegg] OAK-2621: Too many reads for child nodes
Add ignored test
Test results:
1 tests failed.
FAILED: org.apache.jackrabbit.oak.jcr.query.FacetTest.testFacetRetrievalRelativePropertyXPath
Error Message:
expected:<1> but was:<0>
Stack Trace:
junit.framework.AssertionFailedError: expected:<1> but was:<0>
at org.apache.jackrabbit.oak.jcr.query.FacetTest.testFacetRetrievalRelativePropertyXPath(FacetTest.java:253)
BUILD FAILURE: Jackrabbit Oak - Build # 869 - Still Failing
Posted by Apache Jenkins Server <je...@builds.apache.org>.
The Apache Jenkins build system has built Jackrabbit Oak (build #869)
Status: Still Failing
Check console output at https://builds.apache.org/job/Jackrabbit%20Oak/869/ to view the results.
Changes:
[catholicon] OAK-6792: rep:facet not supported in xpath
Not sure how I left out using XPATH. Most likely un-intended undo before
commit :-/.
[tommaso] OAK-6710 - unignoring benchmark test
[tommaso] OAK-6710 - set a segment threshold for mitigating merges
Test results:
1 tests failed.
FAILED: org.apache.jackrabbit.oak.jcr.query.FacetTest.testFacetRetrievalRelativePropertyXPath
Error Message:
expected:<1> but was:<0>
Stack Trace:
junit.framework.AssertionFailedError: expected:<1> but was:<0>
at org.apache.jackrabbit.oak.jcr.query.FacetTest.testFacetRetrievalRelativePropertyXPath(FacetTest.java:253)
BUILD FAILURE: Jackrabbit Oak - Build # 868 - Still Failing
Posted by Apache Jenkins Server <je...@builds.apache.org>.
The Apache Jenkins build system has built Jackrabbit Oak (build #868)
Status: Still Failing
Check console output at https://builds.apache.org/job/Jackrabbit%20Oak/868/ to view the results.
Changes:
[catholicon] OAK-6792: rep:facet not supported in xpath
Applying patch provided by Thomas Mueller and added 2 tests for
relative/non-relative path in oak-lucene
Test results:
2 tests failed.
FAILED: org.apache.jackrabbit.oak.jcr.query.FacetTest.testFacetRetrievalXPath
Error Message:
java.text.ParseException: Query: /(*)/*[jcr:contains(@text, 'hello OR hallo')]/(rep:facet(text)) order by jcr:path
Stack Trace:
javax.jcr.query.InvalidQueryException: java.text.ParseException: Query: /(*)/*[jcr:contains(@text, 'hello OR hallo')]/(rep:facet(text)) order by jcr:path
at org.apache.jackrabbit.oak.jcr.query.FacetTest.testFacetRetrievalXPath(FacetTest.java:172)
Caused by: java.text.ParseException: Query: /(*)/*[jcr:contains(@text, 'hello OR hallo')]/(rep:facet(text)) order by jcr:path
at org.apache.jackrabbit.oak.jcr.query.FacetTest.testFacetRetrievalXPath(FacetTest.java:172)
FAILED: org.apache.jackrabbit.oak.jcr.query.FacetTest.testFacetRetrievalRelativePropertyXPath
Error Message:
expected:<1> but was:<0>
Stack Trace:
junit.framework.AssertionFailedError: expected:<1> but was:<0>
at org.apache.jackrabbit.oak.jcr.query.FacetTest.testFacetRetrievalRelativePropertyXPath(FacetTest.java:253)
BUILD FAILURE: Jackrabbit Oak - Build # 867 - Still Failing
Posted by Apache Jenkins Server <je...@builds.apache.org>.
The Apache Jenkins build system has built Jackrabbit Oak (build #867)
Status: Still Failing
Check console output at https://builds.apache.org/job/Jackrabbit%20Oak/867/ to view the results.
Changes:
[reschke] OAK-1629: behavior for ultra-long node names (not paths)
add test for creation that either expects success or a ContraintViolationException (currently ignored)
[chetanm] OAK-6819 - Move Configuration out of DocumentNodeStoreService
Test results:
All tests passed
BUILD FAILURE: Jackrabbit Oak - Build # 866 - Still Failing
Posted by Apache Jenkins Server <je...@builds.apache.org>.
The Apache Jenkins build system has built Jackrabbit Oak (build #866)
Status: Still Failing
Check console output at https://builds.apache.org/job/Jackrabbit%20Oak/866/ to view the results.
Changes:
[stillalex] OAK-6318 Refactor oak.spi.security into a separate module/bundle
[reschke] OAK-6789: RDB: RevisionGC performance on Oracle
Part 2: change JDBC code to use a batch of single DELETEs.
[tomekr] OAK-6817: Don't create metatype for MountInfoProviderService
Test results:
All tests passed
BUILD FAILURE: Jackrabbit Oak - Build # 865 - Still Failing
Posted by Apache Jenkins Server <je...@builds.apache.org>.
The Apache Jenkins build system has built Jackrabbit Oak (build #865)
Status: Still Failing
Check console output at https://builds.apache.org/job/Jackrabbit%20Oak/865/ to view the results.
Changes:
[amitj] OAK-5983: BlobGC should log the amount of space reclaimed after GC run is done
- Fixing some test failures
Test results:
All tests passed