You are viewing a plain text version of this content. The canonical link for it is here.
Posted to dev@pdfbox.apache.org by Apache Jenkins Server <je...@builds.apache.org> on 2013/06/17 12:19:31 UTC
Build failed in Jenkins: PDFBox-trunk #667
See <https://builds.apache.org/job/PDFBox-trunk/667/changes>
Changes:
[lehmi] update doap file
------------------------------------------
[...truncated 269 lines...]
Running org.apache.xmpbox.schema.AdobePDFErrorsTest
Tests run: 3, Failures: 0, Errors: 0, Skipped: 0, Time elapsed: 0.017 sec
Running org.apache.xmpbox.schema.BasicJobTicketSchemaTest
Tests run: 3, Failures: 0, Errors: 0, Skipped: 0, Time elapsed: 0.244 sec
Running org.apache.xmpbox.schema.PDFAIdentificationOthersTest
Tests run: 3, Failures: 0, Errors: 0, Skipped: 0, Time elapsed: 0.009 sec
Running org.apache.xmpbox.schema.XMPSchemaTest
Tests run: 12, Failures: 0, Errors: 0, Skipped: 0, Time elapsed: 0.052 sec
Running org.apache.xmpbox.schema.DublinCoreTest
Tests run: 60, Failures: 0, Errors: 0, Skipped: 0, Time elapsed: 0.551 sec
Running org.apache.xmpbox.schema.XmpRightsSchemaTest
Tests run: 10, Failures: 0, Errors: 0, Skipped: 0, Time elapsed: 0.054 sec
Running org.apache.xmpbox.schema.AdobePDFTest
Tests run: 12, Failures: 0, Errors: 0, Skipped: 0, Time elapsed: 0.032 sec
Running org.apache.xmpbox.schema.PDFAIdentificationTest
Tests run: 6, Failures: 0, Errors: 0, Skipped: 0, Time elapsed: 0.014 sec
Running org.apache.xmpbox.schema.PhotoshopSchemaTest
Tests run: 90, Failures: 0, Errors: 0, Skipped: 0, Time elapsed: 0.449 sec
Running org.apache.xmpbox.SaveMetadataHelperTest
Tests run: 2, Failures: 0, Errors: 0, Skipped: 0, Time elapsed: 0.001 sec
Running org.apache.xmpbox.TestXMPWithDefinedSchemas
Tests run: 5, Failures: 0, Errors: 0, Skipped: 0, Time elapsed: 0.04 sec
Running org.apache.xmpbox.XMPMetaDataTest
Tests run: 4, Failures: 0, Errors: 0, Skipped: 0, Time elapsed: 0.009 sec
Running org.apache.xmpbox.DoubleSameTypeSchemaTest
Tests run: 1, Failures: 0, Errors: 0, Skipped: 0, Time elapsed: 0.001 sec
Running org.apache.xmpbox.type.TestResourceRefType
Tests run: 60, Failures: 0, Errors: 0, Skipped: 0, Time elapsed: 0.195 sec
Running org.apache.xmpbox.type.AttributeTest
Tests run: 2, Failures: 0, Errors: 0, Skipped: 0, Time elapsed: 0 sec
Running org.apache.xmpbox.type.TestVersionType
Tests run: 4, Failures: 0, Errors: 0, Skipped: 0, Time elapsed: 0.009 sec
Running org.apache.xmpbox.type.TestJobType
Tests run: 12, Failures: 0, Errors: 0, Skipped: 0, Time elapsed: 0.034 sec
Running org.apache.xmpbox.type.TestResourceEventType
Tests run: 24, Failures: 0, Errors: 0, Skipped: 0, Time elapsed: 0.068 sec
Running org.apache.xmpbox.type.TestSimpleMetadataProperties
Tests run: 10, Failures: 0, Errors: 0, Skipped: 0, Time elapsed: 0.021 sec
Running org.apache.xmpbox.type.TestDerivedType
Tests run: 11, Failures: 0, Errors: 0, Skipped: 0, Time elapsed: 0.024 sec
Running org.apache.xmpbox.type.TestAbstractStructuredType
Tests run: 5, Failures: 0, Errors: 0, Skipped: 0, Time elapsed: 0.01 sec
Running org.apache.xmpbox.type.TestLayerType
Tests run: 8, Failures: 0, Errors: 0, Skipped: 0, Time elapsed: 0.02 sec
Running org.apache.xmpbox.type.TestThumbnailType
Tests run: 16, Failures: 0, Errors: 0, Skipped: 0, Time elapsed: 0.073 sec
Results :
Tests run: 424, Failures: 0, Errors: 0, Skipped: 0
[JENKINS] Recording test results
[INFO]
[INFO] --- maven-bundle-plugin:2.3.7:bundle (default-bundle) @ xmpbox ---
[INFO]
[INFO] --- maven-site-plugin:3.0:attach-descriptor (attach-descriptor) @ xmpbox ---
[INFO]
[INFO] --- apache-rat-plugin:0.6:check (default) @ xmpbox ---[INFO] Exclude: release.properties
[INFO]
[INFO] --- maven-install-plugin:2.3.1:install (default-install) @ xmpbox ---[INFO] Installing <https://builds.apache.org/job/PDFBox-trunk/ws/trunk/xmpbox/target/xmpbox-2.0.0-SNAPSHOT.jar> to /export/home/hudson/hudson-slave/maven-repositories/0/org/apache/pdfbox/xmpbox/2.0.0-SNAPSHOT/xmpbox-2.0.0-SNAPSHOT.jar
[INFO] Installing <https://builds.apache.org/job/PDFBox-trunk/ws/trunk/xmpbox/pom.xml> to /export/home/hudson/hudson-slave/maven-repositories/0/org/apache/pdfbox/xmpbox/2.0.0-SNAPSHOT/xmpbox-2.0.0-SNAPSHOT.pom
[INFO] [INFO] Installing org/apache/pdfbox/xmpbox/2.0.0-SNAPSHOT/xmpbox-2.0.0-SNAPSHOT.jar
[INFO] --- maven-bundle-plugin:2.3.7:install (default-install) @ xmpbox ---[INFO] Writing OBR metadata
[INFO]
[INFO] --- maven-deploy-plugin:2.6:deploy (default-deploy) @ xmpbox ---Downloading: https://repository.apache.org/content/repositories/snapshots/org/apache/pdfbox/xmpbox/2.0.0-SNAPSHOT/maven-metadata.xml
Downloaded: https://repository.apache.org/content/repositories/snapshots/org/apache/pdfbox/xmpbox/2.0.0-SNAPSHOT/maven-metadata.xml (776 B at 0.7 KB/sec)
Uploading: https://repository.apache.org/content/repositories/snapshots/org/apache/pdfbox/xmpbox/2.0.0-SNAPSHOT/xmpbox-2.0.0-20130617.101351-24.jar
Uploaded: https://repository.apache.org/content/repositories/snapshots/org/apache/pdfbox/xmpbox/2.0.0-SNAPSHOT/xmpbox-2.0.0-20130617.101351-24.jar (116 KB at 53.4 KB/sec)
Uploading: https://repository.apache.org/content/repositories/snapshots/org/apache/pdfbox/xmpbox/2.0.0-SNAPSHOT/xmpbox-2.0.0-20130617.101351-24.pom
Uploaded: https://repository.apache.org/content/repositories/snapshots/org/apache/pdfbox/xmpbox/2.0.0-SNAPSHOT/xmpbox-2.0.0-20130617.101351-24.pom (4 KB at 2.1 KB/sec)
Downloading: https://repository.apache.org/content/repositories/snapshots/org/apache/pdfbox/xmpbox/maven-metadata.xml
Downloaded: https://repository.apache.org/content/repositories/snapshots/org/apache/pdfbox/xmpbox/maven-metadata.xml (463 B at 0.4 KB/sec)
Uploading: https://repository.apache.org/content/repositories/snapshots/org/apache/pdfbox/xmpbox/2.0.0-SNAPSHOT/maven-metadata.xml
Uploaded: https://repository.apache.org/content/repositories/snapshots/org/apache/pdfbox/xmpbox/2.0.0-SNAPSHOT/maven-metadata.xml (776 B at 0.5 KB/sec)
Uploading: https://repository.apache.org/content/repositories/snapshots/org/apache/pdfbox/xmpbox/maven-metadata.xml
Uploaded: https://repository.apache.org/content/repositories/snapshots/org/apache/pdfbox/xmpbox/maven-metadata.xml (463 B at 0.3 KB/sec)
[INFO]
[INFO] --- maven-bundle-plugin:2.3.7:deploy (default-deploy) @ xmpbox ---[INFO] Remote OBR update disabled (enable with -DremoteOBR)
[INFO]
[INFO] ------------------------------------------------------------------------
[INFO] Building Apache PDFBox 2.0.0-SNAPSHOT
[INFO] ------------------------------------------------------------------------[INFO] Deleting <https://builds.apache.org/job/PDFBox-trunk/ws/trunk/pdfbox/target>
[INFO]
[INFO] --- maven-clean-plugin:2.4.1:clean (default-clean) @ pdfbox ---
[TASKS] Scanning folder '<https://builds.apache.org/job/PDFBox-trunk/ws/trunk/pdfbox'> for files matching the pattern '**/*.java' - excludes:
[TASKS] Found 551 files to scan for tasks
Found 150 open tasks.
[TASKS] Computing warning deltas based on reference build #665
[INFO]
[INFO] --- maven-remote-resources-plugin:1.2.1:process (default) @ pdfbox ---
[INFO]
[INFO] --- maven-antrun-plugin:1.6:run (default) @ pdfbox ---
[INFO] Executing tasks
main:
find.adobefiles:
get.adobefiles:
testexist:
downloadfile:
[unjar] Expanding: <https://builds.apache.org/job/PDFBox-trunk/ws/trunk/pdfbox/download/pcfi-2010.08.09.jar> into <https://builds.apache.org/job/PDFBox-trunk/ws/trunk/pdfbox/target/classes/org/apache/pdfbox/resources/afm>
[unjar] Expanding: <https://builds.apache.org/job/PDFBox-trunk/ws/trunk/pdfbox/download/pcfi-2010.08.09.jar> into <https://builds.apache.org/job/PDFBox-trunk/ws/trunk/pdfbox/target/classes/org/apache/pdfbox/resources>
[INFO] Executed tasks
[INFO]
[INFO] --- maven-resources-plugin:2.5:resources (default-resources) @ pdfbox ---[debug] execute contextualize
[INFO] Using 'ISO-8859-1' encoding to copy filtered resources.
[INFO] Copying 191 resources
[INFO] Copying 3 resources
[INFO]
[INFO] --- maven-compiler-plugin:2.3.2:compile (default-compile) @ pdfbox ---
[INFO] Compiling 507 source files to <https://builds.apache.org/job/PDFBox-trunk/ws/trunk/pdfbox/target/classes>
[INFO]
[INFO] --- maven-resources-plugin:2.5:testResources (default-testResources) @ pdfbox ---[debug] execute contextualize
[INFO] Using 'ISO-8859-1' encoding to copy filtered resources.
[INFO] Copying 79 resources
[INFO] Copying 3 resources
[INFO]
[INFO] --- maven-compiler-plugin:2.3.2:testCompile (default-testCompile) @ pdfbox ---
[INFO] Compiling 44 source files to <https://builds.apache.org/job/PDFBox-trunk/ws/trunk/pdfbox/target/test-classes>
[INFO]
[INFO] --- maven-surefire-plugin:2.9:test (default-test) @ pdfbox ---[INFO] Surefire report directory: <https://builds.apache.org/job/PDFBox-trunk/ws/trunk/pdfbox/target/surefire-reports>
-------------------------------------------------------
T E S T S
-------------------------------------------------------
Results :
Tests run: 0, Failures: 0, Errors: 0, Skipped: 0
[JENKINS] Recording test results
[INFO] ------------------------------------------------------------------------
[INFO] Reactor Summary:
[INFO]
[INFO] PDFBox parent ..................................... SUCCESS [3:50.404s]
[INFO] Apache FontBox .................................... SUCCESS [2:12.355s]
[INFO] Apache JempBox .................................... SUCCESS [46.364s]
[INFO] Apache XmpBox ..................................... SUCCESS [1:09.465s]
[INFO] Apache PDFBox ..................................... FAILURE [3:03.473s]
[INFO] Apache Preflight .................................. SKIPPED
[INFO] Apache Preflight application ...................... SKIPPED
[INFO] Apache PDFBox for Lucene .......................... SKIPPED
[INFO] Apache PDFBox for Ant ............................. SKIPPED
[INFO] Apache PDFBox webapp .............................. SKIPPED
[INFO] Apache PDFBox application ......................... SKIPPED
[INFO] Apache PDFBox examples ............................ SKIPPED
[INFO] PDFBox reactor .................................... SKIPPED
[INFO] ------------------------------------------------------------------------
[INFO] BUILD FAILURE
[INFO] ------------------------------------------------------------------------
[INFO] Total time: 11:37.177s
[INFO] Finished at: Mon Jun 17 10:17:16 GMT+00:00 2013
[INFO] Final Memory: 49M/227M
[INFO] ------------------------------------------------------------------------
[JENKINS] Archiving <https://builds.apache.org/job/PDFBox-trunk/ws/trunk/parent/pom.xml> to /home/hudson/hudson/jobs/PDFBox-trunk/modules/org.apache.pdfbox$pdfbox-parent/builds/2013-06-17_10-03-14/archive/org.apache.pdfbox/pdfbox-parent/2.0.0-SNAPSHOT/pdfbox-parent-2.0.0-SNAPSHOT.pom
[JENKINS] Archiving <https://builds.apache.org/job/PDFBox-trunk/ws/trunk/war/pom.xml> to /home/hudson/hudson/jobs/PDFBox-trunk/modules/org.apache.pdfbox$pdfbox-war/builds/2013-06-17_10-03-25/archive/org.apache.pdfbox/pdfbox-war/2.0.0-SNAPSHOT/pdfbox-war-2.0.0-SNAPSHOT.pom
[JENKINS] Archiving <https://builds.apache.org/job/PDFBox-trunk/ws/trunk/examples/pom.xml> to /home/hudson/hudson/jobs/PDFBox-trunk/modules/org.apache.pdfbox$pdfbox-examples/builds/2013-06-17_10-03-27/archive/org.apache.pdfbox/pdfbox-examples/2.0.0-SNAPSHOT/pdfbox-examples-2.0.0-SNAPSHOT.pom
[JENKINS] Archiving <https://builds.apache.org/job/PDFBox-trunk/ws/trunk/pom.xml> to /home/hudson/hudson/jobs/PDFBox-trunk/modules/org.apache.pdfbox$pdfbox-reactor/builds/2013-06-17_10-03-13/archive/org.apache.pdfbox/pdfbox-reactor/2.0.0-SNAPSHOT/pdfbox-reactor-2.0.0-SNAPSHOT.pom
[JENKINS] Archiving <https://builds.apache.org/job/PDFBox-trunk/ws/trunk/preflight-app/pom.xml> to /home/hudson/hudson/jobs/PDFBox-trunk/modules/org.apache.pdfbox$preflight-app/builds/2013-06-17_10-03-22/archive/org.apache.pdfbox/preflight-app/2.0.0-SNAPSHOT/preflight-app-2.0.0-SNAPSHOT.pom
[JENKINS] Archiving <https://builds.apache.org/job/PDFBox-trunk/ws/trunk/xmpbox/pom.xml> to /home/hudson/hudson/jobs/PDFBox-trunk/modules/org.apache.pdfbox$xmpbox/builds/2013-06-17_10-03-18/archive/org.apache.pdfbox/xmpbox/2.0.0-SNAPSHOT/xmpbox-2.0.0-SNAPSHOT.pom
[JENKINS] Archiving <https://builds.apache.org/job/PDFBox-trunk/ws/trunk/xmpbox/target/xmpbox-2.0.0-SNAPSHOT.jar> to /home/hudson/hudson/jobs/PDFBox-trunk/modules/org.apache.pdfbox$xmpbox/builds/2013-06-17_10-03-18/archive/org.apache.pdfbox/xmpbox/2.0.0-20130617.101351-24/xmpbox-2.0.0-20130617.101351-24.jar
[JENKINS] Archiving <https://builds.apache.org/job/PDFBox-trunk/ws/trunk/jempbox/pom.xml> to /home/hudson/hudson/jobs/PDFBox-trunk/modules/org.apache.pdfbox$jempbox/builds/2013-06-17_10-03-17/archive/org.apache.pdfbox/jempbox/2.0.0-SNAPSHOT/jempbox-2.0.0-SNAPSHOT.pom
[JENKINS] Archiving <https://builds.apache.org/job/PDFBox-trunk/ws/trunk/jempbox/target/jempbox-2.0.0-SNAPSHOT.jar> to /home/hudson/hudson/jobs/PDFBox-trunk/modules/org.apache.pdfbox$jempbox/builds/2013-06-17_10-03-17/archive/org.apache.pdfbox/jempbox/2.0.0-20130617.101241-24/jempbox-2.0.0-20130617.101241-24.jar
[JENKINS] Archiving <https://builds.apache.org/job/PDFBox-trunk/ws/trunk/fontbox/pom.xml> to /home/hudson/hudson/jobs/PDFBox-trunk/modules/org.apache.pdfbox$fontbox/builds/2013-06-17_10-03-15/archive/org.apache.pdfbox/fontbox/2.0.0-SNAPSHOT/fontbox-2.0.0-SNAPSHOT.pom
[JENKINS] Archiving <https://builds.apache.org/job/PDFBox-trunk/ws/trunk/fontbox/target/fontbox-2.0.0-SNAPSHOT.jar> to /home/hudson/hudson/jobs/PDFBox-trunk/modules/org.apache.pdfbox$fontbox/builds/2013-06-17_10-03-15/archive/org.apache.pdfbox/fontbox/2.0.0-20130617.101152-24/fontbox-2.0.0-20130617.101152-24.jar
[JENKINS] Archiving <https://builds.apache.org/job/PDFBox-trunk/ws/trunk/lucene/pom.xml> to /home/hudson/hudson/jobs/PDFBox-trunk/modules/org.apache.pdfbox$pdfbox-lucene/builds/2013-06-17_10-03-23/archive/org.apache.pdfbox/pdfbox-lucene/2.0.0-SNAPSHOT/pdfbox-lucene-2.0.0-SNAPSHOT.pom
[JENKINS] Archiving <https://builds.apache.org/job/PDFBox-trunk/ws/trunk/preflight/pom.xml> to /home/hudson/hudson/jobs/PDFBox-trunk/modules/org.apache.pdfbox$preflight/builds/2013-06-17_10-03-21/archive/org.apache.pdfbox/preflight/2.0.0-SNAPSHOT/preflight-2.0.0-SNAPSHOT.pom
[JENKINS] Archiving <https://builds.apache.org/job/PDFBox-trunk/ws/trunk/app/pom.xml> to /home/hudson/hudson/jobs/PDFBox-trunk/modules/org.apache.pdfbox$pdfbox-app/builds/2013-06-17_10-03-26/archive/org.apache.pdfbox/pdfbox-app/2.0.0-SNAPSHOT/pdfbox-app-2.0.0-SNAPSHOT.pom
[JENKINS] Archiving <https://builds.apache.org/job/PDFBox-trunk/ws/trunk/ant/pom.xml> to /home/hudson/hudson/jobs/PDFBox-trunk/modules/org.apache.pdfbox$pdfbox-ant/builds/2013-06-17_10-03-24/archive/org.apache.pdfbox/pdfbox-ant/2.0.0-SNAPSHOT/pdfbox-ant-2.0.0-SNAPSHOT.pom
[JENKINS] Archiving <https://builds.apache.org/job/PDFBox-trunk/ws/trunk/pdfbox/pom.xml> to /home/hudson/hudson/jobs/PDFBox-trunk/modules/org.apache.pdfbox$pdfbox/builds/2013-06-17_10-03-20/archive/org.apache.pdfbox/pdfbox/2.0.0-SNAPSHOT/pdfbox-2.0.0-SNAPSHOT.pom
Waiting for Jenkins to finish collecting data
mavenExecutionResult exceptions not empty
message : Failed to execute goal org.apache.maven.plugins:maven-surefire-plugin:2.9:test (default-test) on project pdfbox: Error while executing forked tests.; nested exception is java.io.IOException: Cannot run program "/bin/sh" (in directory "<https://builds.apache.org/job/PDFBox-trunk/ws/trunk/pdfbox")>: error=12, Not enough space
cause : Error while executing forked tests.; nested exception is java.io.IOException: Cannot run program "/bin/sh" (in directory "<https://builds.apache.org/job/PDFBox-trunk/ws/trunk/pdfbox")>: error=12, Not enough space
Stack trace :
org.apache.maven.lifecycle.LifecycleExecutionException: Failed to execute goal org.apache.maven.plugins:maven-surefire-plugin:2.9:test (default-test) on project pdfbox: Error while executing forked tests.; nested exception is java.io.IOException: Cannot run program "/bin/sh" (in directory "<https://builds.apache.org/job/PDFBox-trunk/ws/trunk/pdfbox")>: error=12, Not enough space
at org.apache.maven.lifecycle.internal.MojoExecutor.execute(MojoExecutor.java:217)
at org.apache.maven.lifecycle.internal.MojoExecutor.execute(MojoExecutor.java:153)
at org.apache.maven.lifecycle.internal.MojoExecutor.execute(MojoExecutor.java:145)
at org.apache.maven.lifecycle.internal.LifecycleModuleBuilder.buildProject(LifecycleModuleBuilder.java:84)
at org.apache.maven.lifecycle.internal.LifecycleModuleBuilder.buildProject(LifecycleModuleBuilder.java:59)
at org.apache.maven.lifecycle.internal.LifecycleStarter.singleThreadedBuild(LifecycleStarter.java:183)
at org.apache.maven.lifecycle.internal.LifecycleStarter.execute(LifecycleStarter.java:161)
at org.apache.maven.DefaultMaven.doExecute(DefaultMaven.java:320)
at org.apache.maven.DefaultMaven.execute(DefaultMaven.java:156)
at org.jvnet.hudson.maven3.launcher.Maven3Launcher.main(Maven3Launcher.java:79)
at sun.reflect.NativeMethodAccessorImpl.invoke0(Native Method)
at sun.reflect.NativeMethodAccessorImpl.invoke(NativeMethodAccessorImpl.java:39)
at sun.reflect.DelegatingMethodAccessorImpl.invoke(DelegatingMethodAccessorImpl.java:25)
at java.lang.reflect.Method.invoke(Method.java:597)
at org.codehaus.plexus.classworlds.launcher.Launcher.launchStandard(Launcher.java:329)
at org.codehaus.plexus.classworlds.launcher.Launcher.launch(Launcher.java:239)
at org.jvnet.hudson.maven3.agent.Maven3Main.launch(Maven3Main.java:158)
at hudson.maven.Maven3Builder.call(Maven3Builder.java:100)
at hudson.maven.Maven3Builder.call(Maven3Builder.java:66)
at hudson.remoting.UserRequest.perform(UserRequest.java:118)
at hudson.remoting.UserRequest.perform(UserRequest.java:48)
at hudson.remoting.Request$2.run(Request.java:326)
at hudson.remoting.InterceptingExecutorService$1.call(InterceptingExecutorService.java:72)
at java.util.concurrent.FutureTask$Sync.innerRun(FutureTask.java:303)
at java.util.concurrent.FutureTask.run(FutureTask.java:138)
at java.util.concurrent.ThreadPoolExecutor$Worker.runTask(ThreadPoolExecutor.java:886)
at java.util.concurrent.ThreadPoolExecutor$Worker.run(ThreadPoolExecutor.java:908)
at java.lang.Thread.run(Thread.java:662)
Caused by: org.apache.maven.plugin.MojoExecutionException: Error while executing forked tests.; nested exception is java.io.IOException: Cannot run program "/bin/sh" (in directory "<https://builds.apache.org/job/PDFBox-trunk/ws/trunk/pdfbox")>: error=12, Not enough space
at org.apache.maven.plugin.surefire.SurefirePlugin.assertNoException(SurefirePlugin.java:614)
at org.apache.maven.plugin.surefire.SurefirePlugin.handleSummary(SurefirePlugin.java:603)
at org.apache.maven.plugin.surefire.AbstractSurefireMojo.executeAfterPreconditionsChecked(AbstractSurefireMojo.java:136)
at org.apache.maven.plugin.surefire.AbstractSurefireMojo.execute(AbstractSurefireMojo.java:97)
at org.apache.maven.plugin.DefaultBuildPluginManager.executeMojo(DefaultBuildPluginManager.java:101)
at org.apache.maven.lifecycle.internal.MojoExecutor.execute(MojoExecutor.java:209)
... 27 more
Caused by: org.apache.maven.surefire.booter.SurefireBooterForkException: Error while executing forked tests.; nested exception is java.io.IOException: Cannot run program "/bin/sh" (in directory "<https://builds.apache.org/job/PDFBox-trunk/ws/trunk/pdfbox")>: error=12, Not enough space
at org.apache.maven.plugin.surefire.booterclient.ForkStarter.fork(ForkStarter.java:206)
at org.apache.maven.plugin.surefire.booterclient.ForkStarter.run(ForkStarter.java:98)
at org.apache.maven.plugin.surefire.AbstractSurefireMojo.executeProvider(AbstractSurefireMojo.java:199)
at org.apache.maven.plugin.surefire.AbstractSurefireMojo.executeAllProviders(AbstractSurefireMojo.java:176)
at org.apache.maven.plugin.surefire.AbstractSurefireMojo.executeAfterPreconditionsChecked(AbstractSurefireMojo.java:134)
... 30 more
Caused by: java.io.IOException: Cannot run program "/bin/sh" (in directory "<https://builds.apache.org/job/PDFBox-trunk/ws/trunk/pdfbox")>: error=12, Not enough space
at java.lang.ProcessBuilder.start(ProcessBuilder.java:460)
at java.lang.Runtime.exec(Runtime.java:593)
at org.codehaus.plexus.util.cli.Commandline.execute(Commandline.java:651)
at org.codehaus.plexus.util.cli.CommandLineUtils.executeCommandLine(CommandLineUtils.java:119)
at org.codehaus.plexus.util.cli.CommandLineUtils.executeCommandLine(CommandLineUtils.java:88)
at org.apache.maven.plugin.surefire.booterclient.ForkStarter.fork(ForkStarter.java:191)
... 34 more
Caused by: java.io.IOException: error=12, Not enough space
at java.lang.UNIXProcess.forkAndExec(Native Method)
at java.lang.UNIXProcess.<init>(UNIXProcess.java:53)
at java.lang.ProcessImpl.start(ProcessImpl.java:65)
at java.lang.ProcessBuilder.start(ProcessBuilder.java:453)
... 39 more
Sending e-mails to: dev@pdfbox.apache.org
channel stopped
Archiving artifacts