You are viewing a plain text version of this content. The canonical link for it is here.
Posted to commits@myfaces.apache.org by Apache Jenkins Server <je...@builds.apache.org> on 2012/05/31 22:35:40 UTC
Build failed in Jenkins: Trinidad Core Trunk (snapshot) #3
See <https://builds.apache.org/job/Trinidad%20Core%20Trunk%20(snapshot)/3/>
------------------------------------------
[...truncated 6209 lines...]
[INFO] ------------------------------------------------------------------------
[INFO]
[INFO] --- maven-clean-plugin:2.4.1:clean (default-clean) @ maven-xrts-plugin ---
[INFO]
[INFO] --- maven-enforcer-plugin:1.0-beta-1:enforce (enforce-versions) @ maven-xrts-plugin ---
[INFO]
[INFO] --- maven-plugin-plugin:2.2:descriptor (default-descriptor) @ maven-xrts-plugin ---
[INFO] Using 2 extractors.
[INFO] Applying extractor for language: java
[INFO] Extractor for language: java found 2 mojo descriptors.
[INFO] Applying extractor for language: bsh
[INFO] Extractor for language: bsh found 0 mojo descriptors.
[INFO]
[INFO] --- maven-remote-resources-plugin:1.1:process (default) @ maven-xrts-plugin ---
[INFO]
[INFO] --- maven-resources-plugin:2.4.3:resources (default-resources) @ maven-xrts-plugin ---
[INFO] Using 'UTF-8' encoding to copy filtered resources.
[INFO] Copying 0 resource
[INFO] Copying 2 resources
[INFO]
[INFO] --- maven-compiler-plugin:2.3.1:compile (default-compile) @ maven-xrts-plugin ---
[INFO] Compiling 8 source files to <https://builds.apache.org/job/Trinidad%20Core%20Trunk%20(snapshot)/ws/plugins/maven-xrts-plugin/target/classes>
[WARNING] no such file or directory
<https://builds.apache.org/job/Trinidad%20Core%20Trunk%20(snapshot)/ws/plugins/maven-xrts-plugin/src/main/java/org/apache/myfaces/trinidadbuild/plugin/xrts/XRTSParser.java>:[27,18] [deprecation] org.xml.sax.AttributeList in org.xml.sax has been deprecated
[WARNING] <https://builds.apache.org/job/Trinidad%20Core%20Trunk%20(snapshot)/ws/plugins/maven-xrts-plugin/src/main/java/org/apache/myfaces/trinidadbuild/plugin/xrts/XRTSParser.java>:[28,18] [deprecation] org.xml.sax.HandlerBase in org.xml.sax has been deprecated
[WARNING] <https://builds.apache.org/job/Trinidad%20Core%20Trunk%20(snapshot)/ws/plugins/maven-xrts-plugin/src/main/java/org/apache/myfaces/trinidadbuild/plugin/xrts/XRTSParser.java>:[36,31] [deprecation] org.xml.sax.HandlerBase in org.xml.sax has been deprecated
[WARNING] <https://builds.apache.org/job/Trinidad%20Core%20Trunk%20(snapshot)/ws/plugins/maven-xrts-plugin/src/main/java/org/apache/myfaces/trinidadbuild/plugin/xrts/XRTSParser.java>:[100,40] [deprecation] org.xml.sax.AttributeList in org.xml.sax has been deprecated
[WARNING] <https://builds.apache.org/job/Trinidad%20Core%20Trunk%20(snapshot)/ws/plugins/maven-xrts-plugin/src/main/java/org/apache/myfaces/trinidadbuild/plugin/xrts/XRTSGenerator.java>:[26,18] [deprecation] org.xml.sax.Parser in org.xml.sax has been deprecated
[WARNING] <https://builds.apache.org/job/Trinidad%20Core%20Trunk%20(snapshot)/ws/plugins/maven-xrts-plugin/src/main/java/org/apache/myfaces/trinidadbuild/plugin/xrts/AbstractGenerateSourcesMojo.java>:[100,25] [unchecked] unchecked call to LinkedList(java.util.Collection<? extends E>) as a member of the raw type java.util.LinkedList
[WARNING] <https://builds.apache.org/job/Trinidad%20Core%20Trunk%20(snapshot)/ws/plugins/maven-xrts-plugin/src/main/java/org/apache/myfaces/trinidadbuild/plugin/xrts/AbstractGenerateSourcesMojo.java>:[133,22] [unchecked] unchecked call to put(K,V) as a member of the raw type java.util.Map
[WARNING] <https://builds.apache.org/job/Trinidad%20Core%20Trunk%20(snapshot)/ws/plugins/maven-xrts-plugin/src/main/java/org/apache/myfaces/trinidadbuild/plugin/xrts/AbstractGenerateSourcesMojo.java>:[134,22] [unchecked] unchecked call to put(K,V) as a member of the raw type java.util.Map
[WARNING] <https://builds.apache.org/job/Trinidad%20Core%20Trunk%20(snapshot)/ws/plugins/maven-xrts-plugin/src/main/java/org/apache/myfaces/trinidadbuild/plugin/xrts/AbstractGenerateSourcesMojo.java>:[135,22] [unchecked] unchecked call to put(K,V) as a member of the raw type java.util.Map
[WARNING] <https://builds.apache.org/job/Trinidad%20Core%20Trunk%20(snapshot)/ws/plugins/maven-xrts-plugin/src/main/java/org/apache/myfaces/trinidadbuild/plugin/xrts/AbstractGenerateSourcesMojo.java>:[136,22] [unchecked] unchecked call to put(K,V) as a member of the raw type java.util.Map
[WARNING] <https://builds.apache.org/job/Trinidad%20Core%20Trunk%20(snapshot)/ws/plugins/maven-xrts-plugin/src/main/java/org/apache/myfaces/trinidadbuild/plugin/xrts/AbstractGenerateSourcesMojo.java>:[137,22] [unchecked] unchecked call to put(K,V) as a member of the raw type java.util.Map
[WARNING] <https://builds.apache.org/job/Trinidad%20Core%20Trunk%20(snapshot)/ws/plugins/maven-xrts-plugin/src/main/java/org/apache/myfaces/trinidadbuild/plugin/xrts/AbstractGenerateSourcesMojo.java>:[140,57] [deprecation] toURL() in java.io.File has been deprecated
[INFO]
[INFO] --- maven-resources-plugin:2.4.3:testResources (default-testResources) @ maven-xrts-plugin ---
[INFO] Using 'UTF-8' encoding to copy filtered resources.
[INFO] skip non existing resourceDirectory <https://builds.apache.org/job/Trinidad%20Core%20Trunk%20(snapshot)/ws/plugins/maven-xrts-plugin/src/test/resources>
[INFO] Copying 2 resources
[INFO]
[INFO] --- maven-compiler-plugin:2.3.1:testCompile (default-testCompile) @ maven-xrts-plugin ---
[INFO] No sources to compile
[INFO]
[INFO] --- maven-surefire-plugin:2.5:test (default-test) @ maven-xrts-plugin ---
[INFO] Surefire report directory: <https://builds.apache.org/job/Trinidad%20Core%20Trunk%20(snapshot)/ws/plugins/maven-xrts-plugin/target/surefire-reports>
-------------------------------------------------------
T E S T S
-------------------------------------------------------
There are no tests to run.
Results :
Tests run: 0, Failures: 0, Errors: 0, Skipped: 0
[INFO]
[INFO] --- maven-jar-plugin:2.3.1:jar (default-jar) @ maven-xrts-plugin ---
[INFO] Building jar: <https://builds.apache.org/job/Trinidad%20Core%20Trunk%20(snapshot)/ws/plugins/maven-xrts-plugin/target/maven-xrts-plugin-2.0.8-SNAPSHOT.jar>
[INFO]
[INFO] --- maven-plugin-plugin:2.2:addPluginArtifactMetadata (default-addPluginArtifactMetadata) @ maven-xrts-plugin ---
[INFO]
[INFO] --- maven-install-plugin:2.3:install (default-install) @ maven-xrts-plugin ---
[INFO] Installing <https://builds.apache.org/job/Trinidad%20Core%20Trunk%20(snapshot)/ws/plugins/maven-xrts-plugin/target/maven-xrts-plugin-2.0.8-SNAPSHOT.jar> to /home/jenkins/.m2/repository/org/apache/myfaces/trinidadbuild/maven-xrts-plugin/2.0.8-SNAPSHOT/maven-xrts-plugin-2.0.8-SNAPSHOT.jar
[INFO] Installing <https://builds.apache.org/job/Trinidad%20Core%20Trunk%20(snapshot)/ws/plugins/maven-xrts-plugin/pom.xml> to /home/jenkins/.m2/repository/org/apache/myfaces/trinidadbuild/maven-xrts-plugin/2.0.8-SNAPSHOT/maven-xrts-plugin-2.0.8-SNAPSHOT.pom
[INFO]
[INFO] ------------------------------------------------------------------------
[INFO] Building Apache Trinidad Maven Tag Documentation Report 2.0.8-SNAPSHOT
[INFO] ------------------------------------------------------------------------
[INFO]
[INFO] --- maven-clean-plugin:2.4.1:clean (default-clean) @ maven-tagdoc-plugin ---
[INFO]
[INFO] --- maven-enforcer-plugin:1.0-beta-1:enforce (enforce-versions) @ maven-tagdoc-plugin ---
[INFO]
[INFO] --- maven-plugin-plugin:2.5.1:descriptor (default-descriptor) @ maven-tagdoc-plugin ---
[INFO] Using 'UTF-8' encoding to read mojo metadata.
[INFO] Applying mojo extractor for language: java
[INFO] Mojo extractor for language: java found 1 mojo descriptors.
[INFO] Applying mojo extractor for language: bsh
[INFO] Mojo extractor for language: bsh found 0 mojo descriptors.
[INFO]
[INFO] --- maven-remote-resources-plugin:1.1:process (default) @ maven-tagdoc-plugin ---
[INFO]
[INFO] --- maven-resources-plugin:2.4.3:resources (default-resources) @ maven-tagdoc-plugin ---
[INFO] Using 'UTF-8' encoding to copy filtered resources.
[INFO] Copying 0 resource
[INFO] Copying 2 resources
[INFO]
[INFO] --- maven-compiler-plugin:2.3.1:compile (default-compile) @ maven-tagdoc-plugin ---
[INFO] Compiling 1 source file to <https://builds.apache.org/job/Trinidad%20Core%20Trunk%20(snapshot)/ws/plugins/maven-tagdoc-plugin/target/classes>
[INFO]
[INFO] --- maven-resources-plugin:2.4.3:testResources (default-testResources) @ maven-tagdoc-plugin ---
[INFO] Using 'UTF-8' encoding to copy filtered resources.
[INFO] skip non existing resourceDirectory <https://builds.apache.org/job/Trinidad%20Core%20Trunk%20(snapshot)/ws/plugins/maven-tagdoc-plugin/src/test/resources>
[INFO] Copying 2 resources
[INFO]
[INFO] --- maven-compiler-plugin:2.3.1:testCompile (default-testCompile) @ maven-tagdoc-plugin ---
[INFO] No sources to compile
[INFO]
[INFO] --- maven-surefire-plugin:2.5:test (default-test) @ maven-tagdoc-plugin ---
[INFO] Surefire report directory: <https://builds.apache.org/job/Trinidad%20Core%20Trunk%20(snapshot)/ws/plugins/maven-tagdoc-plugin/target/surefire-reports>
-------------------------------------------------------
T E S T S
-------------------------------------------------------
There are no tests to run.
Results :
Tests run: 0, Failures: 0, Errors: 0, Skipped: 0
[INFO]
[INFO] --- maven-jar-plugin:2.3.1:jar (default-jar) @ maven-tagdoc-plugin ---
[INFO] Building jar: <https://builds.apache.org/job/Trinidad%20Core%20Trunk%20(snapshot)/ws/plugins/maven-tagdoc-plugin/target/maven-tagdoc-plugin-2.0.8-SNAPSHOT.jar>
[INFO]
[INFO] --- maven-plugin-plugin:2.5.1:addPluginArtifactMetadata (default-addPluginArtifactMetadata) @ maven-tagdoc-plugin ---
[INFO]
[INFO] --- maven-install-plugin:2.3:install (default-install) @ maven-tagdoc-plugin ---
[INFO] Installing <https://builds.apache.org/job/Trinidad%20Core%20Trunk%20(snapshot)/ws/plugins/maven-tagdoc-plugin/target/maven-tagdoc-plugin-2.0.8-SNAPSHOT.jar> to /home/jenkins/.m2/repository/org/apache/myfaces/trinidadbuild/maven-tagdoc-plugin/2.0.8-SNAPSHOT/maven-tagdoc-plugin-2.0.8-SNAPSHOT.jar
[INFO] Installing <https://builds.apache.org/job/Trinidad%20Core%20Trunk%20(snapshot)/ws/plugins/maven-tagdoc-plugin/pom.xml> to /home/jenkins/.m2/repository/org/apache/myfaces/trinidadbuild/maven-tagdoc-plugin/2.0.8-SNAPSHOT/maven-tagdoc-plugin-2.0.8-SNAPSHOT.pom
[INFO] ------------------------------------------------------------------------
[INFO] Reactor Summary:
[INFO]
[INFO] Apache Trinidad Maven Plugin Parent ............... SUCCESS [2.632s]
[INFO] Apache Trinidad Maven JDev Plugin ................. SUCCESS [3.858s]
[INFO] Apache Trinidad Maven Faces Plugin ................ SUCCESS [4.487s]
[INFO] Apache Trinidad Maven Javacc Plugin ............... SUCCESS [1.761s]
[INFO] Apache Trinidad Maven i18n Plugin ................. SUCCESS [1.530s]
[INFO] Apache Trinidad Maven Javascript Plugin ........... SUCCESS [3.834s]
[INFO] Apache Trinidad Maven XRTS Plugin ................. SUCCESS [0.920s]
[INFO] Apache Trinidad Maven Tag Documentation Report .... SUCCESS [1.768s]
[INFO] ------------------------------------------------------------------------
[INFO] BUILD SUCCESS
[INFO] ------------------------------------------------------------------------
[INFO] Total time: 25.485s
[INFO] Finished at: Thu May 31 20:34:05 UTC 2012
[INFO] Final Memory: 40M/618M
[INFO] ------------------------------------------------------------------------
Parsing POMs
[Trinidad Core Trunk (snapshot)] $ /home/hudson/tools/java/latest1.6/bin/java -Xms512m -Xmx1024m -XX:PermSize=256m -XX:MaxPermSize=512m -cp /home/jenkins/jenkins-slave/maven3-agent.jar:/home/hudson/tools/maven/latest3/boot/plexus-classworlds-2.4.jar org.jvnet.hudson.maven3.agent.Maven3Main /home/hudson/tools/maven/latest3 /home/jenkins/jenkins-slave/slave.jar /home/jenkins/jenkins-slave/maven3-interceptor.jar 42094
<===[JENKINS REMOTING CAPACITY]===>channel started
log4j:WARN No appenders could be found for logger (org.apache.commons.beanutils.converters.BooleanConverter).
log4j:WARN Please initialize the log4j system properly.
Executing Maven: -B -f <https://builds.apache.org/job/Trinidad%20Core%20Trunk%20(snapshot)/ws/pom.xml> -Dmaven.repo.local=/home/jenkins/jenkins-slave/maven-repositories/1 -PbuildSnapshot,-buildExamples,enableRat,enableAssert clean install deploy
[INFO] Scanning for projects...
[INFO] ------------------------------------------------------------------------
[INFO] Reactor Build Order:
[INFO]
[INFO] Apache MyFaces Trinidad
[INFO] Apache MyFaces Trinidad Build
[INFO] Apache MyFaces Trinidad API
[INFO] Apache MyFaces Trinidad Impl
Projects to build: [MavenProject: org.apache.myfaces.trinidad:trinidad:2.1.0-SNAPSHOT @ <https://builds.apache.org/job/Trinidad%20Core%20Trunk%20(snapshot)/ws/pom.xml,> MavenProject: org.apache.myfaces.trinidad:trinidad-build:2.1.0-SNAPSHOT @ <https://builds.apache.org/job/Trinidad%20Core%20Trunk%20(snapshot)/ws/trinidad-build/pom.xml,> MavenProject: org.apache.myfaces.trinidad:trinidad-api:2.1.0-SNAPSHOT @ <https://builds.apache.org/job/Trinidad%20Core%20Trunk%20(snapshot)/ws/trinidad-api/pom.xml,> MavenProject: org.apache.myfaces.trinidad:trinidad-impl:2.1.0-SNAPSHOT @ <https://builds.apache.org/job/Trinidad%20Core%20Trunk%20(snapshot)/ws/trinidad-impl/pom.xml]>
projectStarted org.apache.myfaces.trinidad:trinidad:2.1.0-SNAPSHOT
[INFO]
[INFO] ------------------------------------------------------------------------
[INFO] Building Apache MyFaces Trinidad 2.1.0-SNAPSHOT
[INFO] ------------------------------------------------------------------------
[WARNING] The POM for org.apache.myfaces.trinidadbuild:maven-xrts-plugin:jar:2.0.8-SNAPSHOT is missing, no dependency information available
projectFailed org.apache.myfaces.trinidad:trinidad:2.1.0-SNAPSHOT
sessionEnded
[INFO] ------------------------------------------------------------------------
[INFO] Reactor Summary:
[INFO]
[INFO] Apache MyFaces Trinidad ........................... FAILURE [0.183s]
[INFO] Apache MyFaces Trinidad Build ..................... SKIPPED
[INFO] Apache MyFaces Trinidad API ....................... SKIPPED
[INFO] Apache MyFaces Trinidad Impl ...................... SKIPPED
[INFO] ------------------------------------------------------------------------
[INFO] BUILD FAILURE
[INFO] ------------------------------------------------------------------------
[INFO] Total time: 2.972s
[INFO] Finished at: Thu May 31 20:35:14 UTC 2012
[INFO] Final Memory: 7M/490M
[INFO] ------------------------------------------------------------------------
Projects to build: [MavenProject: org.apache.myfaces.trinidad:trinidad:2.1.0-SNAPSHOT @ <https://builds.apache.org/job/Trinidad%20Core%20Trunk%20(snapshot)/ws/pom.xml,> MavenProject: org.apache.myfaces.trinidad:trinidad-build:2.1.0-SNAPSHOT @ <https://builds.apache.org/job/Trinidad%20Core%20Trunk%20(snapshot)/ws/trinidad-build/pom.xml,> MavenProject: org.apache.myfaces.trinidad:trinidad-api:2.1.0-SNAPSHOT @ <https://builds.apache.org/job/Trinidad%20Core%20Trunk%20(snapshot)/ws/trinidad-api/pom.xml,> MavenProject: org.apache.myfaces.trinidad:trinidad-impl:2.1.0-SNAPSHOT @ <https://builds.apache.org/job/Trinidad%20Core%20Trunk%20(snapshot)/ws/trinidad-impl/pom.xml]>
[JENKINS] Archiving <https://builds.apache.org/job/Trinidad%20Core%20Trunk%20(snapshot)/ws/pom.xml> to /home/hudson/hudson/jobs/Trinidad Core Trunk (snapshot)/modules/org.apache.myfaces.trinidad$trinidad/builds/2012-05-31_20-34-59/archive/org.apache.myfaces.trinidad/trinidad/2.1.0-SNAPSHOT/trinidad-2.1.0-SNAPSHOT.pom
[JENKINS] Archiving <https://builds.apache.org/job/Trinidad%20Core%20Trunk%20(snapshot)/ws/trinidad-api/pom.xml> to /home/hudson/hudson/jobs/Trinidad Core Trunk (snapshot)/modules/org.apache.myfaces.trinidad$trinidad-api/builds/2012-05-31_20-34-59/archive/org.apache.myfaces.trinidad/trinidad-api/2.1.0-SNAPSHOT/trinidad-api-2.1.0-SNAPSHOT.pom
[JENKINS] Archiving <https://builds.apache.org/job/Trinidad%20Core%20Trunk%20(snapshot)/ws/trinidad-impl/pom.xml> to /home/hudson/hudson/jobs/Trinidad Core Trunk (snapshot)/modules/org.apache.myfaces.trinidad$trinidad-impl/builds/2012-05-31_20-34-59/archive/org.apache.myfaces.trinidad/trinidad-impl/2.1.0-SNAPSHOT/trinidad-impl-2.1.0-SNAPSHOT.pom
[JENKINS] Archiving <https://builds.apache.org/job/Trinidad%20Core%20Trunk%20(snapshot)/ws/trinidad-build/pom.xml> to /home/hudson/hudson/jobs/Trinidad Core Trunk (snapshot)/modules/org.apache.myfaces.trinidad$trinidad-build/builds/2012-05-31_20-34-59/archive/org.apache.myfaces.trinidad/trinidad-build/2.1.0-SNAPSHOT/trinidad-build-2.1.0-SNAPSHOT.pom
Waiting for Jenkins to finish collecting data
mavenExecutionResult exceptions not empty
message : Plugin org.apache.myfaces.trinidadbuild:maven-xrts-plugin:2.0.8-SNAPSHOT or one of its dependencies could not be resolved: Failed to read artifact descriptor for org.apache.myfaces.trinidadbuild:maven-xrts-plugin:jar:2.0.8-SNAPSHOT
cause : Failed to read artifact descriptor for org.apache.myfaces.trinidadbuild:maven-xrts-plugin:jar:2.0.8-SNAPSHOT
Stack trace :
org.apache.maven.plugin.PluginResolutionException: Plugin org.apache.myfaces.trinidadbuild:maven-xrts-plugin:2.0.8-SNAPSHOT or one of its dependencies could not be resolved: Failed to read artifact descriptor for org.apache.myfaces.trinidadbuild:maven-xrts-plugin:jar:2.0.8-SNAPSHOT
at org.apache.maven.plugin.internal.DefaultPluginDependenciesResolver.resolve(DefaultPluginDependenciesResolver.java:129)
at org.apache.maven.plugin.internal.DefaultMavenPluginManager.getPluginDescriptor(DefaultMavenPluginManager.java:142)
at org.apache.maven.plugin.internal.DefaultMavenPluginManager.getMojoDescriptor(DefaultMavenPluginManager.java:261)
at org.apache.maven.plugin.DefaultBuildPluginManager.getMojoDescriptor(DefaultBuildPluginManager.java:185)
at org.apache.maven.lifecycle.internal.DefaultLifecycleExecutionPlanCalculator.calculateLifecycleMappings(DefaultLifecycleExecutionPlanCalculator.java:280)
at org.apache.maven.lifecycle.internal.DefaultLifecycleExecutionPlanCalculator.calculateMojoExecutions(DefaultLifecycleExecutionPlanCalculator.java:193)
at org.apache.maven.lifecycle.internal.DefaultLifecycleExecutionPlanCalculator.calculateExecutionPlan(DefaultLifecycleExecutionPlanCalculator.java:112)
at org.apache.maven.lifecycle.internal.DefaultLifecycleExecutionPlanCalculator.calculateExecutionPlan(DefaultLifecycleExecutionPlanCalculator.java:129)
at org.apache.maven.lifecycle.internal.BuilderCommon.resolveBuildPlan(BuilderCommon.java:92)
at org.apache.maven.lifecycle.internal.LifecycleModuleBuilder.buildProject(LifecycleModuleBuilder.java:81)
at org.apache.maven.lifecycle.internal.LifecycleModuleBuilder.buildProject(LifecycleModuleBuilder.java:59)
at org.apache.maven.lifecycle.internal.LifecycleStarter.singleThreadedBuild(LifecycleStarter.java:183)
at org.apache.maven.lifecycle.internal.LifecycleStarter.execute(LifecycleStarter.java:161)
at org.apache.maven.DefaultMaven.doExecute(DefaultMaven.java:319)
at org.apache.maven.DefaultMaven.execute(DefaultMaven.java:156)
at org.jvnet.hudson.maven3.launcher.Maven3Launcher.main(Maven3Launcher.java:79)
at sun.reflect.NativeMethodAccessorImpl.invoke0(Native Method)
at sun.reflect.NativeMethodAccessorImpl.invoke(NativeMethodAccessorImpl.java:39)
at sun.reflect.DelegatingMethodAccessorImpl.invoke(DelegatingMethodAccessorImpl.java:25)
at java.lang.reflect.Method.invoke(Method.java:597)
at org.codehaus.plexus.classworlds.launcher.Launcher.launchStandard(Launcher.java:329)
at org.codehaus.plexus.classworlds.launcher.Launcher.launch(Launcher.java:239)
at org.jvnet.hudson.maven3.agent.Maven3Main.launch(Maven3Main.java:158)
at hudson.maven.Maven3Builder.call(Maven3Builder.java:98)
at hudson.maven.Maven3Builder.call(Maven3Builder.java:64)
at hudson.remoting.UserRequest.perform(UserRequest.java:118)
at hudson.remoting.UserRequest.perform(UserRequest.java:48)
at hudson.remoting.Request$2.run(Request.java:287)
at hudson.remoting.InterceptingExecutorService$1.call(InterceptingExecutorService.java:72)
at java.util.concurrent.FutureTask$Sync.innerRun(FutureTask.java:303)
at java.util.concurrent.FutureTask.run(FutureTask.java:138)
at java.util.concurrent.ThreadPoolExecutor$Worker.runTask(ThreadPoolExecutor.java:886)
at java.util.concurrent.ThreadPoolExecutor$Worker.run(ThreadPoolExecutor.java:908)
at java.lang.Thread.run(Thread.java:662)
Caused by: org.sonatype.aether.resolution.ArtifactDescriptorException: Failed to read artifact descriptor for org.apache.myfaces.trinidadbuild:maven-xrts-plugin:jar:2.0.8-SNAPSHOT
at org.apache.maven.repository.internal.DefaultArtifactDescriptorReader.loadPom(DefaultArtifactDescriptorReader.java:282)
at org.apache.maven.repository.internal.DefaultArtifactDescriptorReader.readArtifactDescriptor(DefaultArtifactDescriptorReader.java:172)
at org.sonatype.aether.impl.internal.DefaultRepositorySystem.readArtifactDescriptor(DefaultRepositorySystem.java:316)
at org.apache.maven.plugin.internal.DefaultPluginDependenciesResolver.resolve(DefaultPluginDependenciesResolver.java:115)
... 33 more
Caused by: org.sonatype.aether.resolution.ArtifactResolutionException: Could not find artifact org.apache.myfaces.trinidadbuild:maven-xrts-plugin:pom:2.0.8-SNAPSHOT
at org.sonatype.aether.impl.internal.DefaultArtifactResolver.resolve(DefaultArtifactResolver.java:541)
at org.sonatype.aether.impl.internal.DefaultArtifactResolver.resolveArtifacts(DefaultArtifactResolver.java:220)
at org.sonatype.aether.impl.internal.DefaultArtifactResolver.resolveArtifact(DefaultArtifactResolver.java:197)
at org.apache.maven.repository.internal.DefaultArtifactDescriptorReader.loadPom(DefaultArtifactDescriptorReader.java:267)
... 36 more
Caused by: org.sonatype.aether.transfer.ArtifactNotFoundException: Could not find artifact org.apache.myfaces.trinidadbuild:maven-xrts-plugin:pom:2.0.8-SNAPSHOT
at org.sonatype.aether.impl.internal.DefaultArtifactResolver.resolve(DefaultArtifactResolver.java:531)
... 39 more
Sending e-mails to: commits@myfaces.apache.org sobryan@apache.org
channel stopped
Jenkins build is back to normal : Trinidad Core Trunk (snapshot) #6
Posted by Apache Jenkins Server <je...@builds.apache.org>.
See <https://builds.apache.org/job/Trinidad%20Core%20Trunk%20(snapshot)/6/>
Build failed in Jenkins: Trinidad Core Trunk (snapshot) #5
Posted by Apache Jenkins Server <je...@builds.apache.org>.
See <https://builds.apache.org/job/Trinidad%20Core%20Trunk%20(snapshot)/5/>
------------------------------------------
[...truncated 39388 lines...]
21722/?
22234/?
22868/?
23379/?
23956/?
24632/?
25227/?
25796/?
26373/?
26960/?
27551/?
28133/?
28643/?
29155/?
29766/?
30362/?
30952/?
31463/?
32048/?
32559/?
33158/?
33782/?
34495/?
35110/?
35698/?
36208/?
36736/?
37303/?
37821/?
38333/?
38494/?
39091/?
39610/?
40195/?
40803/?
41422/?
42004/?
42594/?
43259/?
43842/?
44354/?
44865/?
45377/?
45888/?
46399/?
46910/?
47422/?
47920/?
48496/?
49078/?
49718/?
50242/?
50835/?
51421/?
52006/?
52593/?
53169/?
53751/?
54262/?
54665/?
54689/?
55200/?
55711/?
56155/?
56713/?
57316/?
57825/?
58459/?
59040/?
59673/?
60181/?
60688/?
61195/?
61774/?
62351/?
62914/?
63479/?
63986/?
64493/?
65001/?
65508/?
66017/?
66525/?
67032/?
67726/?
69595/?
69624/?
71774/?
74139/?
77442/?
78377/?
[INFO] [enforcer:enforce {execution: enforce-versions}]
[INFO] [plugin:descriptor {execution: default-descriptor}]
[INFO] Using 'UTF-8' encoding to read mojo metadata.
[INFO] Applying mojo extractor for language: java
[INFO] Mojo extractor for language: java found 1 mojo descriptors.
[INFO] Applying mojo extractor for language: bsh
[INFO] Mojo extractor for language: bsh found 0 mojo descriptors.
[INFO] [remote-resources:process {execution: default}]
[INFO] [resources:resources {execution: default-resources}]
[INFO] Using 'UTF-8' encoding to copy filtered resources.
[INFO] Copying 0 resource
[INFO] Copying 2 resources
[INFO] [compiler:compile {execution: default-compile}]
[INFO] Compiling 1 source file to <https://builds.apache.org/job/Trinidad%20Core%20Trunk%20(snapshot)/ws/plugins/maven-tagdoc-plugin/target/classes>
[INFO] [resources:testResources {execution: default-testResources}]
[INFO] Using 'UTF-8' encoding to copy filtered resources.
[INFO] skip non existing resourceDirectory <https://builds.apache.org/job/Trinidad%20Core%20Trunk%20(snapshot)/ws/plugins/maven-tagdoc-plugin/src/test/resources>
[INFO] Copying 2 resources
[INFO] [compiler:testCompile {execution: default-testCompile}]
[INFO] No sources to compile
[INFO] [surefire:test {execution: default-test}]
[INFO] Surefire report directory: <https://builds.apache.org/job/Trinidad%20Core%20Trunk%20(snapshot)/ws/plugins/maven-tagdoc-plugin/target/surefire-reports>
-------------------------------------------------------
T E S T S
-------------------------------------------------------
There are no tests to run.
Results :
Tests run: 0, Failures: 0, Errors: 0, Skipped: 0
[INFO] [jar:jar {execution: default-jar}]
[INFO] Building jar: <https://builds.apache.org/job/Trinidad%20Core%20Trunk%20(snapshot)/ws/plugins/maven-tagdoc-plugin/target/maven-tagdoc-plugin-2.0.8-SNAPSHOT.jar>
[INFO] [plugin:addPluginArtifactMetadata {execution: default-addPluginArtifactMetadata}]
[INFO] [install:install {execution: default-install}]
[INFO] Installing <https://builds.apache.org/job/Trinidad%20Core%20Trunk%20(snapshot)/ws/plugins/maven-tagdoc-plugin/target/maven-tagdoc-plugin-2.0.8-SNAPSHOT.jar> to <https://builds.apache.org/job/Trinidad%20Core%20Trunk%20(snapshot)/ws/.repository/org/apache/myfaces/trinidadbuild/maven-tagdoc-plugin/2.0.8-SNAPSHOT/maven-tagdoc-plugin-2.0.8-SNAPSHOT.jar>
[INFO]
[INFO]
[INFO] ------------------------------------------------------------------------
[INFO] Reactor Summary:
[INFO] ------------------------------------------------------------------------
[INFO] Apache Trinidad Maven Plugin Parent ................... SUCCESS [2:26.321s]
[INFO] Apache Trinidad Maven JDev Plugin ..................... SUCCESS [55.835s]
[INFO] Apache Trinidad Maven Faces Plugin .................... SUCCESS [10.259s]
[INFO] Apache Trinidad Maven Javacc Plugin ................... SUCCESS [8.544s]
[INFO] Apache Trinidad Maven i18n Plugin ..................... SUCCESS [15.251s]
[INFO] Apache Trinidad Maven Javascript Plugin ............... SUCCESS [4.549s]
[INFO] Apache Trinidad Maven XRTS Plugin ..................... SUCCESS [0.897s]
[INFO] Apache Trinidad Maven Tag Documentation Report ........ SUCCESS [18.802s]
[INFO] ------------------------------------------------------------------------
[INFO] ------------------------------------------------------------------------
[INFO] BUILD SUCCESSFUL
[INFO] ------------------------------------------------------------------------
[INFO] Total time: 4 minutes 21 seconds
[INFO] Finished at: Thu May 31 20:51:56 UTC 2012
[INFO] Final Memory: 67M/544M
[INFO] ------------------------------------------------------------------------
Parsing POMs
[Trinidad Core Trunk (snapshot)] $ /home/hudson/tools/java/latest1.6/bin/java -Xms512m -Xmx1024m -XX:PermSize=256m -XX:MaxPermSize=512m -cp /home/jenkins/jenkins-slave/maven3-agent.jar:/home/hudson/tools/maven/latest3/boot/plexus-classworlds-2.4.jar org.jvnet.hudson.maven3.agent.Maven3Main /home/hudson/tools/maven/latest3 /home/jenkins/jenkins-slave/slave.jar /home/jenkins/jenkins-slave/maven3-interceptor.jar 33168
<===[JENKINS REMOTING CAPACITY]===>channel started
log4j:WARN No appenders could be found for logger (org.apache.commons.beanutils.converters.BooleanConverter).
log4j:WARN Please initialize the log4j system properly.
Executing Maven: -B -f <https://builds.apache.org/job/Trinidad%20Core%20Trunk%20(snapshot)/ws/pom.xml> -Dmaven.repo.local=/home/jenkins/jenkins-slave/maven-repositories/1 -PbuildSnapshot,-buildExamples,enableRat,enableAssert clean install deploy
[INFO] Scanning for projects...
[INFO] ------------------------------------------------------------------------
[INFO] Reactor Build Order:
[INFO]
[INFO] Apache MyFaces Trinidad
[INFO] Apache MyFaces Trinidad Build
[INFO] Apache MyFaces Trinidad API
[INFO] Apache MyFaces Trinidad Impl
Projects to build: [MavenProject: org.apache.myfaces.trinidad:trinidad:2.1.0-SNAPSHOT @ <https://builds.apache.org/job/Trinidad%20Core%20Trunk%20(snapshot)/ws/pom.xml,> MavenProject: org.apache.myfaces.trinidad:trinidad-build:2.1.0-SNAPSHOT @ <https://builds.apache.org/job/Trinidad%20Core%20Trunk%20(snapshot)/ws/trinidad-build/pom.xml,> MavenProject: org.apache.myfaces.trinidad:trinidad-api:2.1.0-SNAPSHOT @ <https://builds.apache.org/job/Trinidad%20Core%20Trunk%20(snapshot)/ws/trinidad-api/pom.xml,> MavenProject: org.apache.myfaces.trinidad:trinidad-impl:2.1.0-SNAPSHOT @ <https://builds.apache.org/job/Trinidad%20Core%20Trunk%20(snapshot)/ws/trinidad-impl/pom.xml]>
projectStarted org.apache.myfaces.trinidad:trinidad:2.1.0-SNAPSHOT
[INFO]
[INFO] ------------------------------------------------------------------------
[INFO] Building Apache MyFaces Trinidad 2.1.0-SNAPSHOT
[INFO] ------------------------------------------------------------------------
[WARNING] The POM for org.apache.myfaces.trinidadbuild:maven-xrts-plugin:jar:2.0.8-SNAPSHOT is missing, no dependency information available
projectFailed org.apache.myfaces.trinidad:trinidad:2.1.0-SNAPSHOT
sessionEnded
[INFO] ------------------------------------------------------------------------
[INFO] Reactor Summary:
[INFO]
[INFO] Apache MyFaces Trinidad ........................... FAILURE [0.185s]
[INFO] Apache MyFaces Trinidad Build ..................... SKIPPED
[INFO] Apache MyFaces Trinidad API ....................... SKIPPED
[INFO] Apache MyFaces Trinidad Impl ...................... SKIPPED
[INFO] ------------------------------------------------------------------------
[INFO] BUILD FAILURE
[INFO] ------------------------------------------------------------------------
[INFO] Total time: 3.041s
[INFO] Finished at: Thu May 31 20:52:16 UTC 2012
[INFO] Final Memory: 7M/490M
[INFO] ------------------------------------------------------------------------
Projects to build: [MavenProject: org.apache.myfaces.trinidad:trinidad:2.1.0-SNAPSHOT @ <https://builds.apache.org/job/Trinidad%20Core%20Trunk%20(snapshot)/ws/pom.xml,> MavenProject: org.apache.myfaces.trinidad:trinidad-build:2.1.0-SNAPSHOT @ <https://builds.apache.org/job/Trinidad%20Core%20Trunk%20(snapshot)/ws/trinidad-build/pom.xml,> MavenProject: org.apache.myfaces.trinidad:trinidad-api:2.1.0-SNAPSHOT @ <https://builds.apache.org/job/Trinidad%20Core%20Trunk%20(snapshot)/ws/trinidad-api/pom.xml,> MavenProject: org.apache.myfaces.trinidad:trinidad-impl:2.1.0-SNAPSHOT @ <https://builds.apache.org/job/Trinidad%20Core%20Trunk%20(snapshot)/ws/trinidad-impl/pom.xml]>
[JENKINS] Archiving <https://builds.apache.org/job/Trinidad%20Core%20Trunk%20(snapshot)/ws/pom.xml> to /home/hudson/hudson/jobs/Trinidad Core Trunk (snapshot)/modules/org.apache.myfaces.trinidad$trinidad/builds/2012-05-31_20-51-57/archive/org.apache.myfaces.trinidad/trinidad/2.1.0-SNAPSHOT/trinidad-2.1.0-SNAPSHOT.pom
[JENKINS] Archiving <https://builds.apache.org/job/Trinidad%20Core%20Trunk%20(snapshot)/ws/trinidad-api/pom.xml> to /home/hudson/hudson/jobs/Trinidad Core Trunk (snapshot)/modules/org.apache.myfaces.trinidad$trinidad-api/builds/2012-05-31_20-51-58/archive/org.apache.myfaces.trinidad/trinidad-api/2.1.0-SNAPSHOT/trinidad-api-2.1.0-SNAPSHOT.pom
[JENKINS] Archiving <https://builds.apache.org/job/Trinidad%20Core%20Trunk%20(snapshot)/ws/trinidad-impl/pom.xml> to /home/hudson/hudson/jobs/Trinidad Core Trunk (snapshot)/modules/org.apache.myfaces.trinidad$trinidad-impl/builds/2012-05-31_20-51-58/archive/org.apache.myfaces.trinidad/trinidad-impl/2.1.0-SNAPSHOT/trinidad-impl-2.1.0-SNAPSHOT.pom
[JENKINS] Archiving <https://builds.apache.org/job/Trinidad%20Core%20Trunk%20(snapshot)/ws/trinidad-build/pom.xml> to /home/hudson/hudson/jobs/Trinidad Core Trunk (snapshot)/modules/org.apache.myfaces.trinidad$trinidad-build/builds/2012-05-31_20-51-58/archive/org.apache.myfaces.trinidad/trinidad-build/2.1.0-SNAPSHOT/trinidad-build-2.1.0-SNAPSHOT.pom
Waiting for Jenkins to finish collecting data
mavenExecutionResult exceptions not empty
message : Plugin org.apache.myfaces.trinidadbuild:maven-xrts-plugin:2.0.8-SNAPSHOT or one of its dependencies could not be resolved: Failed to read artifact descriptor for org.apache.myfaces.trinidadbuild:maven-xrts-plugin:jar:2.0.8-SNAPSHOT
cause : Failed to read artifact descriptor for org.apache.myfaces.trinidadbuild:maven-xrts-plugin:jar:2.0.8-SNAPSHOT
Stack trace :
org.apache.maven.plugin.PluginResolutionException: Plugin org.apache.myfaces.trinidadbuild:maven-xrts-plugin:2.0.8-SNAPSHOT or one of its dependencies could not be resolved: Failed to read artifact descriptor for org.apache.myfaces.trinidadbuild:maven-xrts-plugin:jar:2.0.8-SNAPSHOT
at org.apache.maven.plugin.internal.DefaultPluginDependenciesResolver.resolve(DefaultPluginDependenciesResolver.java:129)
at org.apache.maven.plugin.internal.DefaultMavenPluginManager.getPluginDescriptor(DefaultMavenPluginManager.java:142)
at org.apache.maven.plugin.internal.DefaultMavenPluginManager.getMojoDescriptor(DefaultMavenPluginManager.java:261)
at org.apache.maven.plugin.DefaultBuildPluginManager.getMojoDescriptor(DefaultBuildPluginManager.java:185)
at org.apache.maven.lifecycle.internal.DefaultLifecycleExecutionPlanCalculator.calculateLifecycleMappings(DefaultLifecycleExecutionPlanCalculator.java:280)
at org.apache.maven.lifecycle.internal.DefaultLifecycleExecutionPlanCalculator.calculateMojoExecutions(DefaultLifecycleExecutionPlanCalculator.java:193)
at org.apache.maven.lifecycle.internal.DefaultLifecycleExecutionPlanCalculator.calculateExecutionPlan(DefaultLifecycleExecutionPlanCalculator.java:112)
at org.apache.maven.lifecycle.internal.DefaultLifecycleExecutionPlanCalculator.calculateExecutionPlan(DefaultLifecycleExecutionPlanCalculator.java:129)
at org.apache.maven.lifecycle.internal.BuilderCommon.resolveBuildPlan(BuilderCommon.java:92)
at org.apache.maven.lifecycle.internal.LifecycleModuleBuilder.buildProject(LifecycleModuleBuilder.java:81)
at org.apache.maven.lifecycle.internal.LifecycleModuleBuilder.buildProject(LifecycleModuleBuilder.java:59)
at org.apache.maven.lifecycle.internal.LifecycleStarter.singleThreadedBuild(LifecycleStarter.java:183)
at org.apache.maven.lifecycle.internal.LifecycleStarter.execute(LifecycleStarter.java:161)
at org.apache.maven.DefaultMaven.doExecute(DefaultMaven.java:319)
at org.apache.maven.DefaultMaven.execute(DefaultMaven.java:156)
at org.jvnet.hudson.maven3.launcher.Maven3Launcher.main(Maven3Launcher.java:79)
at sun.reflect.NativeMethodAccessorImpl.invoke0(Native Method)
at sun.reflect.NativeMethodAccessorImpl.invoke(NativeMethodAccessorImpl.java:39)
at sun.reflect.DelegatingMethodAccessorImpl.invoke(DelegatingMethodAccessorImpl.java:25)
at java.lang.reflect.Method.invoke(Method.java:597)
at org.codehaus.plexus.classworlds.launcher.Launcher.launchStandard(Launcher.java:329)
at org.codehaus.plexus.classworlds.launcher.Launcher.launch(Launcher.java:239)
at org.jvnet.hudson.maven3.agent.Maven3Main.launch(Maven3Main.java:158)
at hudson.maven.Maven3Builder.call(Maven3Builder.java:98)
at hudson.maven.Maven3Builder.call(Maven3Builder.java:64)
at hudson.remoting.UserRequest.perform(UserRequest.java:118)
at hudson.remoting.UserRequest.perform(UserRequest.java:48)
at hudson.remoting.Request$2.run(Request.java:287)
at hudson.remoting.InterceptingExecutorService$1.call(InterceptingExecutorService.java:72)
at java.util.concurrent.FutureTask$Sync.innerRun(FutureTask.java:303)
at java.util.concurrent.FutureTask.run(FutureTask.java:138)
at java.util.concurrent.ThreadPoolExecutor$Worker.runTask(ThreadPoolExecutor.java:886)
at java.util.concurrent.ThreadPoolExecutor$Worker.run(ThreadPoolExecutor.java:908)
at java.lang.Thread.run(Thread.java:662)
Caused by: org.sonatype.aether.resolution.ArtifactDescriptorException: Failed to read artifact descriptor for org.apache.myfaces.trinidadbuild:maven-xrts-plugin:jar:2.0.8-SNAPSHOT
at org.apache.maven.repository.internal.DefaultArtifactDescriptorReader.loadPom(DefaultArtifactDescriptorReader.java:282)
at org.apache.maven.repository.internal.DefaultArtifactDescriptorReader.readArtifactDescriptor(DefaultArtifactDescriptorReader.java:172)
at org.sonatype.aether.impl.internal.DefaultRepositorySystem.readArtifactDescriptor(DefaultRepositorySystem.java:316)
at org.apache.maven.plugin.internal.DefaultPluginDependenciesResolver.resolve(DefaultPluginDependenciesResolver.java:115)
... 33 more
Caused by: org.sonatype.aether.resolution.ArtifactResolutionException: Could not find artifact org.apache.myfaces.trinidadbuild:maven-xrts-plugin:pom:2.0.8-SNAPSHOT
at org.sonatype.aether.impl.internal.DefaultArtifactResolver.resolve(DefaultArtifactResolver.java:541)
at org.sonatype.aether.impl.internal.DefaultArtifactResolver.resolveArtifacts(DefaultArtifactResolver.java:220)
at org.sonatype.aether.impl.internal.DefaultArtifactResolver.resolveArtifact(DefaultArtifactResolver.java:197)
at org.apache.maven.repository.internal.DefaultArtifactDescriptorReader.loadPom(DefaultArtifactDescriptorReader.java:267)
... 36 more
Caused by: org.sonatype.aether.transfer.ArtifactNotFoundException: Could not find artifact org.apache.myfaces.trinidadbuild:maven-xrts-plugin:pom:2.0.8-SNAPSHOT
at org.sonatype.aether.impl.internal.DefaultArtifactResolver.resolve(DefaultArtifactResolver.java:531)
... 39 more
Sending e-mails to: commits@myfaces.apache.org sobryan@apache.org
channel stopped
Build failed in Jenkins: Trinidad Core Trunk (snapshot) #4
Posted by Apache Jenkins Server <je...@builds.apache.org>.
See <https://builds.apache.org/job/Trinidad%20Core%20Trunk%20(snapshot)/4/>
------------------------------------------
[...truncated 6210 lines...]
[INFO]
[INFO] --- maven-clean-plugin:2.4.1:clean (default-clean) @ maven-xrts-plugin ---
[INFO]
[INFO] --- maven-enforcer-plugin:1.0-beta-1:enforce (enforce-versions) @ maven-xrts-plugin ---
[INFO]
[INFO] --- maven-plugin-plugin:2.2:descriptor (default-descriptor) @ maven-xrts-plugin ---
[INFO] Using 2 extractors.
[INFO] Applying extractor for language: java
[INFO] Extractor for language: java found 2 mojo descriptors.
[INFO] Applying extractor for language: bsh
[INFO] Extractor for language: bsh found 0 mojo descriptors.
[INFO]
[INFO] --- maven-remote-resources-plugin:1.1:process (default) @ maven-xrts-plugin ---
[INFO]
[INFO] --- maven-resources-plugin:2.4.3:resources (default-resources) @ maven-xrts-plugin ---
[INFO] Using 'UTF-8' encoding to copy filtered resources.
[INFO] Copying 0 resource
[INFO] Copying 2 resources
[INFO]
[INFO] --- maven-compiler-plugin:2.3.1:compile (default-compile) @ maven-xrts-plugin ---
[INFO] Compiling 8 source files to <https://builds.apache.org/job/Trinidad%20Core%20Trunk%20(snapshot)/ws/plugins/maven-xrts-plugin/target/classes>
[WARNING] no such file or directory
<https://builds.apache.org/job/Trinidad%20Core%20Trunk%20(snapshot)/ws/plugins/maven-xrts-plugin/src/main/java/org/apache/myfaces/trinidadbuild/plugin/xrts/XRTSParser.java>:[27,18] [deprecation] org.xml.sax.AttributeList in org.xml.sax has been deprecated
[WARNING] <https://builds.apache.org/job/Trinidad%20Core%20Trunk%20(snapshot)/ws/plugins/maven-xrts-plugin/src/main/java/org/apache/myfaces/trinidadbuild/plugin/xrts/XRTSParser.java>:[28,18] [deprecation] org.xml.sax.HandlerBase in org.xml.sax has been deprecated
[WARNING] <https://builds.apache.org/job/Trinidad%20Core%20Trunk%20(snapshot)/ws/plugins/maven-xrts-plugin/src/main/java/org/apache/myfaces/trinidadbuild/plugin/xrts/XRTSParser.java>:[36,31] [deprecation] org.xml.sax.HandlerBase in org.xml.sax has been deprecated
[WARNING] <https://builds.apache.org/job/Trinidad%20Core%20Trunk%20(snapshot)/ws/plugins/maven-xrts-plugin/src/main/java/org/apache/myfaces/trinidadbuild/plugin/xrts/XRTSParser.java>:[100,40] [deprecation] org.xml.sax.AttributeList in org.xml.sax has been deprecated
[WARNING] <https://builds.apache.org/job/Trinidad%20Core%20Trunk%20(snapshot)/ws/plugins/maven-xrts-plugin/src/main/java/org/apache/myfaces/trinidadbuild/plugin/xrts/XRTSGenerator.java>:[26,18] [deprecation] org.xml.sax.Parser in org.xml.sax has been deprecated
[WARNING] <https://builds.apache.org/job/Trinidad%20Core%20Trunk%20(snapshot)/ws/plugins/maven-xrts-plugin/src/main/java/org/apache/myfaces/trinidadbuild/plugin/xrts/AbstractGenerateSourcesMojo.java>:[100,25] [unchecked] unchecked call to LinkedList(java.util.Collection<? extends E>) as a member of the raw type java.util.LinkedList
[WARNING] <https://builds.apache.org/job/Trinidad%20Core%20Trunk%20(snapshot)/ws/plugins/maven-xrts-plugin/src/main/java/org/apache/myfaces/trinidadbuild/plugin/xrts/AbstractGenerateSourcesMojo.java>:[133,22] [unchecked] unchecked call to put(K,V) as a member of the raw type java.util.Map
[WARNING] <https://builds.apache.org/job/Trinidad%20Core%20Trunk%20(snapshot)/ws/plugins/maven-xrts-plugin/src/main/java/org/apache/myfaces/trinidadbuild/plugin/xrts/AbstractGenerateSourcesMojo.java>:[134,22] [unchecked] unchecked call to put(K,V) as a member of the raw type java.util.Map
[WARNING] <https://builds.apache.org/job/Trinidad%20Core%20Trunk%20(snapshot)/ws/plugins/maven-xrts-plugin/src/main/java/org/apache/myfaces/trinidadbuild/plugin/xrts/AbstractGenerateSourcesMojo.java>:[135,22] [unchecked] unchecked call to put(K,V) as a member of the raw type java.util.Map
[WARNING] <https://builds.apache.org/job/Trinidad%20Core%20Trunk%20(snapshot)/ws/plugins/maven-xrts-plugin/src/main/java/org/apache/myfaces/trinidadbuild/plugin/xrts/AbstractGenerateSourcesMojo.java>:[136,22] [unchecked] unchecked call to put(K,V) as a member of the raw type java.util.Map
[WARNING] <https://builds.apache.org/job/Trinidad%20Core%20Trunk%20(snapshot)/ws/plugins/maven-xrts-plugin/src/main/java/org/apache/myfaces/trinidadbuild/plugin/xrts/AbstractGenerateSourcesMojo.java>:[137,22] [unchecked] unchecked call to put(K,V) as a member of the raw type java.util.Map
[WARNING] <https://builds.apache.org/job/Trinidad%20Core%20Trunk%20(snapshot)/ws/plugins/maven-xrts-plugin/src/main/java/org/apache/myfaces/trinidadbuild/plugin/xrts/AbstractGenerateSourcesMojo.java>:[140,57] [deprecation] toURL() in java.io.File has been deprecated
[INFO]
[INFO] --- maven-resources-plugin:2.4.3:testResources (default-testResources) @ maven-xrts-plugin ---
[INFO] Using 'UTF-8' encoding to copy filtered resources.
[INFO] skip non existing resourceDirectory <https://builds.apache.org/job/Trinidad%20Core%20Trunk%20(snapshot)/ws/plugins/maven-xrts-plugin/src/test/resources>
[INFO] Copying 2 resources
[INFO]
[INFO] --- maven-compiler-plugin:2.3.1:testCompile (default-testCompile) @ maven-xrts-plugin ---
[INFO] No sources to compile
[INFO]
[INFO] --- maven-surefire-plugin:2.5:test (default-test) @ maven-xrts-plugin ---
[INFO] Surefire report directory: <https://builds.apache.org/job/Trinidad%20Core%20Trunk%20(snapshot)/ws/plugins/maven-xrts-plugin/target/surefire-reports>
-------------------------------------------------------
T E S T S
-------------------------------------------------------
There are no tests to run.
Results :
Tests run: 0, Failures: 0, Errors: 0, Skipped: 0
[INFO]
[INFO] --- maven-jar-plugin:2.3.1:jar (default-jar) @ maven-xrts-plugin ---
[INFO] Building jar: <https://builds.apache.org/job/Trinidad%20Core%20Trunk%20(snapshot)/ws/plugins/maven-xrts-plugin/target/maven-xrts-plugin-2.0.8-SNAPSHOT.jar>
[INFO]
[INFO] --- maven-plugin-plugin:2.2:addPluginArtifactMetadata (default-addPluginArtifactMetadata) @ maven-xrts-plugin ---
[INFO]
[INFO] --- maven-install-plugin:2.3:install (default-install) @ maven-xrts-plugin ---
[INFO] Installing <https://builds.apache.org/job/Trinidad%20Core%20Trunk%20(snapshot)/ws/plugins/maven-xrts-plugin/target/maven-xrts-plugin-2.0.8-SNAPSHOT.jar> to /home/jenkins/.m2/repository/org/apache/myfaces/trinidadbuild/maven-xrts-plugin/2.0.8-SNAPSHOT/maven-xrts-plugin-2.0.8-SNAPSHOT.jar
[INFO] Installing <https://builds.apache.org/job/Trinidad%20Core%20Trunk%20(snapshot)/ws/plugins/maven-xrts-plugin/pom.xml> to /home/jenkins/.m2/repository/org/apache/myfaces/trinidadbuild/maven-xrts-plugin/2.0.8-SNAPSHOT/maven-xrts-plugin-2.0.8-SNAPSHOT.pom
[INFO]
[INFO] ------------------------------------------------------------------------
[INFO] Building Apache Trinidad Maven Tag Documentation Report 2.0.8-SNAPSHOT
[INFO] ------------------------------------------------------------------------
[INFO]
[INFO] --- maven-clean-plugin:2.4.1:clean (default-clean) @ maven-tagdoc-plugin ---
[INFO]
[INFO] --- maven-enforcer-plugin:1.0-beta-1:enforce (enforce-versions) @ maven-tagdoc-plugin ---
[INFO]
[INFO] --- maven-plugin-plugin:2.5.1:descriptor (default-descriptor) @ maven-tagdoc-plugin ---
[INFO] Using 'UTF-8' encoding to read mojo metadata.
[INFO] Applying mojo extractor for language: java
[INFO] Mojo extractor for language: java found 1 mojo descriptors.
[INFO] Applying mojo extractor for language: bsh
[INFO] Mojo extractor for language: bsh found 0 mojo descriptors.
[INFO]
[INFO] --- maven-remote-resources-plugin:1.1:process (default) @ maven-tagdoc-plugin ---
[INFO]
[INFO] --- maven-resources-plugin:2.4.3:resources (default-resources) @ maven-tagdoc-plugin ---
[INFO] Using 'UTF-8' encoding to copy filtered resources.
[INFO] Copying 0 resource
[INFO] Copying 2 resources
[INFO]
[INFO] --- maven-compiler-plugin:2.3.1:compile (default-compile) @ maven-tagdoc-plugin ---
[INFO] Compiling 1 source file to <https://builds.apache.org/job/Trinidad%20Core%20Trunk%20(snapshot)/ws/plugins/maven-tagdoc-plugin/target/classes>
[INFO]
[INFO] --- maven-resources-plugin:2.4.3:testResources (default-testResources) @ maven-tagdoc-plugin ---
[INFO] Using 'UTF-8' encoding to copy filtered resources.
[INFO] skip non existing resourceDirectory <https://builds.apache.org/job/Trinidad%20Core%20Trunk%20(snapshot)/ws/plugins/maven-tagdoc-plugin/src/test/resources>
[INFO] Copying 2 resources
[INFO]
[INFO] --- maven-compiler-plugin:2.3.1:testCompile (default-testCompile) @ maven-tagdoc-plugin ---
[INFO] No sources to compile
[INFO]
[INFO] --- maven-surefire-plugin:2.5:test (default-test) @ maven-tagdoc-plugin ---
[INFO] Surefire report directory: <https://builds.apache.org/job/Trinidad%20Core%20Trunk%20(snapshot)/ws/plugins/maven-tagdoc-plugin/target/surefire-reports>
-------------------------------------------------------
T E S T S
-------------------------------------------------------
There are no tests to run.
Results :
Tests run: 0, Failures: 0, Errors: 0, Skipped: 0
[INFO]
[INFO] --- maven-jar-plugin:2.3.1:jar (default-jar) @ maven-tagdoc-plugin ---
[INFO] Building jar: <https://builds.apache.org/job/Trinidad%20Core%20Trunk%20(snapshot)/ws/plugins/maven-tagdoc-plugin/target/maven-tagdoc-plugin-2.0.8-SNAPSHOT.jar>
[INFO]
[INFO] --- maven-plugin-plugin:2.5.1:addPluginArtifactMetadata (default-addPluginArtifactMetadata) @ maven-tagdoc-plugin ---
[INFO]
[INFO] --- maven-install-plugin:2.3:install (default-install) @ maven-tagdoc-plugin ---
[INFO] Installing <https://builds.apache.org/job/Trinidad%20Core%20Trunk%20(snapshot)/ws/plugins/maven-tagdoc-plugin/target/maven-tagdoc-plugin-2.0.8-SNAPSHOT.jar> to /home/jenkins/.m2/repository/org/apache/myfaces/trinidadbuild/maven-tagdoc-plugin/2.0.8-SNAPSHOT/maven-tagdoc-plugin-2.0.8-SNAPSHOT.jar
[INFO] Installing <https://builds.apache.org/job/Trinidad%20Core%20Trunk%20(snapshot)/ws/plugins/maven-tagdoc-plugin/pom.xml> to /home/jenkins/.m2/repository/org/apache/myfaces/trinidadbuild/maven-tagdoc-plugin/2.0.8-SNAPSHOT/maven-tagdoc-plugin-2.0.8-SNAPSHOT.pom
[INFO] ------------------------------------------------------------------------
[INFO] Reactor Summary:
[INFO]
[INFO] Apache Trinidad Maven Plugin Parent ............... SUCCESS [1.038s]
[INFO] Apache Trinidad Maven JDev Plugin ................. SUCCESS [2.566s]
[INFO] Apache Trinidad Maven Faces Plugin ................ SUCCESS [3.968s]
[INFO] Apache Trinidad Maven Javacc Plugin ............... SUCCESS [1.199s]
[INFO] Apache Trinidad Maven i18n Plugin ................. SUCCESS [0.900s]
[INFO] Apache Trinidad Maven Javascript Plugin ........... SUCCESS [11.056s]
[INFO] Apache Trinidad Maven XRTS Plugin ................. SUCCESS [0.886s]
[INFO] Apache Trinidad Maven Tag Documentation Report .... SUCCESS [1.283s]
[INFO] ------------------------------------------------------------------------
[INFO] BUILD SUCCESS
[INFO] ------------------------------------------------------------------------
[INFO] Total time: 23.198s
[INFO] Finished at: Thu May 31 20:41:13 UTC 2012
[INFO] Final Memory: 40M/629M
[INFO] ------------------------------------------------------------------------
Parsing POMs
Modules changed, recalculating dependency graph
[Trinidad Core Trunk (snapshot)] $ /home/hudson/tools/java/latest1.6/bin/java -Xms512m -Xmx1024m -XX:PermSize=256m -XX:MaxPermSize=512m -cp /home/jenkins/jenkins-slave/maven3-agent.jar:/home/hudson/tools/maven/latest3/boot/plexus-classworlds-2.4.jar org.jvnet.hudson.maven3.agent.Maven3Main /home/hudson/tools/maven/latest3 /home/jenkins/jenkins-slave/slave.jar /home/jenkins/jenkins-slave/maven3-interceptor.jar 37684
<===[JENKINS REMOTING CAPACITY]===>channel started
log4j:WARN No appenders could be found for logger (org.apache.commons.beanutils.converters.BooleanConverter).
log4j:WARN Please initialize the log4j system properly.
Executing Maven: -B -f <https://builds.apache.org/job/Trinidad%20Core%20Trunk%20(snapshot)/ws/pom.xml> -Dmaven.repo.local=/home/jenkins/jenkins-slave/maven-repositories/1 -PbuildSnapshot,-buildExamples,enableRat,enableAssert clean install deploy
[INFO] Scanning for projects...
[INFO] ------------------------------------------------------------------------
[INFO] Reactor Build Order:
[INFO]
[INFO] Apache MyFaces Trinidad
[INFO] Apache MyFaces Trinidad Build
[INFO] Apache MyFaces Trinidad API
[INFO] Apache MyFaces Trinidad Impl
Projects to build: [MavenProject: org.apache.myfaces.trinidad:trinidad:2.1.0-SNAPSHOT @ <https://builds.apache.org/job/Trinidad%20Core%20Trunk%20(snapshot)/ws/pom.xml,> MavenProject: org.apache.myfaces.trinidad:trinidad-build:2.1.0-SNAPSHOT @ <https://builds.apache.org/job/Trinidad%20Core%20Trunk%20(snapshot)/ws/trinidad-build/pom.xml,> MavenProject: org.apache.myfaces.trinidad:trinidad-api:2.1.0-SNAPSHOT @ <https://builds.apache.org/job/Trinidad%20Core%20Trunk%20(snapshot)/ws/trinidad-api/pom.xml,> MavenProject: org.apache.myfaces.trinidad:trinidad-impl:2.1.0-SNAPSHOT @ <https://builds.apache.org/job/Trinidad%20Core%20Trunk%20(snapshot)/ws/trinidad-impl/pom.xml]>
projectStarted org.apache.myfaces.trinidad:trinidad:2.1.0-SNAPSHOT
[INFO] [WARNING] The POM for org.apache.myfaces.trinidadbuild:maven-xrts-plugin:jar:2.0.8-SNAPSHOT is missing, no dependency information available
[INFO] ------------------------------------------------------------------------
[INFO] Building Apache MyFaces Trinidad 2.1.0-SNAPSHOT
[INFO] ------------------------------------------------------------------------
projectFailed org.apache.myfaces.trinidad:trinidad:2.1.0-SNAPSHOT
sessionEnded
[INFO] ------------------------------------------------------------------------
[INFO] Reactor Summary:
[INFO]
[INFO] Apache MyFaces Trinidad ........................... FAILURE [0.237s]
[INFO] Apache MyFaces Trinidad Build ..................... SKIPPED
[INFO] Apache MyFaces Trinidad API ....................... SKIPPED
[INFO] Apache MyFaces Trinidad Impl ...................... SKIPPED
[INFO] ------------------------------------------------------------------------
[INFO] BUILD FAILURE
[INFO] ------------------------------------------------------------------------
[INFO] Total time: 4.100s
[INFO] Finished at: Thu May 31 20:42:32 UTC 2012
[INFO] Final Memory: 7M/490M
[INFO] ------------------------------------------------------------------------
Projects to build: [MavenProject: org.apache.myfaces.trinidad:trinidad:2.1.0-SNAPSHOT @ <https://builds.apache.org/job/Trinidad%20Core%20Trunk%20(snapshot)/ws/pom.xml,> MavenProject: org.apache.myfaces.trinidad:trinidad-build:2.1.0-SNAPSHOT @ <https://builds.apache.org/job/Trinidad%20Core%20Trunk%20(snapshot)/ws/trinidad-build/pom.xml,> MavenProject: org.apache.myfaces.trinidad:trinidad-api:2.1.0-SNAPSHOT @ <https://builds.apache.org/job/Trinidad%20Core%20Trunk%20(snapshot)/ws/trinidad-api/pom.xml,> MavenProject: org.apache.myfaces.trinidad:trinidad-impl:2.1.0-SNAPSHOT @ <https://builds.apache.org/job/Trinidad%20Core%20Trunk%20(snapshot)/ws/trinidad-impl/pom.xml]>
[JENKINS] Archiving <https://builds.apache.org/job/Trinidad%20Core%20Trunk%20(snapshot)/ws/pom.xml> to /home/hudson/hudson/jobs/Trinidad Core Trunk (snapshot)/modules/org.apache.myfaces.trinidad$trinidad/builds/2012-05-31_20-42-12/archive/org.apache.myfaces.trinidad/trinidad/2.1.0-SNAPSHOT/trinidad-2.1.0-SNAPSHOT.pom
[JENKINS] Archiving <https://builds.apache.org/job/Trinidad%20Core%20Trunk%20(snapshot)/ws/trinidad-api/pom.xml> to /home/hudson/hudson/jobs/Trinidad Core Trunk (snapshot)/modules/org.apache.myfaces.trinidad$trinidad-api/builds/2012-05-31_20-42-12/archive/org.apache.myfaces.trinidad/trinidad-api/2.1.0-SNAPSHOT/trinidad-api-2.1.0-SNAPSHOT.pom
[JENKINS] Archiving <https://builds.apache.org/job/Trinidad%20Core%20Trunk%20(snapshot)/ws/trinidad-impl/pom.xml> to /home/hudson/hudson/jobs/Trinidad Core Trunk (snapshot)/modules/org.apache.myfaces.trinidad$trinidad-impl/builds/2012-05-31_20-42-12/archive/org.apache.myfaces.trinidad/trinidad-impl/2.1.0-SNAPSHOT/trinidad-impl-2.1.0-SNAPSHOT.pom
[JENKINS] Archiving <https://builds.apache.org/job/Trinidad%20Core%20Trunk%20(snapshot)/ws/trinidad-build/pom.xml> to /home/hudson/hudson/jobs/Trinidad Core Trunk (snapshot)/modules/org.apache.myfaces.trinidad$trinidad-build/builds/2012-05-31_20-42-12/archive/org.apache.myfaces.trinidad/trinidad-build/2.1.0-SNAPSHOT/trinidad-build-2.1.0-SNAPSHOT.pom
Waiting for Jenkins to finish collecting data
mavenExecutionResult exceptions not empty
message : Plugin org.apache.myfaces.trinidadbuild:maven-xrts-plugin:2.0.8-SNAPSHOT or one of its dependencies could not be resolved: Failed to read artifact descriptor for org.apache.myfaces.trinidadbuild:maven-xrts-plugin:jar:2.0.8-SNAPSHOT
cause : Failed to read artifact descriptor for org.apache.myfaces.trinidadbuild:maven-xrts-plugin:jar:2.0.8-SNAPSHOT
Stack trace :
org.apache.maven.plugin.PluginResolutionException: Plugin org.apache.myfaces.trinidadbuild:maven-xrts-plugin:2.0.8-SNAPSHOT or one of its dependencies could not be resolved: Failed to read artifact descriptor for org.apache.myfaces.trinidadbuild:maven-xrts-plugin:jar:2.0.8-SNAPSHOT
at org.apache.maven.plugin.internal.DefaultPluginDependenciesResolver.resolve(DefaultPluginDependenciesResolver.java:129)
at org.apache.maven.plugin.internal.DefaultMavenPluginManager.getPluginDescriptor(DefaultMavenPluginManager.java:142)
at org.apache.maven.plugin.internal.DefaultMavenPluginManager.getMojoDescriptor(DefaultMavenPluginManager.java:261)
at org.apache.maven.plugin.DefaultBuildPluginManager.getMojoDescriptor(DefaultBuildPluginManager.java:185)
at org.apache.maven.lifecycle.internal.DefaultLifecycleExecutionPlanCalculator.calculateLifecycleMappings(DefaultLifecycleExecutionPlanCalculator.java:280)
at org.apache.maven.lifecycle.internal.DefaultLifecycleExecutionPlanCalculator.calculateMojoExecutions(DefaultLifecycleExecutionPlanCalculator.java:193)
at org.apache.maven.lifecycle.internal.DefaultLifecycleExecutionPlanCalculator.calculateExecutionPlan(DefaultLifecycleExecutionPlanCalculator.java:112)
at org.apache.maven.lifecycle.internal.DefaultLifecycleExecutionPlanCalculator.calculateExecutionPlan(DefaultLifecycleExecutionPlanCalculator.java:129)
at org.apache.maven.lifecycle.internal.BuilderCommon.resolveBuildPlan(BuilderCommon.java:92)
at org.apache.maven.lifecycle.internal.LifecycleModuleBuilder.buildProject(LifecycleModuleBuilder.java:81)
at org.apache.maven.lifecycle.internal.LifecycleModuleBuilder.buildProject(LifecycleModuleBuilder.java:59)
at org.apache.maven.lifecycle.internal.LifecycleStarter.singleThreadedBuild(LifecycleStarter.java:183)
at org.apache.maven.lifecycle.internal.LifecycleStarter.execute(LifecycleStarter.java:161)
at org.apache.maven.DefaultMaven.doExecute(DefaultMaven.java:319)
at org.apache.maven.DefaultMaven.execute(DefaultMaven.java:156)
at org.jvnet.hudson.maven3.launcher.Maven3Launcher.main(Maven3Launcher.java:79)
at sun.reflect.NativeMethodAccessorImpl.invoke0(Native Method)
at sun.reflect.NativeMethodAccessorImpl.invoke(NativeMethodAccessorImpl.java:39)
at sun.reflect.DelegatingMethodAccessorImpl.invoke(DelegatingMethodAccessorImpl.java:25)
at java.lang.reflect.Method.invoke(Method.java:597)
at org.codehaus.plexus.classworlds.launcher.Launcher.launchStandard(Launcher.java:329)
at org.codehaus.plexus.classworlds.launcher.Launcher.launch(Launcher.java:239)
at org.jvnet.hudson.maven3.agent.Maven3Main.launch(Maven3Main.java:158)
at hudson.maven.Maven3Builder.call(Maven3Builder.java:98)
at hudson.maven.Maven3Builder.call(Maven3Builder.java:64)
at hudson.remoting.UserRequest.perform(UserRequest.java:118)
at hudson.remoting.UserRequest.perform(UserRequest.java:48)
at hudson.remoting.Request$2.run(Request.java:287)
at hudson.remoting.InterceptingExecutorService$1.call(InterceptingExecutorService.java:72)
at java.util.concurrent.FutureTask$Sync.innerRun(FutureTask.java:303)
at java.util.concurrent.FutureTask.run(FutureTask.java:138)
at java.util.concurrent.ThreadPoolExecutor$Worker.runTask(ThreadPoolExecutor.java:886)
at java.util.concurrent.ThreadPoolExecutor$Worker.run(ThreadPoolExecutor.java:908)
at java.lang.Thread.run(Thread.java:662)
Caused by: org.sonatype.aether.resolution.ArtifactDescriptorException: Failed to read artifact descriptor for org.apache.myfaces.trinidadbuild:maven-xrts-plugin:jar:2.0.8-SNAPSHOT
at org.apache.maven.repository.internal.DefaultArtifactDescriptorReader.loadPom(DefaultArtifactDescriptorReader.java:282)
at org.apache.maven.repository.internal.DefaultArtifactDescriptorReader.readArtifactDescriptor(DefaultArtifactDescriptorReader.java:172)
at org.sonatype.aether.impl.internal.DefaultRepositorySystem.readArtifactDescriptor(DefaultRepositorySystem.java:316)
at org.apache.maven.plugin.internal.DefaultPluginDependenciesResolver.resolve(DefaultPluginDependenciesResolver.java:115)
... 33 more
Caused by: org.sonatype.aether.resolution.ArtifactResolutionException: Could not find artifact org.apache.myfaces.trinidadbuild:maven-xrts-plugin:pom:2.0.8-SNAPSHOT
at org.sonatype.aether.impl.internal.DefaultArtifactResolver.resolve(DefaultArtifactResolver.java:541)
at org.sonatype.aether.impl.internal.DefaultArtifactResolver.resolveArtifacts(DefaultArtifactResolver.java:220)
at org.sonatype.aether.impl.internal.DefaultArtifactResolver.resolveArtifact(DefaultArtifactResolver.java:197)
at org.apache.maven.repository.internal.DefaultArtifactDescriptorReader.loadPom(DefaultArtifactDescriptorReader.java:267)
... 36 more
Caused by: org.sonatype.aether.transfer.ArtifactNotFoundException: Could not find artifact org.apache.myfaces.trinidadbuild:maven-xrts-plugin:pom:2.0.8-SNAPSHOT
at org.sonatype.aether.impl.internal.DefaultArtifactResolver.resolve(DefaultArtifactResolver.java:531)
... 39 more
Sending e-mails to: commits@myfaces.apache.org sobryan@apache.org
channel stopped