You are viewing a plain text version of this content. The canonical link for it is here.
Posted to notifications@maven.apache.org by Apache Jenkins Server <je...@builds.apache.org> on 2018/12/30 05:33:12 UTC
Build failed in Jenkins: Maven TLP » maven-enforcer » MENFORCER-314 #4
See https://builds.apache.org/job/maven-box/job/maven-enforcer/job/MENFORCER-314/4/
Changes:
* Removed exclusion for problematic node cause the node is back online.
* reduce the history archiving
* reduce the history archiving
* increase a bit archiving
* increase a bit archiving
* Activate sonarqube on first project
* Disable sonar:sonar for now
* use publisherStrategy: 'EXPLICIT' to avoid non used publishers
* [INFRA-17514] Fix file separator + add other locations for workspaces
* fix indent
All tests passed
Build log:
[...truncated 4.03 MB...]
[windows-jdk8-m3.5.x_build] [INFO] require-upper-bound-deps_success\pom.xml ......... SUCCESS (5.8 s)
[windows-jdk8-m3.5.x_build] [INFO] Building: resolve_collect_dependencies\pom.xml
[windows-jdk7-m3.3.x_build] [INFO] run post-build script verify.groovy
[windows-jdk7-m3.3.x_build] [INFO] require-upper-bound-deps_ignored\pom.xml ......... SUCCESS (6.4 s)
[windows-jdk7-m3.3.x_build] [INFO] Building: require-upper-bound-deps_success\pom.xml
[windows-jdk7-m3.5.x_build] [INFO] require-snapshot-version_failure\pom.xml ......... SUCCESS (6.5 s)
[windows-jdk7-m3.5.x_build] [INFO] Building: require-snapshot-version_success\pom.xml
[windows-jdk8-m3.5.x_build] [INFO] run post-build script verify.groovy
[windows-jdk8-m3.5.x_build] [INFO] resolve_collect_dependencies\pom.xml ............. SUCCESS (8.0 s)
[windows-jdk8-m3.5.x_build] [INFO] -------------------------------------------------
[windows-jdk8-m3.5.x_build] [INFO] Build Summary:
[windows-jdk8-m3.5.x_build] [INFO] Passed: 68, Failed: 0, Errors: 0, Skipped: 0
[windows-jdk8-m3.5.x_build] [INFO] -------------------------------------------------
[windows-jdk8-m3.5.x_build] [INFO]
[windows-jdk8-m3.5.x_build] [INFO] --- mrm-maven-plugin:1.0.0:stop (default) @ maven-enforcer-plugin ---
[windows-jdk8-m3.5.x_build] [INFO] Stopping Mock Repository Manager on http://localhost:53285
[windows-jdk8-m3.5.x_build] [INFO] Mock Repository Manager http://localhost:53285 is stopped.
[windows-jdk8-m3.5.x_build] [INFO]
[windows-jdk8-m3.5.x_build] [INFO] --- maven-checkstyle-plugin:3.0.0:check (checkstyle-check) @ maven-enforcer-plugin ---
[windows-jdk8-m3.5.x_build] [INFO] ------------------------------------------------------------------------
[windows-jdk8-m3.5.x_build] [INFO] Reactor Summary:
[windows-jdk8-m3.5.x_build] [INFO]
[windows-jdk8-m3.5.x_build] [INFO] Apache Maven Enforcer .............................. SUCCESS [ 25.054 s]
[windows-jdk8-m3.5.x_build] [INFO] Apache Maven Enforcer API .......................... SUCCESS [ 7.911 s]
[windows-jdk8-m3.5.x_build] [INFO] Apache Maven Enforcer Built-In Rules ............... SUCCESS [ 21.977 s]
[windows-jdk8-m3.5.x_build] [INFO] Apache Maven Enforcer Plugin ....................... SUCCESS [07:35 min]
[windows-jdk8-m3.5.x_build] [INFO] ------------------------------------------------------------------------
[windows-jdk8-m3.5.x_build] [INFO] BUILD SUCCESS
[windows-jdk8-m3.5.x_build] [INFO] ------------------------------------------------------------------------
[windows-jdk8-m3.5.x_build] [INFO] Total time: 08:32 min
[windows-jdk8-m3.5.x_build] [INFO] Finished at: 2018-12-30T05:31:43Z
[windows-jdk7-m3.3.x_build] [INFO] require-upper-bound-deps_success\pom.xml ......... SUCCESS (5.7 s)
[windows-jdk7-m3.3.x_build] [INFO] Building: resolve_collect_dependencies\pom.xml
[windows-jdk7-m3.5.x_build] [INFO] require-snapshot-version_success\pom.xml ......... SUCCESS (6.0 s)
[windows-jdk7-m3.5.x_build] [INFO] Building: require-upper-bound-dependencies-managed_failure\pom.xml
[windows-jdk8-m3.5.x_build] [INFO] Final Memory: 60M/845M
[windows-jdk8-m3.5.x_build] [INFO] ------------------------------------------------------------------------
[windows-jdk8-m3.5.x_build] [INFO] [jenkins-event-spy] Generated F:\jenkins\jenkins-slave\workspace\aven-enforcer_MENFORCER-314-VFKMERYZ2Y5UXWYHIHENFPSBJDRGBNTZUUUA5J765JQRA6W2EOKQ@2@tmp\withMaven00eb7e16\maven-spy-20181230-052309-7303653936307915771304.log
[windows-jdk8-m3.5.x_build] Picked up JAVA_TOOL_OPTIONS: -Dmaven.ext.class.path="f:\jenkins\jenkins-slave\workspace\aven-enforcer_MENFORCER-314-VFKMERYZ2Y5UXWYHIHENFPSBJDRGBNTZUUUA5J765JQRA6W2EOKQ@2@tmp\withMaven00eb7e16\pipeline-maven-spy.jar" -Dorg.jenkinsci.plugins.pipeline.maven.reportsFolder="f:\jenkins\jenkins-slave\workspace\aven-enforcer_MENFORCER-314-VFKMERYZ2Y5UXWYHIHENFPSBJDRGBNTZUUUA5J765JQRA6W2EOKQ@2@tmp\withMaven00eb7e16"
[Pipeline] [windows-jdk8-m3.5.x_build] }
[Pipeline] [windows-jdk8-m3.5.x_build] // dir
[windows-jdk7-m3.5.x_build] [INFO] run post-build script verify.groovy
[windows-jdk7-m3.5.x_build] [INFO] require-upper-bound-dependencies-managed_failure\pom.xml SUCCESS (6.5 s)
[windows-jdk7-m3.5.x_build] [INFO] Building: require-upper-bound-dependencies-managed_success\pom.xml
[windows-jdk7-m3.3.x_build] [INFO] run post-build script verify.groovy
[windows-jdk7-m3.3.x_build] [INFO] resolve_collect_dependencies\pom.xml ............. SUCCESS (10.8 s)
[windows-jdk7-m3.3.x_build] [INFO] -------------------------------------------------
[windows-jdk7-m3.3.x_build] [INFO] Build Summary:
[windows-jdk7-m3.3.x_build] [INFO] Passed: 65, Failed: 0, Errors: 0, Skipped: 3
[windows-jdk7-m3.3.x_build] [INFO] -------------------------------------------------
[windows-jdk7-m3.3.x_build] [INFO]
[windows-jdk7-m3.3.x_build] [INFO] --- mrm-maven-plugin:1.0.0:stop (default) @ maven-enforcer-plugin ---
[windows-jdk7-m3.3.x_build] [INFO] Stopping Mock Repository Manager on http://localhost:57787
[windows-jdk7-m3.3.x_build] [INFO] Mock Repository Manager http://localhost:57787 is stopped.
[windows-jdk7-m3.3.x_build] [INFO]
[windows-jdk7-m3.3.x_build] [INFO] --- maven-checkstyle-plugin:3.0.0:check (checkstyle-check) @ maven-enforcer-plugin ---
[windows-jdk7-m3.3.x_build] [INFO] ------------------------------------------------------------------------
[windows-jdk7-m3.3.x_build] [INFO] Reactor Summary:
[windows-jdk7-m3.3.x_build] [INFO]
[windows-jdk7-m3.3.x_build] [INFO] Apache Maven Enforcer .............................. SUCCESS [ 50.055 s]
[windows-jdk7-m3.3.x_build] [INFO] Apache Maven Enforcer API .......................... SUCCESS [ 9.884 s]
[windows-jdk7-m3.3.x_build] [INFO] Apache Maven Enforcer Built-In Rules ............... SUCCESS [ 21.693 s]
[windows-jdk7-m3.3.x_build] [INFO] Apache Maven Enforcer Plugin ....................... SUCCESS [07:19 min]
[windows-jdk7-m3.3.x_build] [INFO] ------------------------------------------------------------------------
[windows-jdk7-m3.3.x_build] [INFO] BUILD SUCCESS
[windows-jdk7-m3.3.x_build] [INFO] ------------------------------------------------------------------------
[windows-jdk7-m3.3.x_build] [INFO] Total time: 08:43 min
[windows-jdk7-m3.3.x_build] [INFO] Finished at: 2018-12-29T21:31:54-08:00
[windows-jdk7-m3.3.x_build] [INFO] Final Memory: 49M/455M
[windows-jdk7-m3.3.x_build] [INFO] ------------------------------------------------------------------------
[windows-jdk7-m3.3.x_build] [INFO] [jenkins-event-spy] Generated F:\jenkins\jenkins-slave\workspace\aven-enforcer_MENFORCER-314-VFKMERYZ2Y5UXWYHIHENFPSBJDRGBNTZUUUA5J765JQRA6W2EOKQ@2@tmp\withMavene53850d0\maven-spy-20181229-212310-8634900157246517607279.log
[windows-jdk7-m3.3.x_build] Picked up JAVA_TOOL_OPTIONS: -Dmaven.ext.class.path="f:\jenkins\jenkins-slave\workspace\aven-enforcer_MENFORCER-314-VFKMERYZ2Y5UXWYHIHENFPSBJDRGBNTZUUUA5J765JQRA6W2EOKQ@2@tmp\withMavene53850d0\pipeline-maven-spy.jar" -Dorg.jenkinsci.plugins.pipeline.maven.reportsFolder="f:\jenkins\jenkins-slave\workspace\aven-enforcer_MENFORCER-314-VFKMERYZ2Y5UXWYHIHENFPSBJDRGBNTZUUUA5J765JQRA6W2EOKQ@2@tmp\withMavene53850d0"
[windows-jdk7-m3.5.x_build] [INFO] require-upper-bound-dependencies-managed_success\pom.xml SUCCESS (6.4 s)
[windows-jdk7-m3.5.x_build] [INFO] Building: require-upper-bound-dependencies-unique_failure\pom.xml
[windows-jdk7-m3.5.x_build] [INFO] snapshot org.apache.maven.plugins.enforcer.its:menforcer134_project:1.0-SNAPSHOT: checking for updates from apache-snapshots
[windows-jdk7-m3.5.x_build] [INFO] snapshot org.apache.maven.plugins.enforcer.its:menforcer134_project:1.0-SNAPSHOT: checking for updates from Nexus
[windows-jdk7-m3.5.x_build] [INFO] artifact org.apache.maven.plugins.enforcer.its.menforcer134_project:1.0-SNAPSHOT: checking for updates from central
[windows-jdk7-m3.5.x_build] [INFO] org.apache.maven.plugins.enforcer.its.menforcer134_project.1.0-SNAPSHOT: checking for updates from central
[windows-jdk7-m3.5.x_build] [INFO] snapshot org.apache.maven.plugins.enforcer.its:menforcer134_modelbuilder:1.0-SNAPSHOT: checking for updates from apache-snapshots
[windows-jdk7-m3.5.x_build] [INFO] snapshot org.apache.maven.plugins.enforcer.its:menforcer134_modelbuilder:1.0-SNAPSHOT: checking for updates from Nexus
[windows-jdk7-m3.5.x_build] [INFO] artifact org.apache.maven.plugins.enforcer.its.menforcer134_modelbuilder:1.0-SNAPSHOT: checking for updates from central
[windows-jdk7-m3.5.x_build] [INFO] org.apache.maven.plugins.enforcer.its.menforcer134_modelbuilder.1.0-SNAPSHOT: checking for updates from central
[windows-jdk7-m3.5.x_build] [INFO] snapshot org.apache.maven.plugins.enforcer.its:menforcer134_model:1.0-SNAPSHOT: checking for updates from apache-snapshots
[windows-jdk7-m3.5.x_build] [INFO] snapshot org.apache.maven.plugins.enforcer.its:menforcer134_model:1.0-SNAPSHOT: checking for updates from Nexus
[windows-jdk7-m3.5.x_build] [INFO] artifact org.apache.maven.plugins.enforcer.its.menforcer134_model:1.0-SNAPSHOT: checking for updates from central
[windows-jdk7-m3.5.x_build] [INFO] org.apache.maven.plugins.enforcer.its.menforcer134_model.1.0-SNAPSHOT: checking for updates from central
[windows-jdk7-m3.5.x_build] [INFO] run post-build script verify.groovy
[windows-jdk7-m3.5.x_build] [INFO] require-upper-bound-dependencies-unique_failure\pom.xml SUCCESS (8.1 s)
[windows-jdk7-m3.5.x_build] [INFO] Building: require-upper-bound-dependencies-unique_success\pom.xml
[Pipeline] [windows-jdk8-m3.5.x_build] }
[windows-jdk8-m3.5.x_build] [withMaven] artifactsPublisher - Archive artifact windows-jdk8-m3.5.x_build\pom.xml under org\apache\maven\enforcer\enforcer\3.0.0-SNAPSHOT\enforcer-3.0.0-SNAPSHOT.pom
[windows-jdk8-m3.5.x_build] [withMaven] artifactsPublisher - Archive artifact windows-jdk8-m3.5.x_build\target\enforcer-3.0.0-SNAPSHOT-site.xml under org\apache\maven\enforcer\enforcer\3.0.0-SNAPSHOT\enforcer-3.0.0-SNAPSHOT-site.xml
[windows-jdk8-m3.5.x_build] [withMaven] artifactsPublisher - Archive artifact windows-jdk8-m3.5.x_build\enforcer-api\pom.xml under org\apache\maven\enforcer\enforcer-api\3.0.0-SNAPSHOT\enforcer-api-3.0.0-SNAPSHOT.pom
[windows-jdk8-m3.5.x_build] [withMaven] artifactsPublisher - Archive artifact windows-jdk8-m3.5.x_build\enforcer-api\target\enforcer-api-3.0.0-SNAPSHOT.jar under org\apache\maven\enforcer\enforcer-api\3.0.0-SNAPSHOT\enforcer-api-3.0.0-SNAPSHOT.jar
[windows-jdk8-m3.5.x_build] [withMaven] artifactsPublisher - Archive artifact windows-jdk8-m3.5.x_build\enforcer-rules\pom.xml under org\apache\maven\enforcer\enforcer-rules\3.0.0-SNAPSHOT\enforcer-rules-3.0.0-SNAPSHOT.pom
[windows-jdk8-m3.5.x_build] [withMaven] artifactsPublisher - Archive artifact windows-jdk8-m3.5.x_build\enforcer-rules\target\enforcer-rules-3.0.0-SNAPSHOT.jar under org\apache\maven\enforcer\enforcer-rules\3.0.0-SNAPSHOT\enforcer-rules-3.0.0-SNAPSHOT.jar
[windows-jdk8-m3.5.x_build] [withMaven] artifactsPublisher - Archive artifact windows-jdk8-m3.5.x_build\enforcer-rules\target\enforcer-rules-3.0.0-SNAPSHOT-tests.jar under org\apache\maven\enforcer\enforcer-rules\3.0.0-SNAPSHOT\enforcer-rules-3.0.0-SNAPSHOT-tests.jar
[windows-jdk8-m3.5.x_build] [withMaven] artifactsPublisher - Archive artifact windows-jdk8-m3.5.x_build\maven-enforcer-plugin\pom.xml under org\apache\maven\plugins\maven-enforcer-plugin\3.0.0-SNAPSHOT\maven-enforcer-plugin-3.0.0-SNAPSHOT.pom
[windows-jdk8-m3.5.x_build] [withMaven] artifactsPublisher - Archive artifact windows-jdk8-m3.5.x_build\maven-enforcer-plugin\target\maven-enforcer-plugin-3.0.0-SNAPSHOT.jar under org\apache\maven\plugins\maven-enforcer-plugin\3.0.0-SNAPSHOT\maven-enforcer-plugin-3.0.0-SNAPSHOT.jar
[windows-jdk8-m3.5.x_build] [withMaven] junitPublisher - Archive test results for Maven artifact org.apache.maven.enforcer:enforcer-api:3.0.0-SNAPSHOT generated by maven-surefire-plugin:test (default-test): windows-jdk8-m3.5.x_build\enforcer-api\target\surefire-reports\*.xml
[windows-jdk8-m3.5.x_build] Recording test results
[windows-jdk8-m3.5.x_build] None of the test reports contained any result
[windows-jdk8-m3.5.x_build] [withMaven] junitPublisher - Archive test results for Maven artifact org.apache.maven.enforcer:enforcer-rules:3.0.0-SNAPSHOT generated by maven-surefire-plugin:test (default-test): windows-jdk8-m3.5.x_build\enforcer-rules\target\surefire-reports\*.xml
[windows-jdk8-m3.5.x_build] Recording test results
[windows-jdk8-m3.5.x_build] [withMaven] junitPublisher - Archive test results for Maven artifact org.apache.maven.plugins:maven-enforcer-plugin:3.0.0-SNAPSHOT generated by maven-surefire-plugin:test (default-test): windows-jdk8-m3.5.x_build\maven-enforcer-plugin\target\surefire-reports\*.xml
[windows-jdk8-m3.5.x_build] Recording test results
[windows-jdk8-m3.5.x_build] [withMaven] openTasksPublisher - Scan Tasks for Maven artifact org.apache.maven.enforcer:enforcer-api:3.0.0-SNAPSHOT in source directory windows-jdk8-m3.5.x_build\enforcer-api\src\main\java
[windows-jdk8-m3.5.x_build] [withMaven] openTasksPublisher - Scan Tasks for Maven artifact org.apache.maven.enforcer:enforcer-rules:3.0.0-SNAPSHOT in source directory windows-jdk8-m3.5.x_build\enforcer-rules\src\main\java
[windows-jdk8-m3.5.x_build] [withMaven] openTasksPublisher - Scan Tasks for Maven artifact org.apache.maven.plugins:maven-enforcer-plugin:3.0.0-SNAPSHOT in source directory windows-jdk8-m3.5.x_build\maven-enforcer-plugin\src\main\java
[windows-jdk8-m3.5.x_build] [TASKS] Scanning folder 'f:\jenkins\jenkins-slave\workspace\aven-enforcer_MENFORCER-314-VFKMERYZ2Y5UXWYHIHENFPSBJDRGBNTZUUUA5J765JQRA6W2EOKQ@2' for files matching the pattern 'windows-jdk8-m3.5.x_build\enforcer-api\src\main\java\**\*,windows-jdk8-m3.5.x_build\enforcer-rules\src\main\java\**\*,windows-jdk8-m3.5.x_build\maven-enforcer-plugin\src\main\java\**\*' - excludes: null
[windows-jdk8-m3.5.x_build] [TASKS] Found 51 files to scan for tasks
[windows-jdk8-m3.5.x_build] [TASKS] Found 5 open tasks.
[windows-jdk8-m3.5.x_build] Skipping warnings blame since pipelines do not have an SCM link.%n
[windows-jdk8-m3.5.x_build] [TASKS] Computing warning deltas based on reference build #3
[windows-jdk8-m3.5.x_build] [withMaven] invokerPublisher - Archive invoker results for Maven artifact MavenArtifact{org.apache.maven.plugins:maven-enforcer-plugin::3.0.0-SNAPSHOT(version: 3.0.0-SNAPSHOT, snapshot:false) } generated by PluginInvocation{org.apache.maven.plugins:maven-invoker-plugin:3.1.0@run integration-test}: windows-jdk8-m3.5.x_build\maven-enforcer-plugin\target\invoker-reports\*.xml
[Pipeline] [windows-jdk8-m3.5.x_build] // withMaven
[Pipeline] [windows-jdk8-m3.5.x_build] cleanWs
[Pipeline] [windows-jdk7-m3.3.x_build] }
[Pipeline] [windows-jdk7-m3.3.x_build] // dir
[windows-jdk8-m3.5.x_build] [WS-CLEANUP] Deleting project workspace...Cannot delete workspace :remote file operation failed: f:\jenkins\jenkins-slave\workspace\aven-enforcer_MENFORCER-314-VFKMERYZ2Y5UXWYHIHENFPSBJDRGBNTZUUUA5J765JQRA6W2EOKQ@2 at hudson.remoting.Channel@7f96cc69:JNLP4-connect connection from 37.48.69.226/37.48.69.226:63010: java.nio.file.AccessDeniedException: f:\jenkins\jenkins-slave\workspace\aven-enforcer_MENFORCER-314-VFKMERYZ2Y5UXWYHIHENFPSBJDRGBNTZUUUA5J765JQRA6W2EOKQ@2 -> f:\jenkins\jenkins-slave\workspace\aven-enforcer_MENFORCER-314-VFKMERYZ2Y5UXWYHIHENFPSBJDRGBNTZUUUA5J765JQRA6W2EOKQ@2_ws-cleanup_1546147924956
[windows-jdk7-m3.5.x_build] [INFO] require-upper-bound-dependencies-unique_success\pom.xml SUCCESS (7.0 s)
[windows-jdk7-m3.5.x_build] [INFO] Building: require-upper-bound-deps_failure\pom.xml
[windows-jdk7-m3.5.x_build] [INFO] run post-build script verify.groovy
[windows-jdk7-m3.5.x_build] [INFO] require-upper-bound-deps_failure\pom.xml ......... SUCCESS (6.6 s)
[windows-jdk7-m3.5.x_build] [INFO] Building: require-upper-bound-deps_ignored\pom.xml
[windows-jdk7-m3.5.x_build] [INFO] run post-build script verify.groovy
[windows-jdk7-m3.5.x_build] [INFO] require-upper-bound-deps_ignored\pom.xml ......... SUCCESS (6.9 s)
[windows-jdk7-m3.5.x_build] [INFO] Building: require-upper-bound-deps_success\pom.xml
[windows-jdk7-m3.5.x_build] [INFO] require-upper-bound-deps_success\pom.xml ......... SUCCESS (6.0 s)
[windows-jdk7-m3.5.x_build] [INFO] Building: resolve_collect_dependencies\pom.xml
[Pipeline] [windows-jdk7-m3.3.x_build] }
[windows-jdk7-m3.3.x_build] [withMaven] artifactsPublisher - Archive artifact windows-jdk7-m3.3.x_build\pom.xml under org\apache\maven\enforcer\enforcer\3.0.0-SNAPSHOT\enforcer-3.0.0-SNAPSHOT.pom
[windows-jdk7-m3.3.x_build] [withMaven] artifactsPublisher - Archive artifact windows-jdk7-m3.3.x_build\target\enforcer-3.0.0-SNAPSHOT-site.xml under org\apache\maven\enforcer\enforcer\3.0.0-SNAPSHOT\enforcer-3.0.0-SNAPSHOT-site.xml
[windows-jdk7-m3.3.x_build] [withMaven] artifactsPublisher - Archive artifact windows-jdk7-m3.3.x_build\enforcer-api\pom.xml under org\apache\maven\enforcer\enforcer-api\3.0.0-SNAPSHOT\enforcer-api-3.0.0-SNAPSHOT.pom
[windows-jdk7-m3.3.x_build] [withMaven] artifactsPublisher - Archive artifact windows-jdk7-m3.3.x_build\enforcer-api\target\enforcer-api-3.0.0-SNAPSHOT.jar under org\apache\maven\enforcer\enforcer-api\3.0.0-SNAPSHOT\enforcer-api-3.0.0-SNAPSHOT.jar
[windows-jdk7-m3.3.x_build] [withMaven] artifactsPublisher - Archive artifact windows-jdk7-m3.3.x_build\enforcer-rules\pom.xml under org\apache\maven\enforcer\enforcer-rules\3.0.0-SNAPSHOT\enforcer-rules-3.0.0-SNAPSHOT.pom
[windows-jdk7-m3.3.x_build] [withMaven] artifactsPublisher - Archive artifact windows-jdk7-m3.3.x_build\enforcer-rules\target\enforcer-rules-3.0.0-SNAPSHOT.jar under org\apache\maven\enforcer\enforcer-rules\3.0.0-SNAPSHOT\enforcer-rules-3.0.0-SNAPSHOT.jar
[windows-jdk7-m3.3.x_build] [withMaven] artifactsPublisher - Archive artifact windows-jdk7-m3.3.x_build\enforcer-rules\target\enforcer-rules-3.0.0-SNAPSHOT-tests.jar under org\apache\maven\enforcer\enforcer-rules\3.0.0-SNAPSHOT\enforcer-rules-3.0.0-SNAPSHOT-tests.jar
[windows-jdk7-m3.3.x_build] [withMaven] artifactsPublisher - Archive artifact windows-jdk7-m3.3.x_build\maven-enforcer-plugin\pom.xml under org\apache\maven\plugins\maven-enforcer-plugin\3.0.0-SNAPSHOT\maven-enforcer-plugin-3.0.0-SNAPSHOT.pom
[windows-jdk7-m3.3.x_build] [withMaven] artifactsPublisher - Archive artifact windows-jdk7-m3.3.x_build\maven-enforcer-plugin\target\maven-enforcer-plugin-3.0.0-SNAPSHOT.jar under org\apache\maven\plugins\maven-enforcer-plugin\3.0.0-SNAPSHOT\maven-enforcer-plugin-3.0.0-SNAPSHOT.jar
[windows-jdk7-m3.3.x_build] [withMaven] junitPublisher - Archive test results for Maven artifact org.apache.maven.enforcer:enforcer-api:3.0.0-SNAPSHOT generated by maven-surefire-plugin:test (default-test): windows-jdk7-m3.3.x_build\enforcer-api\target\surefire-reports\*.xml
[windows-jdk7-m3.3.x_build] Recording test results
[windows-jdk7-m3.3.x_build] None of the test reports contained any result
[windows-jdk7-m3.3.x_build] [withMaven] junitPublisher - Archive test results for Maven artifact org.apache.maven.enforcer:enforcer-rules:3.0.0-SNAPSHOT generated by maven-surefire-plugin:test (default-test): windows-jdk7-m3.3.x_build\enforcer-rules\target\surefire-reports\*.xml
[windows-jdk7-m3.3.x_build] Recording test results
[windows-jdk7-m3.3.x_build] [withMaven] junitPublisher - Archive test results for Maven artifact org.apache.maven.plugins:maven-enforcer-plugin:3.0.0-SNAPSHOT generated by maven-surefire-plugin:test (default-test): windows-jdk7-m3.3.x_build\maven-enforcer-plugin\target\surefire-reports\*.xml
[windows-jdk7-m3.3.x_build] Recording test results
[windows-jdk7-m3.3.x_build] [withMaven] openTasksPublisher - Scan Tasks for Maven artifact org.apache.maven.enforcer:enforcer-api:3.0.0-SNAPSHOT in source directory windows-jdk7-m3.3.x_build\enforcer-api\src\main\java
[windows-jdk7-m3.3.x_build] [withMaven] openTasksPublisher - Scan Tasks for Maven artifact org.apache.maven.enforcer:enforcer-rules:3.0.0-SNAPSHOT in source directory windows-jdk7-m3.3.x_build\enforcer-rules\src\main\java
[windows-jdk7-m3.3.x_build] [withMaven] openTasksPublisher - Scan Tasks for Maven artifact org.apache.maven.plugins:maven-enforcer-plugin:3.0.0-SNAPSHOT in source directory windows-jdk7-m3.3.x_build\maven-enforcer-plugin\src\main\java
[windows-jdk7-m3.3.x_build] [TASKS] Scanning folder 'f:\jenkins\jenkins-slave\workspace\aven-enforcer_MENFORCER-314-VFKMERYZ2Y5UXWYHIHENFPSBJDRGBNTZUUUA5J765JQRA6W2EOKQ@2' for files matching the pattern 'windows-jdk7-m3.3.x_build\enforcer-api\src\main\java\**\*,windows-jdk7-m3.3.x_build\enforcer-rules\src\main\java\**\*,windows-jdk7-m3.3.x_build\maven-enforcer-plugin\src\main\java\**\*' - excludes: null
[windows-jdk7-m3.3.x_build] [TASKS] Found 51 files to scan for tasks
[windows-jdk7-m3.3.x_build] [TASKS] Found 5 open tasks.
[windows-jdk7-m3.3.x_build] Skipping warnings blame since pipelines do not have an SCM link.%n
[windows-jdk7-m3.3.x_build] [TASKS] Computing warning deltas based on reference build #3
[windows-jdk7-m3.3.x_build] [withMaven] invokerPublisher - Archive invoker results for Maven artifact MavenArtifact{org.apache.maven.plugins:maven-enforcer-plugin::3.0.0-SNAPSHOT(version: 3.0.0-SNAPSHOT, snapshot:false) } generated by PluginInvocation{org.apache.maven.plugins:maven-invoker-plugin:3.1.0@run integration-test}: windows-jdk7-m3.3.x_build\maven-enforcer-plugin\target\invoker-reports\*.xml
[Pipeline] [windows-jdk7-m3.3.x_build] // withMaven
[Pipeline] [windows-jdk8-m3.5.x_build] }
[Pipeline] [windows-jdk7-m3.3.x_build] cleanWs
[Pipeline] [windows-jdk8-m3.5.x_build] // stage
[windows-jdk7-m3.3.x_build] [WS-CLEANUP] Deleting project workspace...Cannot delete workspace :remote file operation failed: f:\jenkins\jenkins-slave\workspace\aven-enforcer_MENFORCER-314-VFKMERYZ2Y5UXWYHIHENFPSBJDRGBNTZUUUA5J765JQRA6W2EOKQ@2 at hudson.remoting.Channel@121270d5:JNLP4-connect connection from 37.48.69.226/37.48.69.226:54213: java.nio.file.AccessDeniedException: f:\jenkins\jenkins-slave\workspace\aven-enforcer_MENFORCER-314-VFKMERYZ2Y5UXWYHIHENFPSBJDRGBNTZUUUA5J765JQRA6W2EOKQ@2 -> f:\jenkins\jenkins-slave\workspace\aven-enforcer_MENFORCER-314-VFKMERYZ2Y5UXWYHIHENFPSBJDRGBNTZUUUA5J765JQRA6W2EOKQ@2_ws-cleanup_1546147952073
[Pipeline] [windows-jdk8-m3.5.x_build] }
[Pipeline] [windows-jdk8-m3.5.x_build] // ws
[Pipeline] [windows-jdk8-m3.5.x_build] }
[Pipeline] [windows-jdk7-m3.3.x_build] }
[Pipeline] [windows-jdk8-m3.5.x_build] // node
[Pipeline] [windows-jdk7-m3.3.x_build] // stage
[Pipeline] [windows-jdk8-m3.5.x_build] }
[windows-jdk8-m3.5.x_build] Failed in branch windows-jdk8-m3.5.x_build
[Pipeline] [windows-jdk7-m3.3.x_build] }
[Pipeline] [windows-jdk7-m3.3.x_build] // ws
[Pipeline] [windows-jdk7-m3.3.x_build] }
[Pipeline] [windows-jdk7-m3.3.x_build] // node
[Pipeline] [windows-jdk7-m3.3.x_build] }
[windows-jdk7-m3.3.x_build] Failed in branch windows-jdk7-m3.3.x_build
[windows-jdk7-m3.5.x_build] [INFO] run post-build script verify.groovy
[windows-jdk7-m3.5.x_build] [INFO] resolve_collect_dependencies\pom.xml ............. SUCCESS (11.1 s)
[windows-jdk7-m3.5.x_build] [INFO] -------------------------------------------------
[windows-jdk7-m3.5.x_build] [INFO] Build Summary:
[windows-jdk7-m3.5.x_build] [INFO] Passed: 68, Failed: 0, Errors: 0, Skipped: 0
[windows-jdk7-m3.5.x_build] [INFO] -------------------------------------------------
[windows-jdk7-m3.5.x_build] [INFO]
[windows-jdk7-m3.5.x_build] [INFO] --- mrm-maven-plugin:1.0.0:stop (default) @ maven-enforcer-plugin ---
[windows-jdk7-m3.5.x_build] [INFO] Stopping Mock Repository Manager on http://localhost:57786
[windows-jdk7-m3.5.x_build] [INFO] Mock Repository Manager http://localhost:57786 is stopped.
[windows-jdk7-m3.5.x_build] [INFO]
[windows-jdk7-m3.5.x_build] [INFO] --- maven-checkstyle-plugin:3.0.0:check (checkstyle-check) @ maven-enforcer-plugin ---
[windows-jdk7-m3.5.x_build] [INFO] ------------------------------------------------------------------------
[windows-jdk7-m3.5.x_build] [INFO] Reactor Summary:
[windows-jdk7-m3.5.x_build] [INFO]
[windows-jdk7-m3.5.x_build] [INFO] Apache Maven Enforcer .............................. SUCCESS [ 49.680 s]
[windows-jdk7-m3.5.x_build] [INFO] Apache Maven Enforcer API .......................... SUCCESS [ 10.231 s]
[windows-jdk7-m3.5.x_build] [INFO] Apache Maven Enforcer Built-In Rules ............... SUCCESS [ 21.869 s]
[windows-jdk7-m3.5.x_build] [INFO] Apache Maven Enforcer Plugin ....................... SUCCESS [08:07 min]
[windows-jdk7-m3.5.x_build] [INFO] ------------------------------------------------------------------------
[windows-jdk7-m3.5.x_build] [INFO] BUILD SUCCESS
[windows-jdk7-m3.5.x_build] [INFO] ------------------------------------------------------------------------
[windows-jdk7-m3.5.x_build] [INFO] Total time: 09:30 min
[windows-jdk7-m3.5.x_build] [INFO] Finished at: 2018-12-29T21:32:42-08:00
[windows-jdk7-m3.5.x_build] [INFO] Final Memory: 52M/486M
[windows-jdk7-m3.5.x_build] [INFO] ------------------------------------------------------------------------
[windows-jdk7-m3.5.x_build] [INFO] [jenkins-event-spy] Generated F:\jenkins\jenkins-slave\workspace\aven-enforcer_MENFORCER-314-VFKMERYZ2Y5UXWYHIHENFPSBJDRGBNTZUUUA5J765JQRA6W2EOKQ@3@2@tmp\withMaven6d49666a\maven-spy-20181229-212311-917466901856175555399.log
[windows-jdk7-m3.5.x_build] Picked up JAVA_TOOL_OPTIONS: -Dmaven.ext.class.path="f:\jenkins\jenkins-slave\workspace\aven-enforcer_MENFORCER-314-VFKMERYZ2Y5UXWYHIHENFPSBJDRGBNTZUUUA5J765JQRA6W2EOKQ@3@2@tmp\withMaven6d49666a\pipeline-maven-spy.jar" -Dorg.jenkinsci.plugins.pipeline.maven.reportsFolder="f:\jenkins\jenkins-slave\workspace\aven-enforcer_MENFORCER-314-VFKMERYZ2Y5UXWYHIHENFPSBJDRGBNTZUUUA5J765JQRA6W2EOKQ@3@2@tmp\withMaven6d49666a"
[Pipeline] [windows-jdk7-m3.5.x_build] }
[Pipeline] [windows-jdk7-m3.5.x_build] // dir
[Pipeline] [windows-jdk7-m3.5.x_build] }
[windows-jdk7-m3.5.x_build] [withMaven] artifactsPublisher - Archive artifact windows-jdk7-m3.5.x_build\pom.xml under org\apache\maven\enforcer\enforcer\3.0.0-SNAPSHOT\enforcer-3.0.0-SNAPSHOT.pom
[windows-jdk7-m3.5.x_build] [withMaven] artifactsPublisher - Archive artifact windows-jdk7-m3.5.x_build\target\enforcer-3.0.0-SNAPSHOT-site.xml under org\apache\maven\enforcer\enforcer\3.0.0-SNAPSHOT\enforcer-3.0.0-SNAPSHOT-site.xml
[windows-jdk7-m3.5.x_build] [withMaven] artifactsPublisher - Archive artifact windows-jdk7-m3.5.x_build\enforcer-api\pom.xml under org\apache\maven\enforcer\enforcer-api\3.0.0-SNAPSHOT\enforcer-api-3.0.0-SNAPSHOT.pom
[windows-jdk7-m3.5.x_build] [withMaven] artifactsPublisher - Archive artifact windows-jdk7-m3.5.x_build\enforcer-api\target\enforcer-api-3.0.0-SNAPSHOT.jar under org\apache\maven\enforcer\enforcer-api\3.0.0-SNAPSHOT\enforcer-api-3.0.0-SNAPSHOT.jar
[windows-jdk7-m3.5.x_build] [withMaven] artifactsPublisher - Archive artifact windows-jdk7-m3.5.x_build\enforcer-rules\pom.xml under org\apache\maven\enforcer\enforcer-rules\3.0.0-SNAPSHOT\enforcer-rules-3.0.0-SNAPSHOT.pom
[windows-jdk7-m3.5.x_build] [withMaven] artifactsPublisher - Archive artifact windows-jdk7-m3.5.x_build\enforcer-rules\target\enforcer-rules-3.0.0-SNAPSHOT.jar under org\apache\maven\enforcer\enforcer-rules\3.0.0-SNAPSHOT\enforcer-rules-3.0.0-SNAPSHOT.jar
[windows-jdk7-m3.5.x_build] [withMaven] artifactsPublisher - Archive artifact windows-jdk7-m3.5.x_build\enforcer-rules\target\enforcer-rules-3.0.0-SNAPSHOT-tests.jar under org\apache\maven\enforcer\enforcer-rules\3.0.0-SNAPSHOT\enforcer-rules-3.0.0-SNAPSHOT-tests.jar
[windows-jdk7-m3.5.x_build] [withMaven] artifactsPublisher - Archive artifact windows-jdk7-m3.5.x_build\maven-enforcer-plugin\pom.xml under org\apache\maven\plugins\maven-enforcer-plugin\3.0.0-SNAPSHOT\maven-enforcer-plugin-3.0.0-SNAPSHOT.pom
[windows-jdk7-m3.5.x_build] [withMaven] artifactsPublisher - Archive artifact windows-jdk7-m3.5.x_build\maven-enforcer-plugin\target\maven-enforcer-plugin-3.0.0-SNAPSHOT.jar under org\apache\maven\plugins\maven-enforcer-plugin\3.0.0-SNAPSHOT\maven-enforcer-plugin-3.0.0-SNAPSHOT.jar
[windows-jdk7-m3.5.x_build] [withMaven] junitPublisher - Archive test results for Maven artifact org.apache.maven.enforcer:enforcer-api:3.0.0-SNAPSHOT generated by maven-surefire-plugin:test (default-test): windows-jdk7-m3.5.x_build\enforcer-api\target\surefire-reports\*.xml
[windows-jdk7-m3.5.x_build] Recording test results
[windows-jdk7-m3.5.x_build] None of the test reports contained any result
[windows-jdk7-m3.5.x_build] [withMaven] junitPublisher - Archive test results for Maven artifact org.apache.maven.enforcer:enforcer-rules:3.0.0-SNAPSHOT generated by maven-surefire-plugin:test (default-test): windows-jdk7-m3.5.x_build\enforcer-rules\target\surefire-reports\*.xml
[windows-jdk7-m3.5.x_build] Recording test results
[windows-jdk7-m3.5.x_build] [withMaven] junitPublisher - Archive test results for Maven artifact org.apache.maven.plugins:maven-enforcer-plugin:3.0.0-SNAPSHOT generated by maven-surefire-plugin:test (default-test): windows-jdk7-m3.5.x_build\maven-enforcer-plugin\target\surefire-reports\*.xml
[windows-jdk7-m3.5.x_build] Recording test results
[windows-jdk7-m3.5.x_build] [withMaven] openTasksPublisher - Scan Tasks for Maven artifact org.apache.maven.enforcer:enforcer-api:3.0.0-SNAPSHOT in source directory windows-jdk7-m3.5.x_build\enforcer-api\src\main\java
[windows-jdk7-m3.5.x_build] [withMaven] openTasksPublisher - Scan Tasks for Maven artifact org.apache.maven.enforcer:enforcer-rules:3.0.0-SNAPSHOT in source directory windows-jdk7-m3.5.x_build\enforcer-rules\src\main\java
[windows-jdk7-m3.5.x_build] [withMaven] openTasksPublisher - Scan Tasks for Maven artifact org.apache.maven.plugins:maven-enforcer-plugin:3.0.0-SNAPSHOT in source directory windows-jdk7-m3.5.x_build\maven-enforcer-plugin\src\main\java
[windows-jdk7-m3.5.x_build] [TASKS] Scanning folder 'f:\jenkins\jenkins-slave\workspace\aven-enforcer_MENFORCER-314-VFKMERYZ2Y5UXWYHIHENFPSBJDRGBNTZUUUA5J765JQRA6W2EOKQ@3@2' for files matching the pattern 'windows-jdk7-m3.5.x_build\enforcer-api\src\main\java\**\*,windows-jdk7-m3.5.x_build\enforcer-rules\src\main\java\**\*,windows-jdk7-m3.5.x_build\maven-enforcer-plugin\src\main\java\**\*' - excludes: null
[windows-jdk7-m3.5.x_build] [TASKS] Found 51 files to scan for tasks
[windows-jdk7-m3.5.x_build] [TASKS] Found 5 open tasks.
[windows-jdk7-m3.5.x_build] Skipping warnings blame since pipelines do not have an SCM link.%n
[windows-jdk7-m3.5.x_build] [TASKS] Computing warning deltas based on reference build #3
[windows-jdk7-m3.5.x_build] [withMaven] invokerPublisher - Archive invoker results for Maven artifact MavenArtifact{org.apache.maven.plugins:maven-enforcer-plugin::3.0.0-SNAPSHOT(version: 3.0.0-SNAPSHOT, snapshot:false) } generated by PluginInvocation{org.apache.maven.plugins:maven-invoker-plugin:3.1.0@run integration-test}: windows-jdk7-m3.5.x_build\maven-enforcer-plugin\target\invoker-reports\*.xml
[Pipeline] [windows-jdk7-m3.5.x_build] // withMaven
[Pipeline] [windows-jdk7-m3.5.x_build] cleanWs
[windows-jdk7-m3.5.x_build] [WS-CLEANUP] Deleting project workspace...Cannot delete workspace :remote file operation failed: f:\jenkins\jenkins-slave\workspace\aven-enforcer_MENFORCER-314-VFKMERYZ2Y5UXWYHIHENFPSBJDRGBNTZUUUA5J765JQRA6W2EOKQ@3@2 at hudson.remoting.Channel@121270d5:JNLP4-connect connection from 37.48.69.226/37.48.69.226:54213: java.nio.file.AccessDeniedException: f:\jenkins\jenkins-slave\workspace\aven-enforcer_MENFORCER-314-VFKMERYZ2Y5UXWYHIHENFPSBJDRGBNTZUUUA5J765JQRA6W2EOKQ@3@2 -> f:\jenkins\jenkins-slave\workspace\aven-enforcer_MENFORCER-314-VFKMERYZ2Y5UXWYHIHENFPSBJDRGBNTZUUUA5J765JQRA6W2EOKQ@3@2_ws-cleanup_1546147992611
[Pipeline] [windows-jdk7-m3.5.x_build] }
[Pipeline] [windows-jdk7-m3.5.x_build] // stage
[Pipeline] [windows-jdk7-m3.5.x_build] }
[Pipeline] [windows-jdk7-m3.5.x_build] // ws
[Pipeline] [windows-jdk7-m3.5.x_build] }
[Pipeline] [windows-jdk7-m3.5.x_build] // node
[Pipeline] [windows-jdk7-m3.5.x_build] }
[windows-jdk7-m3.5.x_build] Failed in branch windows-jdk7-m3.5.x_build
[Pipeline] // parallel
[Pipeline] stage
[Pipeline] { (Notifications)
[Pipeline] echo
Build result: FAILURE
[Pipeline] jiraIssueSelector
[Pipeline] emailext
Build succeeded in Jenkins: Maven TLP » maven-enforcer » MENFORCER-314 #6
Posted by Apache Jenkins Server <je...@builds.apache.org>.
See https://builds.apache.org/job/maven-box/job/maven-enforcer/job/MENFORCER-314/6/
Changes:
* Disable cleanWs() due to issues with file handles on Windows
* added a link to asf-gitpubsub-jenkins-plugin
* fixed markup (asciidoc, not markdown...)
All tests passed
Build succeeded in Jenkins: Maven TLP » maven-enforcer » MENFORCER-314 #5
Posted by Apache Jenkins Server <je...@builds.apache.org>.
See https://builds.apache.org/job/maven-box/job/maven-enforcer/job/MENFORCER-314/5/
Changes:
* use a special local repo to have a bit of caching
* add mavenLinkerPublisher
All tests passed