You are viewing a plain text version of this content. The canonical link for it is here.
Posted to dev@lucene.apache.org by Policeman Jenkins Server <je...@thetaphi.de> on 2015/08/17 01:53:16 UTC
[JENKINS] Lucene-Solr-trunk-Windows (64bit/jdk1.8.0_51) - Build #
5161 - Failure!
Build: http://jenkins.thetaphi.de/job/Lucene-Solr-trunk-Windows/5161/
Java: 64bit/jdk1.8.0_51 -XX:-UseCompressedOops -XX:+UseParallelGC
2 tests failed.
FAILED: org.apache.solr.cloud.CdcrReplicationHandlerTest.doTest
Error Message:
There are still nodes recoverying - waited for 330 seconds
Stack Trace:
java.lang.AssertionError: There are still nodes recoverying - waited for 330 seconds
at __randomizedtesting.SeedInfo.seed([A64E87B43ED22D4:AD2050DF2E56316D]:0)
at org.junit.Assert.fail(Assert.java:93)
at org.apache.solr.cloud.AbstractDistribZkTestBase.waitForRecoveriesToFinish(AbstractDistribZkTestBase.java:172)
at org.apache.solr.cloud.AbstractDistribZkTestBase.waitForRecoveriesToFinish(AbstractDistribZkTestBase.java:133)
at org.apache.solr.cloud.AbstractDistribZkTestBase.waitForRecoveriesToFinish(AbstractDistribZkTestBase.java:128)
at org.apache.solr.cloud.BaseCdcrDistributedZkTest.waitForRecoveriesToFinish(BaseCdcrDistributedZkTest.java:465)
at org.apache.solr.cloud.BaseCdcrDistributedZkTest.clearSourceCollection(BaseCdcrDistributedZkTest.java:319)
at org.apache.solr.cloud.CdcrReplicationHandlerTest.doTestFullReplication(CdcrReplicationHandlerTest.java:61)
at org.apache.solr.cloud.CdcrReplicationHandlerTest.doTest(CdcrReplicationHandlerTest.java:50)
at sun.reflect.NativeMethodAccessorImpl.invoke0(Native Method)
at sun.reflect.NativeMethodAccessorImpl.invoke(NativeMethodAccessorImpl.java:62)
at sun.reflect.DelegatingMethodAccessorImpl.invoke(DelegatingMethodAccessorImpl.java:43)
at java.lang.reflect.Method.invoke(Method.java:497)
at com.carrotsearch.randomizedtesting.RandomizedRunner.invoke(RandomizedRunner.java:1627)
at com.carrotsearch.randomizedtesting.RandomizedRunner$6.evaluate(RandomizedRunner.java:836)
at com.carrotsearch.randomizedtesting.RandomizedRunner$7.evaluate(RandomizedRunner.java:872)
at com.carrotsearch.randomizedtesting.RandomizedRunner$8.evaluate(RandomizedRunner.java:886)
at org.apache.solr.BaseDistributedSearchTestCase$ShardsRepeatRule$ShardsFixedStatement.callStatement(BaseDistributedSearchTestCase.java:963)
at org.apache.solr.BaseDistributedSearchTestCase$ShardsRepeatRule$ShardsStatement.evaluate(BaseDistributedSearchTestCase.java:938)
at com.carrotsearch.randomizedtesting.rules.SystemPropertiesRestoreRule$1.evaluate(SystemPropertiesRestoreRule.java:57)
at org.apache.lucene.util.TestRuleSetupTeardownChained$1.evaluate(TestRuleSetupTeardownChained.java:50)
at org.apache.lucene.util.AbstractBeforeAfterRule$1.evaluate(AbstractBeforeAfterRule.java:46)
at org.apache.lucene.util.TestRuleThreadAndTestName$1.evaluate(TestRuleThreadAndTestName.java:49)
at org.apache.lucene.util.TestRuleIgnoreAfterMaxFailures$1.evaluate(TestRuleIgnoreAfterMaxFailures.java:65)
at org.apache.lucene.util.TestRuleMarkFailure$1.evaluate(TestRuleMarkFailure.java:48)
at com.carrotsearch.randomizedtesting.rules.StatementAdapter.evaluate(StatementAdapter.java:36)
at com.carrotsearch.randomizedtesting.ThreadLeakControl$StatementRunner.run(ThreadLeakControl.java:365)
at com.carrotsearch.randomizedtesting.ThreadLeakControl.forkTimeoutingTask(ThreadLeakControl.java:798)
at com.carrotsearch.randomizedtesting.ThreadLeakControl$3.evaluate(ThreadLeakControl.java:458)
at com.carrotsearch.randomizedtesting.RandomizedRunner.runSingleTest(RandomizedRunner.java:845)
at com.carrotsearch.randomizedtesting.RandomizedRunner$3.evaluate(RandomizedRunner.java:747)
at com.carrotsearch.randomizedtesting.RandomizedRunner$4.evaluate(RandomizedRunner.java:781)
at com.carrotsearch.randomizedtesting.RandomizedRunner$5.evaluate(RandomizedRunner.java:792)
at com.carrotsearch.randomizedtesting.rules.StatementAdapter.evaluate(StatementAdapter.java:36)
at com.carrotsearch.randomizedtesting.rules.SystemPropertiesRestoreRule$1.evaluate(SystemPropertiesRestoreRule.java:57)
at org.apache.lucene.util.AbstractBeforeAfterRule$1.evaluate(AbstractBeforeAfterRule.java:46)
at com.carrotsearch.randomizedtesting.rules.StatementAdapter.evaluate(StatementAdapter.java:36)
at org.apache.lucene.util.TestRuleStoreClassName$1.evaluate(TestRuleStoreClassName.java:42)
at com.carrotsearch.randomizedtesting.rules.NoShadowingOrOverridesOnMethodsRule$1.evaluate(NoShadowingOrOverridesOnMethodsRule.java:39)
at com.carrotsearch.randomizedtesting.rules.NoShadowingOrOverridesOnMethodsRule$1.evaluate(NoShadowingOrOverridesOnMethodsRule.java:39)
at com.carrotsearch.randomizedtesting.rules.StatementAdapter.evaluate(StatementAdapter.java:36)
at com.carrotsearch.randomizedtesting.rules.StatementAdapter.evaluate(StatementAdapter.java:36)
at com.carrotsearch.randomizedtesting.rules.StatementAdapter.evaluate(StatementAdapter.java:36)
at org.apache.lucene.util.TestRuleAssertionsRequired$1.evaluate(TestRuleAssertionsRequired.java:54)
at org.apache.lucene.util.TestRuleMarkFailure$1.evaluate(TestRuleMarkFailure.java:48)
at org.apache.lucene.util.TestRuleIgnoreAfterMaxFailures$1.evaluate(TestRuleIgnoreAfterMaxFailures.java:65)
at org.apache.lucene.util.TestRuleIgnoreTestSuites$1.evaluate(TestRuleIgnoreTestSuites.java:55)
at com.carrotsearch.randomizedtesting.rules.StatementAdapter.evaluate(StatementAdapter.java:36)
at com.carrotsearch.randomizedtesting.ThreadLeakControl$StatementRunner.run(ThreadLeakControl.java:365)
at java.lang.Thread.run(Thread.java:745)
FAILED: org.apache.solr.security.TestAuthorizationFramework.authorizationFrameworkTest
Error Message:
This should have failed
Stack Trace:
java.lang.AssertionError: This should have failed
at __randomizedtesting.SeedInfo.seed([A64E87B43ED22D4:44C79DA8523633C4]:0)
at org.junit.Assert.fail(Assert.java:93)
at org.apache.solr.security.TestAuthorizationFramework.authorizationFrameworkTest(TestAuthorizationFramework.java:69)
at sun.reflect.NativeMethodAccessorImpl.invoke0(Native Method)
at sun.reflect.NativeMethodAccessorImpl.invoke(NativeMethodAccessorImpl.java:62)
at sun.reflect.DelegatingMethodAccessorImpl.invoke(DelegatingMethodAccessorImpl.java:43)
at java.lang.reflect.Method.invoke(Method.java:497)
at com.carrotsearch.randomizedtesting.RandomizedRunner.invoke(RandomizedRunner.java:1627)
at com.carrotsearch.randomizedtesting.RandomizedRunner$6.evaluate(RandomizedRunner.java:836)
at com.carrotsearch.randomizedtesting.RandomizedRunner$7.evaluate(RandomizedRunner.java:872)
at com.carrotsearch.randomizedtesting.RandomizedRunner$8.evaluate(RandomizedRunner.java:886)
at org.apache.solr.BaseDistributedSearchTestCase$ShardsRepeatRule$ShardsFixedStatement.callStatement(BaseDistributedSearchTestCase.java:963)
at org.apache.solr.BaseDistributedSearchTestCase$ShardsRepeatRule$ShardsStatement.evaluate(BaseDistributedSearchTestCase.java:938)
at com.carrotsearch.randomizedtesting.rules.SystemPropertiesRestoreRule$1.evaluate(SystemPropertiesRestoreRule.java:57)
at org.apache.lucene.util.TestRuleSetupTeardownChained$1.evaluate(TestRuleSetupTeardownChained.java:50)
at org.apache.lucene.util.AbstractBeforeAfterRule$1.evaluate(AbstractBeforeAfterRule.java:46)
at org.apache.lucene.util.TestRuleThreadAndTestName$1.evaluate(TestRuleThreadAndTestName.java:49)
at org.apache.lucene.util.TestRuleIgnoreAfterMaxFailures$1.evaluate(TestRuleIgnoreAfterMaxFailures.java:65)
at org.apache.lucene.util.TestRuleMarkFailure$1.evaluate(TestRuleMarkFailure.java:48)
at com.carrotsearch.randomizedtesting.rules.StatementAdapter.evaluate(StatementAdapter.java:36)
at com.carrotsearch.randomizedtesting.ThreadLeakControl$StatementRunner.run(ThreadLeakControl.java:365)
at com.carrotsearch.randomizedtesting.ThreadLeakControl.forkTimeoutingTask(ThreadLeakControl.java:798)
at com.carrotsearch.randomizedtesting.ThreadLeakControl$3.evaluate(ThreadLeakControl.java:458)
at com.carrotsearch.randomizedtesting.RandomizedRunner.runSingleTest(RandomizedRunner.java:845)
at com.carrotsearch.randomizedtesting.RandomizedRunner$3.evaluate(RandomizedRunner.java:747)
at com.carrotsearch.randomizedtesting.RandomizedRunner$4.evaluate(RandomizedRunner.java:781)
at com.carrotsearch.randomizedtesting.RandomizedRunner$5.evaluate(RandomizedRunner.java:792)
at com.carrotsearch.randomizedtesting.rules.StatementAdapter.evaluate(StatementAdapter.java:36)
at com.carrotsearch.randomizedtesting.rules.SystemPropertiesRestoreRule$1.evaluate(SystemPropertiesRestoreRule.java:57)
at org.apache.lucene.util.AbstractBeforeAfterRule$1.evaluate(AbstractBeforeAfterRule.java:46)
at com.carrotsearch.randomizedtesting.rules.StatementAdapter.evaluate(StatementAdapter.java:36)
at org.apache.lucene.util.TestRuleStoreClassName$1.evaluate(TestRuleStoreClassName.java:42)
at com.carrotsearch.randomizedtesting.rules.NoShadowingOrOverridesOnMethodsRule$1.evaluate(NoShadowingOrOverridesOnMethodsRule.java:39)
at com.carrotsearch.randomizedtesting.rules.NoShadowingOrOverridesOnMethodsRule$1.evaluate(NoShadowingOrOverridesOnMethodsRule.java:39)
at com.carrotsearch.randomizedtesting.rules.StatementAdapter.evaluate(StatementAdapter.java:36)
at com.carrotsearch.randomizedtesting.rules.StatementAdapter.evaluate(StatementAdapter.java:36)
at com.carrotsearch.randomizedtesting.rules.StatementAdapter.evaluate(StatementAdapter.java:36)
at org.apache.lucene.util.TestRuleAssertionsRequired$1.evaluate(TestRuleAssertionsRequired.java:54)
at org.apache.lucene.util.TestRuleMarkFailure$1.evaluate(TestRuleMarkFailure.java:48)
at org.apache.lucene.util.TestRuleIgnoreAfterMaxFailures$1.evaluate(TestRuleIgnoreAfterMaxFailures.java:65)
at org.apache.lucene.util.TestRuleIgnoreTestSuites$1.evaluate(TestRuleIgnoreTestSuites.java:55)
at com.carrotsearch.randomizedtesting.rules.StatementAdapter.evaluate(StatementAdapter.java:36)
at com.carrotsearch.randomizedtesting.ThreadLeakControl$StatementRunner.run(ThreadLeakControl.java:365)
at java.lang.Thread.run(Thread.java:745)
Build Log:
[...truncated 10411 lines...]
[junit4] Suite: org.apache.solr.cloud.CdcrReplicationHandlerTest
[junit4] 2> Creating dataDir: C:\Users\JenkinsSlave\workspace\Lucene-Solr-trunk-Windows\solr\build\solr-core\test\J1\temp\solr.cloud.CdcrReplicationHandlerTest_A64E87B43ED22D4-001\init-core-data-001
[junit4] 2> 1872672 INFO (SUITE-CdcrReplicationHandlerTest-seed#[A64E87B43ED22D4]-worker) [ ] o.a.s.SolrTestCaseJ4 Randomized ssl (false) and clientAuth (false)
[junit4] 2> 1872672 INFO (SUITE-CdcrReplicationHandlerTest-seed#[A64E87B43ED22D4]-worker) [ ] o.a.s.BaseDistributedSearchTestCase Setting hostContext system property: /_jt/
[junit4] 2> 1872676 INFO (TEST-CdcrReplicationHandlerTest.doTest-seed#[A64E87B43ED22D4]) [ ] o.a.s.c.ZkTestServer STARTING ZK TEST SERVER
[junit4] 2> 1872677 INFO (Thread-5298) [ ] o.a.s.c.ZkTestServer client port:0.0.0.0/0.0.0.0:0
[junit4] 2> 1872677 INFO (Thread-5298) [ ] o.a.s.c.ZkTestServer Starting server
[junit4] 2> 1872774 INFO (TEST-CdcrReplicationHandlerTest.doTest-seed#[A64E87B43ED22D4]) [ ] o.a.s.c.ZkTestServer start zk server on port:49389
[junit4] 2> 1872774 INFO (TEST-CdcrReplicationHandlerTest.doTest-seed#[A64E87B43ED22D4]) [ ] o.a.s.c.c.SolrZkClient Using default ZkCredentialsProvider
[junit4] 2> 1872775 INFO (TEST-CdcrReplicationHandlerTest.doTest-seed#[A64E87B43ED22D4]) [ ] o.a.s.c.c.ConnectionManager Waiting for client to connect to ZooKeeper
[junit4] 2> 1872779 INFO (zkCallback-1786-thread-1) [ ] o.a.s.c.c.ConnectionManager Watcher org.apache.solr.common.cloud.ConnectionManager@77504912 name:ZooKeeperConnection Watcher:127.0.0.1:49389 got event WatchedEvent state:SyncConnected type:None path:null path:null type:None
[junit4] 2> 1872780 INFO (TEST-CdcrReplicationHandlerTest.doTest-seed#[A64E87B43ED22D4]) [ ] o.a.s.c.c.ConnectionManager Client is connected to ZooKeeper
[junit4] 2> 1872780 INFO (TEST-CdcrReplicationHandlerTest.doTest-seed#[A64E87B43ED22D4]) [ ] o.a.s.c.c.SolrZkClient Using default ZkACLProvider
[junit4] 2> 1872780 INFO (TEST-CdcrReplicationHandlerTest.doTest-seed#[A64E87B43ED22D4]) [ ] o.a.s.c.c.SolrZkClient makePath: /solr
[junit4] 2> 1872804 INFO (TEST-CdcrReplicationHandlerTest.doTest-seed#[A64E87B43ED22D4]) [ ] o.a.s.c.c.SolrZkClient Using default ZkCredentialsProvider
[junit4] 2> 1872806 INFO (TEST-CdcrReplicationHandlerTest.doTest-seed#[A64E87B43ED22D4]) [ ] o.a.s.c.c.ConnectionManager Waiting for client to connect to ZooKeeper
[junit4] 2> 1872807 INFO (zkCallback-1787-thread-1) [ ] o.a.s.c.c.ConnectionManager Watcher org.apache.solr.common.cloud.ConnectionManager@6cfad32e name:ZooKeeperConnection Watcher:127.0.0.1:49389/solr got event WatchedEvent state:SyncConnected type:None path:null path:null type:None
[junit4] 2> 1872807 INFO (TEST-CdcrReplicationHandlerTest.doTest-seed#[A64E87B43ED22D4]) [ ] o.a.s.c.c.ConnectionManager Client is connected to ZooKeeper
[junit4] 2> 1872807 INFO (TEST-CdcrReplicationHandlerTest.doTest-seed#[A64E87B43ED22D4]) [ ] o.a.s.c.c.SolrZkClient Using default ZkACLProvider
[junit4] 2> 1872808 INFO (TEST-CdcrReplicationHandlerTest.doTest-seed#[A64E87B43ED22D4]) [ ] o.a.s.c.c.SolrZkClient makePath: /collections/collection1
[junit4] 2> 1872809 INFO (TEST-CdcrReplicationHandlerTest.doTest-seed#[A64E87B43ED22D4]) [ ] o.a.s.c.c.SolrZkClient makePath: /collections/collection1/shards
[junit4] 2> 1872811 INFO (TEST-CdcrReplicationHandlerTest.doTest-seed#[A64E87B43ED22D4]) [ ] o.a.s.c.c.SolrZkClient makePath: /collections/control_collection
[junit4] 2> 1872813 INFO (TEST-CdcrReplicationHandlerTest.doTest-seed#[A64E87B43ED22D4]) [ ] o.a.s.c.c.SolrZkClient makePath: /collections/control_collection/shards
[junit4] 2> 1872816 INFO (TEST-CdcrReplicationHandlerTest.doTest-seed#[A64E87B43ED22D4]) [ ] o.a.s.c.AbstractZkTestCase put C:\Users\JenkinsSlave\workspace\Lucene-Solr-trunk-Windows\solr\core\src\test-files\solr\collection1\conf\solrconfig-cdcr.xml to /configs/conf1/solrconfig.xml
[junit4] 2> 1872817 INFO (TEST-CdcrReplicationHandlerTest.doTest-seed#[A64E87B43ED22D4]) [ ] o.a.s.c.c.SolrZkClient makePath: /configs/conf1/solrconfig.xml
[junit4] 2> 1872820 INFO (TEST-CdcrReplicationHandlerTest.doTest-seed#[A64E87B43ED22D4]) [ ] o.a.s.c.AbstractZkTestCase put C:\Users\JenkinsSlave\workspace\Lucene-Solr-trunk-Windows\solr\core\src\test-files\solr\collection1\conf\schema15.xml to /configs/conf1/schema.xml
[junit4] 2> 1872821 INFO (TEST-CdcrReplicationHandlerTest.doTest-seed#[A64E87B43ED22D4]) [ ] o.a.s.c.c.SolrZkClient makePath: /configs/conf1/schema.xml
[junit4] 2> 1872822 INFO (TEST-CdcrReplicationHandlerTest.doTest-seed#[A64E87B43ED22D4]) [ ] o.a.s.c.AbstractZkTestCase put C:\Users\JenkinsSlave\workspace\Lucene-Solr-trunk-Windows\solr\core\src\test-files\solr\collection1\conf\solrconfig.snippet.randomindexconfig.xml to /configs/conf1/solrconfig.snippet.randomindexconfig.xml
[junit4] 2> 1872822 INFO (TEST-CdcrReplicationHandlerTest.doTest-seed#[A64E87B43ED22D4]) [ ] o.a.s.c.c.SolrZkClient makePath: /configs/conf1/solrconfig.snippet.randomindexconfig.xml
[junit4] 2> 1872824 INFO (TEST-CdcrReplicationHandlerTest.doTest-seed#[A64E87B43ED22D4]) [ ] o.a.s.c.AbstractZkTestCase put C:\Users\JenkinsSlave\workspace\Lucene-Solr-trunk-Windows\solr\core\src\test-files\solr\collection1\conf\stopwords.txt to /configs/conf1/stopwords.txt
[junit4] 2> 1872825 INFO (TEST-CdcrReplicationHandlerTest.doTest-seed#[A64E87B43ED22D4]) [ ] o.a.s.c.c.SolrZkClient makePath: /configs/conf1/stopwords.txt
[junit4] 2> 1872827 INFO (TEST-CdcrReplicationHandlerTest.doTest-seed#[A64E87B43ED22D4]) [ ] o.a.s.c.AbstractZkTestCase put C:\Users\JenkinsSlave\workspace\Lucene-Solr-trunk-Windows\solr\core\src\test-files\solr\collection1\conf\protwords.txt to /configs/conf1/protwords.txt
[junit4] 2> 1872827 INFO (TEST-CdcrReplicationHandlerTest.doTest-seed#[A64E87B43ED22D4]) [ ] o.a.s.c.c.SolrZkClient makePath: /configs/conf1/protwords.txt
[junit4] 2> 1872829 INFO (TEST-CdcrReplicationHandlerTest.doTest-seed#[A64E87B43ED22D4]) [ ] o.a.s.c.AbstractZkTestCase put C:\Users\JenkinsSlave\workspace\Lucene-Solr-trunk-Windows\solr\core\src\test-files\solr\collection1\conf\currency.xml to /configs/conf1/currency.xml
[junit4] 2> 1872830 INFO (TEST-CdcrReplicationHandlerTest.doTest-seed#[A64E87B43ED22D4]) [ ] o.a.s.c.c.SolrZkClient makePath: /configs/conf1/currency.xml
[junit4] 2> 1872832 INFO (TEST-CdcrReplicationHandlerTest.doTest-seed#[A64E87B43ED22D4]) [ ] o.a.s.c.AbstractZkTestCase put C:\Users\JenkinsSlave\workspace\Lucene-Solr-trunk-Windows\solr\core\src\test-files\solr\collection1\conf\enumsConfig.xml to /configs/conf1/enumsConfig.xml
[junit4] 2> 1872832 INFO (TEST-CdcrReplicationHandlerTest.doTest-seed#[A64E87B43ED22D4]) [ ] o.a.s.c.c.SolrZkClient makePath: /configs/conf1/enumsConfig.xml
[junit4] 2> 1872834 INFO (TEST-CdcrReplicationHandlerTest.doTest-seed#[A64E87B43ED22D4]) [ ] o.a.s.c.AbstractZkTestCase put C:\Users\JenkinsSlave\workspace\Lucene-Solr-trunk-Windows\solr\core\src\test-files\solr\collection1\conf\open-exchange-rates.json to /configs/conf1/open-exchange-rates.json
[junit4] 2> 1872834 INFO (TEST-CdcrReplicationHandlerTest.doTest-seed#[A64E87B43ED22D4]) [ ] o.a.s.c.c.SolrZkClient makePath: /configs/conf1/open-exchange-rates.json
[junit4] 2> 1872836 INFO (TEST-CdcrReplicationHandlerTest.doTest-seed#[A64E87B43ED22D4]) [ ] o.a.s.c.AbstractZkTestCase put C:\Users\JenkinsSlave\workspace\Lucene-Solr-trunk-Windows\solr\core\src\test-files\solr\collection1\conf\mapping-ISOLatin1Accent.txt to /configs/conf1/mapping-ISOLatin1Accent.txt
[junit4] 2> 1872836 INFO (TEST-CdcrReplicationHandlerTest.doTest-seed#[A64E87B43ED22D4]) [ ] o.a.s.c.c.SolrZkClient makePath: /configs/conf1/mapping-ISOLatin1Accent.txt
[junit4] 2> 1872838 INFO (TEST-CdcrReplicationHandlerTest.doTest-seed#[A64E87B43ED22D4]) [ ] o.a.s.c.AbstractZkTestCase put C:\Users\JenkinsSlave\workspace\Lucene-Solr-trunk-Windows\solr\core\src\test-files\solr\collection1\conf\old_synonyms.txt to /configs/conf1/old_synonyms.txt
[junit4] 2> 1872838 INFO (TEST-CdcrReplicationHandlerTest.doTest-seed#[A64E87B43ED22D4]) [ ] o.a.s.c.c.SolrZkClient makePath: /configs/conf1/old_synonyms.txt
[junit4] 2> 1872839 INFO (TEST-CdcrReplicationHandlerTest.doTest-seed#[A64E87B43ED22D4]) [ ] o.a.s.c.AbstractZkTestCase put C:\Users\JenkinsSlave\workspace\Lucene-Solr-trunk-Windows\solr\core\src\test-files\solr\collection1\conf\synonyms.txt to /configs/conf1/synonyms.txt
[junit4] 2> 1872840 INFO (TEST-CdcrReplicationHandlerTest.doTest-seed#[A64E87B43ED22D4]) [ ] o.a.s.c.c.SolrZkClient makePath: /configs/conf1/synonyms.txt
[junit4] 2> 1872843 WARN (NIOServerCxn.Factory:0.0.0.0/0.0.0.0:0) [ ] o.a.z.s.NIOServerCnxn caught end of stream exception
[junit4] 2> EndOfStreamException: Unable to read additional data from client sessionid 0x14f38dc7f820001, likely client has closed socket
[junit4] 2> at org.apache.zookeeper.server.NIOServerCnxn.doIO(NIOServerCnxn.java:228)
[junit4] 2> at org.apache.zookeeper.server.NIOServerCnxnFactory.run(NIOServerCnxnFactory.java:208)
[junit4] 2> at java.lang.Thread.run(Thread.java:745)
[junit4] 2> 1872843 INFO (TEST-CdcrReplicationHandlerTest.doTest-seed#[A64E87B43ED22D4]) [ ] o.a.s.SolrTestCaseJ4 ###Starting doTest
[junit4] 2> 1873220 INFO (TEST-CdcrReplicationHandlerTest.doTest-seed#[A64E87B43ED22D4]) [ ] o.a.s.SolrTestCaseJ4 Writing core.properties file to C:\Users\JenkinsSlave\workspace\Lucene-Solr-trunk-Windows\solr\build\solr-core\test\J1\temp\solr.cloud.CdcrReplicationHandlerTest_A64E87B43ED22D4-001\jetty-001\cores\collection1
[junit4] 2> 1873223 INFO (TEST-CdcrReplicationHandlerTest.doTest-seed#[A64E87B43ED22D4]) [ ] o.e.j.s.Server jetty-9.2.11.v20150529
[junit4] 2> 1873225 INFO (TEST-CdcrReplicationHandlerTest.doTest-seed#[A64E87B43ED22D4]) [ ] o.e.j.s.h.ContextHandler Started o.e.j.s.ServletContextHandler@5d639fb1{/_jt,null,AVAILABLE}
[junit4] 2> 1873226 INFO (TEST-CdcrReplicationHandlerTest.doTest-seed#[A64E87B43ED22D4]) [ ] o.e.j.s.ServerConnector Started ServerConnector@3277ce36{HTTP/1.1}{127.0.0.1:49408}
[junit4] 2> 1873227 INFO (TEST-CdcrReplicationHandlerTest.doTest-seed#[A64E87B43ED22D4]) [ ] o.e.j.s.Server Started @1877433ms
[junit4] 2> 1873227 INFO (TEST-CdcrReplicationHandlerTest.doTest-seed#[A64E87B43ED22D4]) [ ] o.a.s.c.s.e.JettySolrRunner Jetty properties: {shards=shard1, hostContext=/_jt, hostPort=49408, coreRootDirectory=C:\Users\JenkinsSlave\workspace\Lucene-Solr-trunk-Windows\solr\build\solr-core\test\J1\temp\solr.cloud.CdcrReplicationHandlerTest_A64E87B43ED22D4-001\jetty-001\cores}
[junit4] 2> 1873227 INFO (TEST-CdcrReplicationHandlerTest.doTest-seed#[A64E87B43ED22D4]) [ ] o.a.s.s.SolrDispatchFilter SolrDispatchFilter.init(): sun.misc.Launcher$AppClassLoader@4e0e2f2a
[junit4] 2> 1873227 INFO (TEST-CdcrReplicationHandlerTest.doTest-seed#[A64E87B43ED22D4]) [ ] o.a.s.c.SolrResourceLoader new SolrResourceLoader for directory: 'C:\Users\JenkinsSlave\workspace\Lucene-Solr-trunk-Windows\solr\build\solr-core\test\J1\temp\solr.cloud.CdcrReplicationHandlerTest_A64E87B43ED22D4-001\jetty-001\'
[junit4] 2> 1873259 INFO (TEST-CdcrReplicationHandlerTest.doTest-seed#[A64E87B43ED22D4]) [ ] o.a.s.c.c.SolrZkClient Using default ZkCredentialsProvider
[junit4] 2> 1873262 INFO (TEST-CdcrReplicationHandlerTest.doTest-seed#[A64E87B43ED22D4]) [ ] o.a.s.c.c.ConnectionManager Waiting for client to connect to ZooKeeper
[junit4] 2> 1873263 INFO (zkCallback-1788-thread-1) [ ] o.a.s.c.c.ConnectionManager Watcher org.apache.solr.common.cloud.ConnectionManager@76a5fd67 name:ZooKeeperConnection Watcher:127.0.0.1:49389/solr got event WatchedEvent state:SyncConnected type:None path:null path:null type:None
[junit4] 2> 1873264 INFO (TEST-CdcrReplicationHandlerTest.doTest-seed#[A64E87B43ED22D4]) [ ] o.a.s.c.c.ConnectionManager Client is connected to ZooKeeper
[junit4] 2> 1873264 INFO (TEST-CdcrReplicationHandlerTest.doTest-seed#[A64E87B43ED22D4]) [ ] o.a.s.c.c.SolrZkClient Using default ZkACLProvider
[junit4] 2> 1873265 INFO (TEST-CdcrReplicationHandlerTest.doTest-seed#[A64E87B43ED22D4]) [ ] o.a.s.s.SolrDispatchFilter Loading solr.xml from SolrHome (not found in ZooKeeper)
[junit4] 2> 1873265 INFO (TEST-CdcrReplicationHandlerTest.doTest-seed#[A64E87B43ED22D4]) [ ] o.a.s.c.SolrXmlConfig Loading container configuration from C:\Users\JenkinsSlave\workspace\Lucene-Solr-trunk-Windows\solr\build\solr-core\test\J1\temp\solr.cloud.CdcrReplicationHandlerTest_A64E87B43ED22D4-001\jetty-001\solr.xml
[junit4] 2> 1873273 INFO (TEST-CdcrReplicationHandlerTest.doTest-seed#[A64E87B43ED22D4]) [ ] o.a.s.c.CoresLocator Config-defined core root directory: C:\Users\JenkinsSlave\workspace\Lucene-Solr-trunk-Windows\solr\build\solr-core\test\J1\temp\solr.cloud.CdcrReplicationHandlerTest_A64E87B43ED22D4-001\jetty-001\cores
[junit4] 2> 1873274 INFO (TEST-CdcrReplicationHandlerTest.doTest-seed#[A64E87B43ED22D4]) [ ] o.a.s.c.CoreContainer New CoreContainer 1929417655
[junit4] 2> 1873274 INFO (TEST-CdcrReplicationHandlerTest.doTest-seed#[A64E87B43ED22D4]) [ ] o.a.s.c.CoreContainer Loading cores into CoreContainer [instanceDir=C:\Users\JenkinsSlave\workspace\Lucene-Solr-trunk-Windows\solr\build\solr-core\test\J1\temp\solr.cloud.CdcrReplicationHandlerTest_A64E87B43ED22D4-001\jetty-001\]
[junit4] 2> 1873274 INFO (TEST-CdcrReplicationHandlerTest.doTest-seed#[A64E87B43ED22D4]) [ ] o.a.s.c.CoreContainer loading shared library: C:\Users\JenkinsSlave\workspace\Lucene-Solr-trunk-Windows\solr\build\solr-core\test\J1\temp\solr.cloud.CdcrReplicationHandlerTest_A64E87B43ED22D4-001\jetty-001\lib
[junit4] 2> 1873274 WARN (TEST-CdcrReplicationHandlerTest.doTest-seed#[A64E87B43ED22D4]) [ ] o.a.s.c.SolrResourceLoader Can't find (or read) directory to add to classloader: lib (resolved as: C:\Users\JenkinsSlave\workspace\Lucene-Solr-trunk-Windows\solr\build\solr-core\test\J1\temp\solr.cloud.CdcrReplicationHandlerTest_A64E87B43ED22D4-001\jetty-001\lib).
[junit4] 2> 1873283 INFO (TEST-CdcrReplicationHandlerTest.doTest-seed#[A64E87B43ED22D4]) [ ] o.a.s.h.c.HttpShardHandlerFactory created with socketTimeout : 90000,urlScheme : ,connTimeout : 15000,maxConnectionsPerHost : 20,maxConnections : 10000,corePoolSize : 0,maximumPoolSize : 2147483647,maxThreadIdleTime : 5,sizeOfQueue : -1,fairnessPolicy : false,useRetries : false,
[junit4] 2> 1873287 INFO (TEST-CdcrReplicationHandlerTest.doTest-seed#[A64E87B43ED22D4]) [ ] o.a.s.u.UpdateShardHandler Creating UpdateShardHandler HTTP client with params: socketTimeout=340000&connTimeout=45000&retry=true
[junit4] 2> 1873287 INFO (TEST-CdcrReplicationHandlerTest.doTest-seed#[A64E87B43ED22D4]) [ ] o.a.s.l.LogWatcher SLF4J impl is org.slf4j.impl.Log4jLoggerFactory
[junit4] 2> 1873287 INFO (TEST-CdcrReplicationHandlerTest.doTest-seed#[A64E87B43ED22D4]) [ ] o.a.s.l.LogWatcher Registering Log Listener [Log4j (org.slf4j.impl.Log4jLoggerFactory)]
[junit4] 2> 1873288 INFO (TEST-CdcrReplicationHandlerTest.doTest-seed#[A64E87B43ED22D4]) [ ] o.a.s.c.ZkContainer Zookeeper client=127.0.0.1:49389/solr
[junit4] 2> 1873288 INFO (TEST-CdcrReplicationHandlerTest.doTest-seed#[A64E87B43ED22D4]) [ ] o.a.s.c.ZkController zkHost includes chroot
[junit4] 2> 1873288 INFO (TEST-CdcrReplicationHandlerTest.doTest-seed#[A64E87B43ED22D4]) [ ] o.a.s.c.c.SolrZkClient Using default ZkCredentialsProvider
[junit4] 2> 1873289 INFO (TEST-CdcrReplicationHandlerTest.doTest-seed#[A64E87B43ED22D4]) [ ] o.a.s.c.c.ConnectionManager Waiting for client to connect to ZooKeeper
[junit4] 2> 1873291 INFO (zkCallback-1790-thread-1) [ ] o.a.s.c.c.ConnectionManager Watcher org.apache.solr.common.cloud.ConnectionManager@44d4c25b name:ZooKeeperConnection Watcher:127.0.0.1:49389 got event WatchedEvent state:SyncConnected type:None path:null path:null type:None
[junit4] 2> 1873291 INFO (TEST-CdcrReplicationHandlerTest.doTest-seed#[A64E87B43ED22D4]) [ ] o.a.s.c.c.ConnectionManager Client is connected to ZooKeeper
[junit4] 2> 1873291 INFO (TEST-CdcrReplicationHandlerTest.doTest-seed#[A64E87B43ED22D4]) [ ] o.a.s.c.c.SolrZkClient Using default ZkACLProvider
[junit4] 2> 1873293 INFO (TEST-CdcrReplicationHandlerTest.doTest-seed#[A64E87B43ED22D4]) [n:127.0.0.1:49408__jt ] o.a.s.c.c.ConnectionManager Waiting for client to connect to ZooKeeper
[junit4] 2> 1873294 INFO (zkCallback-1791-thread-1-processing-n:127.0.0.1:49408__jt) [n:127.0.0.1:49408__jt ] o.a.s.c.c.ConnectionManager Watcher org.apache.solr.common.cloud.ConnectionManager@41a0c4b5 name:ZooKeeperConnection Watcher:127.0.0.1:49389/solr got event WatchedEvent state:SyncConnected type:None path:null path:null type:None
[junit4] 2> 1873294 INFO (TEST-CdcrReplicationHandlerTest.doTest-seed#[A64E87B43ED22D4]) [n:127.0.0.1:49408__jt ] o.a.s.c.c.ConnectionManager Client is connected to ZooKeeper
[junit4] 2> 1873295 INFO (TEST-CdcrReplicationHandlerTest.doTest-seed#[A64E87B43ED22D4]) [n:127.0.0.1:49408__jt ] o.a.s.c.c.SolrZkClient makePath: /overseer/queue
[junit4] 2> 1873298 INFO (TEST-CdcrReplicationHandlerTest.doTest-seed#[A64E87B43ED22D4]) [n:127.0.0.1:49408__jt ] o.a.s.c.c.SolrZkClient makePath: /overseer/collection-queue-work
[junit4] 2> 1873300 INFO (TEST-CdcrReplicationHandlerTest.doTest-seed#[A64E87B43ED22D4]) [n:127.0.0.1:49408__jt ] o.a.s.c.c.SolrZkClient makePath: /overseer/collection-map-running
[junit4] 2> 1873303 INFO (TEST-CdcrReplicationHandlerTest.doTest-seed#[A64E87B43ED22D4]) [n:127.0.0.1:49408__jt ] o.a.s.c.c.SolrZkClient makePath: /overseer/collection-map-completed
[junit4] 2> 1873306 INFO (TEST-CdcrReplicationHandlerTest.doTest-seed#[A64E87B43ED22D4]) [n:127.0.0.1:49408__jt ] o.a.s.c.c.SolrZkClient makePath: /overseer/collection-map-failure
[junit4] 2> 1873309 INFO (TEST-CdcrReplicationHandlerTest.doTest-seed#[A64E87B43ED22D4]) [n:127.0.0.1:49408__jt ] o.a.s.c.c.SolrZkClient makePath: /live_nodes
[junit4] 2> 1873310 INFO (TEST-CdcrReplicationHandlerTest.doTest-seed#[A64E87B43ED22D4]) [n:127.0.0.1:49408__jt ] o.a.s.c.c.SolrZkClient makePath: /aliases.json
[junit4] 2> 1873312 INFO (TEST-CdcrReplicationHandlerTest.doTest-seed#[A64E87B43ED22D4]) [n:127.0.0.1:49408__jt ] o.a.s.c.c.SolrZkClient makePath: /clusterstate.json
[junit4] 2> 1873314 INFO (TEST-CdcrReplicationHandlerTest.doTest-seed#[A64E87B43ED22D4]) [n:127.0.0.1:49408__jt ] o.a.s.c.c.SolrZkClient makePath: /security.json
[junit4] 2> 1873315 INFO (TEST-CdcrReplicationHandlerTest.doTest-seed#[A64E87B43ED22D4]) [n:127.0.0.1:49408__jt ] o.a.s.c.ZkController Register node as live in ZooKeeper:/live_nodes/127.0.0.1:49408__jt
[junit4] 2> 1873316 INFO (TEST-CdcrReplicationHandlerTest.doTest-seed#[A64E87B43ED22D4]) [n:127.0.0.1:49408__jt ] o.a.s.c.c.SolrZkClient makePath: /live_nodes/127.0.0.1:49408__jt
[junit4] 2> 1873318 INFO (TEST-CdcrReplicationHandlerTest.doTest-seed#[A64E87B43ED22D4]) [n:127.0.0.1:49408__jt ] o.a.s.c.c.SolrZkClient makePath: /overseer_elect
[junit4] 2> 1873320 INFO (TEST-CdcrReplicationHandlerTest.doTest-seed#[A64E87B43ED22D4]) [n:127.0.0.1:49408__jt ] o.a.s.c.c.SolrZkClient makePath: /overseer_elect/election
[junit4] 2> 1873322 INFO (TEST-CdcrReplicationHandlerTest.doTest-seed#[A64E87B43ED22D4]) [n:127.0.0.1:49408__jt ] o.a.s.c.Overseer Overseer (id=null) closing
[junit4] 2> 1873322 INFO (TEST-CdcrReplicationHandlerTest.doTest-seed#[A64E87B43ED22D4]) [n:127.0.0.1:49408__jt ] o.a.s.c.LeaderElector Joined leadership election with path: /overseer_elect/election/94356636881256452-127.0.0.1:49408__jt-n_0000000000
[junit4] 2> 1873323 INFO (TEST-CdcrReplicationHandlerTest.doTest-seed#[A64E87B43ED22D4]) [n:127.0.0.1:49408__jt ] o.a.s.c.OverseerElectionContext I am going to be the leader 127.0.0.1:49408__jt
[junit4] 2> 1873323 INFO (TEST-CdcrReplicationHandlerTest.doTest-seed#[A64E87B43ED22D4]) [n:127.0.0.1:49408__jt ] o.a.s.c.c.SolrZkClient makePath: /overseer_elect/leader
[junit4] 2> 1873324 INFO (TEST-CdcrReplicationHandlerTest.doTest-seed#[A64E87B43ED22D4]) [n:127.0.0.1:49408__jt ] o.a.s.c.Overseer Overseer (id=94356636881256452-127.0.0.1:49408__jt-n_0000000000) starting
[junit4] 2> 1873327 INFO (TEST-CdcrReplicationHandlerTest.doTest-seed#[A64E87B43ED22D4]) [n:127.0.0.1:49408__jt ] o.a.s.c.c.SolrZkClient makePath: /overseer/queue-work
[junit4] 2> 1873333 INFO (TEST-CdcrReplicationHandlerTest.doTest-seed#[A64E87B43ED22D4]) [n:127.0.0.1:49408__jt ] o.a.s.c.OverseerAutoReplicaFailoverThread Starting OverseerAutoReplicaFailoverThread autoReplicaFailoverWorkLoopDelay=10000 autoReplicaFailoverWaitAfterExpiration=30000 autoReplicaFailoverBadNodeExpiration=60000
[junit4] 2> 1873333 INFO (TEST-CdcrReplicationHandlerTest.doTest-seed#[A64E87B43ED22D4]) [n:127.0.0.1:49408__jt ] o.a.s.c.c.ZkStateReader Updating cluster state from ZooKeeper...
[junit4] 2> 1873334 INFO (OverseerCollectionProcessor-94356636881256452-127.0.0.1:49408__jt-n_0000000000) [n:127.0.0.1:49408__jt ] o.a.s.c.OverseerProcessor Process current queue of overseer operations
[junit4] 2> 1873334 INFO (OverseerStateUpdate-94356636881256452-127.0.0.1:49408__jt-n_0000000000) [n:127.0.0.1:49408__jt ] o.a.s.c.Overseer Starting to work on the main queue
[junit4] 2> 1873360 INFO (TEST-CdcrReplicationHandlerTest.doTest-seed#[A64E87B43ED22D4]) [n:127.0.0.1:49408__jt ] o.a.s.c.CoreContainer Security conf doesn't exist. Skipping setup for authorization module.
[junit4] 2> 1873361 INFO (TEST-CdcrReplicationHandlerTest.doTest-seed#[A64E87B43ED22D4]) [n:127.0.0.1:49408__jt ] o.a.s.c.CoreContainer No authentication plugin used.
[junit4] 2> 1873362 INFO (TEST-CdcrReplicationHandlerTest.doTest-seed#[A64E87B43ED22D4]) [n:127.0.0.1:49408__jt ] o.a.s.c.CoresLocator Looking for core definitions underneath C:\Users\JenkinsSlave\workspace\Lucene-Solr-trunk-Windows\solr\build\solr-core\test\J1\temp\solr.cloud.CdcrReplicationHandlerTest_A64E87B43ED22D4-001\jetty-001\cores
[junit4] 2> 1873363 INFO (TEST-CdcrReplicationHandlerTest.doTest-seed#[A64E87B43ED22D4]) [n:127.0.0.1:49408__jt ] o.a.s.c.SolrCore Created CoreDescriptor: {name=collection1, config=solrconfig.xml, transient=false, schema=schema.xml, loadOnStartup=true, configSetProperties=configsetprops.json, instanceDir=C:\Users\JenkinsSlave\workspace\Lucene-Solr-trunk-Windows\solr\build\solr-core\test\J1\temp\solr.cloud.CdcrReplicationHandlerTest_A64E87B43ED22D4-001\jetty-001\cores\collection1, collection=tmp_collection, absoluteInstDir=C:\Users\JenkinsSlave\workspace\Lucene-Solr-trunk-Windows\solr\build\solr-core\test\J1\temp\solr.cloud.CdcrReplicationHandlerTest_A64E87B43ED22D4-001\jetty-001\cores\collection1\, coreNodeName=, dataDir=data\, shard=}
[junit4] 2> 1873364 INFO (TEST-CdcrReplicationHandlerTest.doTest-seed#[A64E87B43ED22D4]) [n:127.0.0.1:49408__jt ] o.a.s.c.CoresLocator Found core collection1 in C:\Users\JenkinsSlave\workspace\Lucene-Solr-trunk-Windows\solr\build\solr-core\test\J1\temp\solr.cloud.CdcrReplicationHandlerTest_A64E87B43ED22D4-001\jetty-001\cores\collection1\
[junit4] 2> 1873364 INFO (TEST-CdcrReplicationHandlerTest.doTest-seed#[A64E87B43ED22D4]) [n:127.0.0.1:49408__jt ] o.a.s.c.CoresLocator Found 1 core definitions
[junit4] 2> 1873365 INFO (coreLoadExecutor-6158-thread-1-processing-n:127.0.0.1:49408__jt) [n:127.0.0.1:49408__jt c:tmp_collection x:collection1] o.a.s.c.ZkController publishing state=down
[junit4] 2> 1873365 INFO (TEST-CdcrReplicationHandlerTest.doTest-seed#[A64E87B43ED22D4]) [n:127.0.0.1:49408__jt ] o.a.s.s.SolrDispatchFilter user.dir=C:\Users\JenkinsSlave\workspace\Lucene-Solr-trunk-Windows\solr\build\solr-core\test\J1
[junit4] 2> 1873365 INFO (TEST-CdcrReplicationHandlerTest.doTest-seed#[A64E87B43ED22D4]) [n:127.0.0.1:49408__jt ] o.a.s.s.SolrDispatchFilter SolrDispatchFilter.init() done
[junit4] 2> 1873365 INFO (coreLoadExecutor-6158-thread-1-processing-n:127.0.0.1:49408__jt) [n:127.0.0.1:49408__jt c:tmp_collection x:collection1] o.a.s.c.ZkController numShards not found on descriptor - reading it from system property
[junit4] 2> 1873366 INFO (zkCallback-1791-thread-1-processing-n:127.0.0.1:49408__jt) [n:127.0.0.1:49408__jt ] o.a.s.c.DistributedQueue NodeChildrenChanged fired on path /overseer/queue state SyncConnected
[junit4] 2> 1873366 INFO (coreLoadExecutor-6158-thread-1-processing-n:127.0.0.1:49408__jt) [n:127.0.0.1:49408__jt c:tmp_collection x:collection1] o.a.s.c.ZkController look for our core node name
[junit4] 2> 1873367 INFO (OverseerStateUpdate-94356636881256452-127.0.0.1:49408__jt-n_0000000000) [n:127.0.0.1:49408__jt ] o.a.s.c.Overseer processMessage: queueSize: 1, message = {
[junit4] 2> "core":"collection1",
[junit4] 2> "roles":null,
[junit4] 2> "base_url":"http://127.0.0.1:49408/_jt",
[junit4] 2> "node_name":"127.0.0.1:49408__jt",
[junit4] 2> "numShards":"1",
[junit4] 2> "state":"down",
[junit4] 2> "shard":null,
[junit4] 2> "collection":"tmp_collection",
[junit4] 2> "operation":"state"} current state version: 0
[junit4] 2> 1873368 INFO (OverseerStateUpdate-94356636881256452-127.0.0.1:49408__jt-n_0000000000) [n:127.0.0.1:49408__jt ] o.a.s.c.o.ReplicaMutator Update state numShards=1 message={
[junit4] 2> "core":"collection1",
[junit4] 2> "roles":null,
[junit4] 2> "base_url":"http://127.0.0.1:49408/_jt",
[junit4] 2> "node_name":"127.0.0.1:49408__jt",
[junit4] 2> "numShards":"1",
[junit4] 2> "state":"down",
[junit4] 2> "shard":null,
[junit4] 2> "collection":"tmp_collection",
[junit4] 2> "operation":"state"}
[junit4] 2> 1873368 INFO (OverseerStateUpdate-94356636881256452-127.0.0.1:49408__jt-n_0000000000) [n:127.0.0.1:49408__jt ] o.a.s.c.o.ClusterStateMutator building a new cName: tmp_collection
[junit4] 2> 1873368 INFO (OverseerStateUpdate-94356636881256452-127.0.0.1:49408__jt-n_0000000000) [n:127.0.0.1:49408__jt ] o.a.s.c.o.ReplicaMutator Assigning new node to shard shard=shard1
[junit4] 2> 1873369 INFO (zkCallback-1791-thread-1-processing-n:127.0.0.1:49408__jt) [n:127.0.0.1:49408__jt ] o.a.s.c.c.ZkStateReader A cluster state change: WatchedEvent state:SyncConnected type:NodeDataChanged path:/clusterstate.json, has occurred - updating... (live nodes size: 1)
[junit4] 2> 1874337 INFO (coreLoadExecutor-6158-thread-1-processing-n:127.0.0.1:49408__jt) [n:127.0.0.1:49408__jt c:tmp_collection x:collection1] o.a.s.c.ZkController waiting to find shard id in clusterstate for collection1
[junit4] 2> 1874337 INFO (coreLoadExecutor-6158-thread-1-processing-n:127.0.0.1:49408__jt) [n:127.0.0.1:49408__jt c:tmp_collection x:collection1] o.a.s.c.ZkController Check for collection zkNode:tmp_collection
[junit4] 2> 1874338 INFO (coreLoadExecutor-6158-thread-1-processing-n:127.0.0.1:49408__jt) [n:127.0.0.1:49408__jt c:tmp_collection x:collection1] o.a.s.c.ZkController Creating collection in ZooKeeper:tmp_collection
[junit4] 2> 1874338 INFO (coreLoadExecutor-6158-thread-1-processing-n:127.0.0.1:49408__jt) [n:127.0.0.1:49408__jt c:tmp_collection x:collection1] o.a.s.c.ZkController Looking for collection configName
[junit4] 2> 1874339 INFO (coreLoadExecutor-6158-thread-1-processing-n:127.0.0.1:49408__jt) [n:127.0.0.1:49408__jt c:tmp_collection x:collection1] o.a.s.c.ZkController Only one config set found in zk - using it:conf1
[junit4] 2> 1874339 INFO (coreLoadExecutor-6158-thread-1-processing-n:127.0.0.1:49408__jt) [n:127.0.0.1:49408__jt c:tmp_collection x:collection1] o.a.s.c.c.SolrZkClient makePath: /collections/tmp_collection
[junit4] 2> 1874340 INFO (coreLoadExecutor-6158-thread-1-processing-n:127.0.0.1:49408__jt) [n:127.0.0.1:49408__jt c:tmp_collection x:collection1] o.a.s.c.c.ZkStateReader Load collection config from:/collections/tmp_collection
[junit4] 2> 1874341 INFO (coreLoadExecutor-6158-thread-1-processing-n:127.0.0.1:49408__jt) [n:127.0.0.1:49408__jt c:tmp_collection x:collection1] o.a.s.c.c.ZkStateReader path=/collections/tmp_collection configName=conf1 specified config exists in ZooKeeper
[junit4] 2> 1874341 INFO (coreLoadExecutor-6158-thread-1-processing-n:127.0.0.1:49408__jt) [n:127.0.0.1:49408__jt c:tmp_collection x:collection1] o.a.s.c.SolrResourceLoader new SolrResourceLoader for directory: 'C:\Users\JenkinsSlave\workspace\Lucene-Solr-trunk-Windows\solr\build\solr-core\test\J1\temp\solr.cloud.CdcrReplicationHandlerTest_A64E87B43ED22D4-001\jetty-001\cores\collection1\'
[junit4] 2> 1874354 INFO (coreLoadExecutor-6158-thread-1-processing-n:127.0.0.1:49408__jt) [n:127.0.0.1:49408__jt c:tmp_collection x:collection1] o.a.s.c.Config loaded config solrconfig.xml with version 0
[junit4] 2> 1874360 INFO (coreLoadExecutor-6158-thread-1-processing-n:127.0.0.1:49408__jt) [n:127.0.0.1:49408__jt c:tmp_collection x:collection1] o.a.s.c.SolrConfig current version of requestparams : -1
[junit4] 2> 1874362 INFO (coreLoadExecutor-6158-thread-1-processing-n:127.0.0.1:49408__jt) [n:127.0.0.1:49408__jt c:tmp_collection x:collection1] o.a.s.c.SolrConfig Using Lucene MatchVersion: 6.0.0
[junit4] 2> 1874368 INFO (coreLoadExecutor-6158-thread-1-processing-n:127.0.0.1:49408__jt) [n:127.0.0.1:49408__jt c:tmp_collection x:collection1] o.a.s.c.Config Loaded SolrConfig: solrconfig.xml
[junit4] 2> 1874369 INFO (coreLoadExecutor-6158-thread-1-processing-n:127.0.0.1:49408__jt) [n:127.0.0.1:49408__jt c:tmp_collection x:collection1] o.a.s.s.IndexSchema Reading Solr Schema from /configs/conf1/schema.xml
[junit4] 2> 1874373 INFO (coreLoadExecutor-6158-thread-1-processing-n:127.0.0.1:49408__jt) [n:127.0.0.1:49408__jt c:tmp_collection x:collection1] o.a.s.s.IndexSchema [collection1] Schema name=test
[junit4] 2> 1874454 INFO (coreLoadExecutor-6158-thread-1-processing-n:127.0.0.1:49408__jt) [n:127.0.0.1:49408__jt c:tmp_collection x:collection1] o.a.s.s.IndexSchema default search field in schema is text
[junit4] 2> 1874455 INFO (coreLoadExecutor-6158-thread-1-processing-n:127.0.0.1:49408__jt) [n:127.0.0.1:49408__jt c:tmp_collection x:collection1] o.a.s.s.IndexSchema unique key field: id
[junit4] 2> 1874456 INFO (coreLoadExecutor-6158-thread-1-processing-n:127.0.0.1:49408__jt) [n:127.0.0.1:49408__jt c:tmp_collection x:collection1] o.a.s.s.FileExchangeRateProvider Reloading exchange rates from file currency.xml
[junit4] 2> 1874459 INFO (coreLoadExecutor-6158-thread-1-processing-n:127.0.0.1:49408__jt) [n:127.0.0.1:49408__jt c:tmp_collection x:collection1] o.a.s.s.FileExchangeRateProvider Reloading exchange rates from file currency.xml
[junit4] 2> 1874483 INFO (coreLoadExecutor-6158-thread-1-processing-n:127.0.0.1:49408__jt) [n:127.0.0.1:49408__jt c:tmp_collection x:collection1] o.a.s.c.ConfigSetProperties Did not find ConfigSet properties, assuming default properties: Can't find resource 'configsetprops.json' in classpath or '/configs/conf1', cwd=C:\Users\JenkinsSlave\workspace\Lucene-Solr-trunk-Windows\solr\build\solr-core\test\J1
[junit4] 2> 1874483 INFO (coreLoadExecutor-6158-thread-1-processing-n:127.0.0.1:49408__jt) [n:127.0.0.1:49408__jt c:tmp_collection x:collection1] o.a.s.c.CoreContainer Creating SolrCore 'collection1' using configuration from collection tmp_collection
[junit4] 2> 1874483 INFO (coreLoadExecutor-6158-thread-1-processing-n:127.0.0.1:49408__jt) [n:127.0.0.1:49408__jt c:tmp_collection s:shard1 r:core_node1 x:collection1] o.a.s.c.SolrCore solr.StandardDirectoryFactory
[junit4] 2> 1874484 INFO (coreLoadExecutor-6158-thread-1-processing-n:127.0.0.1:49408__jt) [n:127.0.0.1:49408__jt c:tmp_collection s:shard1 r:core_node1 x:collection1] o.a.s.c.SolrCore [[collection1] ] Opening new SolrCore at [C:\Users\JenkinsSlave\workspace\Lucene-Solr-trunk-Windows\solr\build\solr-core\test\J1\temp\solr.cloud.CdcrReplicationHandlerTest_A64E87B43ED22D4-001\jetty-001\cores\collection1\], dataDir=[null]
[junit4] 2> 1874484 INFO (coreLoadExecutor-6158-thread-1-processing-n:127.0.0.1:49408__jt) [n:127.0.0.1:49408__jt c:tmp_collection s:shard1 r:core_node1 x:collection1] o.a.s.c.JmxMonitoredMap JMX monitoring is enabled. Adding Solr mbeans to JMX Server: com.sun.jmx.mbeanserver.JmxMBeanServer@1549156e
[junit4] 2> 1874485 INFO (coreLoadExecutor-6158-thread-1-processing-n:127.0.0.1:49408__jt) [n:127.0.0.1:49408__jt c:tmp_collection s:shard1 r:core_node1 x:collection1] o.a.s.c.CachingDirectoryFactory return new directory for C:\Users\JenkinsSlave\workspace\Lucene-Solr-trunk-Windows\solr\build\solr-core\test\J1\temp\solr.cloud.CdcrReplicationHandlerTest_A64E87B43ED22D4-001\jetty-001\cores\collection1\data
[junit4] 2> 1874485 INFO (coreLoadExecutor-6158-thread-1-processing-n:127.0.0.1:49408__jt) [n:127.0.0.1:49408__jt c:tmp_collection s:shard1 r:core_node1 x:collection1] o.a.s.c.SolrCore New index directory detected: old=null new=C:\Users\JenkinsSlave\workspace\Lucene-Solr-trunk-Windows\solr\build\solr-core\test\J1\temp\solr.cloud.CdcrReplicationHandlerTest_A64E87B43ED22D4-001\jetty-001\cores\collection1\data\index/
[junit4] 2> 1874486 WARN (coreLoadExecutor-6158-thread-1-processing-n:127.0.0.1:49408__jt) [n:127.0.0.1:49408__jt c:tmp_collection s:shard1 r:core_node1 x:collection1] o.a.s.c.SolrCore [collection1] Solr index directory 'C:\Users\JenkinsSlave\workspace\Lucene-Solr-trunk-Windows\solr\build\solr-core\test\J1\temp\solr.cloud.CdcrReplicationHandlerTest_A64E87B43ED22D4-001\jetty-001\cores\collection1\data\index' doesn't exist. Creating new index...
[junit4] 2> 1874487 INFO (coreLoadExecutor-6158-thread-1-processing-n:127.0.0.1:49408__jt) [n:127.0.0.1:49408__jt c:tmp_collection s:shard1 r:core_node1 x:collection1] o.a.s.c.CachingDirectoryFactory return new directory for C:\Users\JenkinsSlave\workspace\Lucene-Solr-trunk-Windows\solr\build\solr-core\test\J1\temp\solr.cloud.CdcrReplicationHandlerTest_A64E87B43ED22D4-001\jetty-001\cores\collection1\data\index
[junit4] 2> 1874488 INFO (coreLoadExecutor-6158-thread-1-processing-n:127.0.0.1:49408__jt) [n:127.0.0.1:49408__jt c:tmp_collection s:shard1 r:core_node1 x:collection1] o.a.s.u.RandomMergePolicy RandomMergePolicy wrapping class org.apache.lucene.index.LogByteSizeMergePolicy: [LogByteSizeMergePolicy: minMergeSize=1677721, mergeFactor=38, maxMergeSize=2147483648, maxMergeSizeForForcedMerge=9223372036854775807, calibrateSizeByDeletes=true, maxMergeDocs=2147483647, maxCFSSegmentSizeMB=8.796093022207999E12, noCFSRatio=0.6842141773188191]
[junit4] 2> 1874660 INFO (coreLoadExecutor-6158-thread-1-processing-n:127.0.0.1:49408__jt) [n:127.0.0.1:49408__jt c:tmp_collection s:shard1 r:core_node1 x:collection1] o.a.s.c.SolrCore SolrDeletionPolicy.onCommit: commits: num=1
[junit4] 2> commit{dir=C:\Users\JenkinsSlave\workspace\Lucene-Solr-trunk-Windows\solr\build\solr-core\test\J1\temp\solr.cloud.CdcrReplicationHandlerTest_A64E87B43ED22D4-001\jetty-001\cores\collection1\data\index,segFN=segments_1,generation=1}
[junit4] 2> 1874660 INFO (coreLoadExecutor-6158-thread-1-processing-n:127.0.0.1:49408__jt) [n:127.0.0.1:49408__jt c:tmp_collection s:shard1 r:core_node1 x:collection1] o.a.s.c.SolrCore newest commit generation = 1
[junit4] 2> 1874663 INFO (coreLoadExecutor-6158-thread-1-processing-n:127.0.0.1:49408__jt) [n:127.0.0.1:49408__jt c:tmp_collection s:shard1 r:core_node1 x:collection1] o.a.s.u.p.UpdateRequestProcessorChain creating updateRequestProcessorChain "cdcr-processor-chain"
[junit4] 2> 1874664 INFO (coreLoadExecutor-6158-thread-1-processing-n:127.0.0.1:49408__jt) [n:127.0.0.1:49408__jt c:tmp_collection s:shard1 r:core_node1 x:collection1] o.a.s.c.SolrCore no updateRequestProcessorChain defined as default, creating implicit default
[junit4] 2> 1874668 INFO (coreLoadExecutor-6158-thread-1-processing-n:127.0.0.1:49408__jt) [n:127.0.0.1:49408__jt c:tmp_collection s:shard1 r:core_node1 x:collection1] o.a.s.h.l.XMLLoader xsltCacheLifetimeSeconds=60
[junit4] 2> 1874669 INFO (coreLoadExecutor-6158-thread-1-processing-n:127.0.0.1:49408__jt) [n:127.0.0.1:49408__jt c:tmp_collection s:shard1 r:core_node1 x:collection1] o.a.s.h.l.XMLLoader xsltCacheLifetimeSeconds=60
[junit4] 2> 1874670 INFO (OldIndexDirectoryCleanupThreadForCore-collection1) [n:127.0.0.1:49408__jt c:tmp_collection s:shard1 r:core_node1 x:collection1] o.a.s.c.SolrCore Looking for old index directories to cleanup for core collection1 in C:\Users\JenkinsSlave\workspace\Lucene-Solr-trunk-Windows\solr\build\solr-core\test\J1\temp\solr.cloud.CdcrReplicationHandlerTest_A64E87B43ED22D4-001\jetty-001\cores\collection1\data\
[junit4] 2> 1874670 INFO (coreLoadExecutor-6158-thread-1-processing-n:127.0.0.1:49408__jt) [n:127.0.0.1:49408__jt c:tmp_collection s:shard1 r:core_node1 x:collection1] o.a.s.h.l.XMLLoader xsltCacheLifetimeSeconds=60
[junit4] 2> 1874671 INFO (coreLoadExecutor-6158-thread-1-processing-n:127.0.0.1:49408__jt) [n:127.0.0.1:49408__jt c:tmp_collection s:shard1 r:core_node1 x:collection1] o.a.s.h.l.XMLLoader xsltCacheLifetimeSeconds=60
[junit4] 2> 1874675 INFO (coreLoadExecutor-6158-thread-1-processing-n:127.0.0.1:49408__jt) [n:127.0.0.1:49408__jt c:tmp_collection s:shard1 r:core_node1 x:collection1] o.a.s.c.RequestHandlers Registered paths: /admin/mbeans,standard,/update/csv,/update/json/docs,/admin/luke,/admin/segments,/get,/admin/system,/replication,/admin/properties,/config,/schema,/admin/plugins,/admin/logging,/update/json,/admin/threads,/admin/ping,/cdcr,/update,/admin/file
[junit4] 2> 1874676 INFO (coreLoadExecutor-6158-thread-1-processing-n:127.0.0.1:49408__jt) [n:127.0.0.1:49408__jt c:tmp_collection s:shard1 r:core_node1 x:collection1] o.a.s.c.SolrCore Using default statsCache cache: org.apache.solr.search.stats.LocalStatsCache
[junit4] 2> 1874677 INFO (coreLoadExecutor-6158-thread-1-processing-n:127.0.0.1:49408__jt) [n:127.0.0.1:49408__jt c:tmp_collection s:shard1 r:core_node1 x:collection1] o.a.s.u.UpdateHandler Using UpdateLog implementation: org.apache.solr.update.CdcrUpdateLog
[junit4] 2> 1874677 INFO (coreLoadExecutor-6158-thread-1-processing-n:127.0.0.1:49408__jt) [n:127.0.0.1:49408__jt c:tmp_collection s:shard1 r:core_node1 x:collection1] o.a.s.u.UpdateLog Initializing UpdateLog: dataDir= defaultSyncLevel=FLUSH numRecordsToKeep=100 maxNumLogsToKeep=10 numVersionBuckets=65536
[junit4] 2> 1874679 INFO (coreLoadExecutor-6158-thread-1-processing-n:127.0.0.1:49408__jt) [n:127.0.0.1:49408__jt c:tmp_collection s:shard1 r:core_node1 x:collection1] o.a.s.c.SolrCore Hard AutoCommit: disabled
[junit4] 2> 1874679 INFO (coreLoadExecutor-6158-thread-1-processing-n:127.0.0.1:49408__jt) [n:127.0.0.1:49408__jt c:tmp_collection s:shard1 r:core_node1 x:collection1] o.a.s.c.SolrCore Soft AutoCommit: disabled
[junit4] 2> 1874680 INFO (coreLoadExecutor-6158-thread-1-processing-n:127.0.0.1:49408__jt) [n:127.0.0.1:49408__jt c:tmp_collection s:shard1 r:core_node1 x:collection1] o.a.s.u.RandomMergePolicy RandomMergePolicy wrapping class org.apache.lucene.index.TieredMergePolicy: [TieredMergePolicy: maxMergeAtOnce=10, maxMergeAtOnceExplicit=32, maxMergedSegmentMB=70.9697265625, floorSegmentMB=1.869140625, forceMergeDeletesPctAllowed=17.306174650371126, segmentsPerTier=17.0, maxCFSSegmentSizeMB=8.796093022207999E12, noCFSRatio=0.7929689788080883
[junit4] 2> 1874681 INFO (coreLoadExecutor-6158-thread-1-processing-n:127.0.0.1:49408__jt) [n:127.0.0.1:49408__jt c:tmp_collection s:shard1 r:core_node1 x:collection1] o.a.s.c.SolrCore SolrDeletionPolicy.onInit: commits: num=1
[junit4] 2> commit{dir=C:\Users\JenkinsSlave\workspace\Lucene-Solr-trunk-Windows\solr\build\solr-core\test\J1\temp\solr.cloud.CdcrReplicationHandlerTest_A64E87B43ED22D4-001\jetty-001\cores\collection1\data\index,segFN=segments_1,generation=1}
[junit4] 2> 1874681 INFO (coreLoadExecutor-6158-thread-1-processing-n:127.0.0.1:49408__jt) [n:127.0.0.1:49408__jt c:tmp_collection s:shard1 r:core_node1 x:collection1] o.a.s.c.SolrCore newest commit generation = 1
[junit4] 2> 1874681 INFO (coreLoadExecutor-6158-thread-1-processing-n:127.0.0.1:49408__jt) [n:127.0.0.1:49408__jt c:tmp_collection s:shard1 r:core_node1 x:collection1] o.a.s.s.SolrIndexSearcher Opening Searcher@56b18429[collection1] main
[junit4] 2> 1874682 INFO (coreLoadExecutor-6158-thread-1-processing-n:127.0.0.1:49408__jt) [n:127.0.0.1:49408__jt c:tmp_collection s:shard1 r:core_node1 x:collection1] o.a.s.c.c.ZkStateReader Load collection config from:/collections/tmp_collection
[junit4] 2> 1874682 INFO (coreLoadExecutor-6158-thread-1-processing-n:127.0.0.1:49408__jt) [n:127.0.0.1:49408__jt c:tmp_collection s:shard1 r:core_node1 x:collection1] o.a.s.c.c.ZkStateReader path=/collections/tmp_collection configName=conf1 specified config exists in ZooKeeper
[junit4] 2> 1874682 INFO (coreLoadExecutor-6158-thread-1-processing-n:127.0.0.1:49408__jt) [n:127.0.0.1:49408__jt c:tmp_collection s:shard1 r:core_node1 x:collection1] o.a.s.r.ManagedResourceStorage Setting up ZooKeeper-based storage for the RestManager with znodeBase: /configs/conf1
[junit4] 2> 1874683 INFO (coreLoadExecutor-6158-thread-1-processing-n:127.0.0.1:49408__jt) [n:127.0.0.1:49408__jt c:tmp_collection s:shard1 r:core_node1 x:collection1] o.a.s.r.ManagedResourceStorage Configured ZooKeeperStorageIO with znodeBase: /configs/conf1
[junit4] 2> 1874683 INFO (coreLoadExecutor-6158-thread-1-processing-n:127.0.0.1:49408__jt) [n:127.0.0.1:49408__jt c:tmp_collection s:shard1 r:core_node1 x:collection1] o.a.s.r.RestManager Initializing RestManager with initArgs: {}
[junit4] 2> 1874683 INFO (coreLoadExecutor-6158-thread-1-processing-n:127.0.0.1:49408__jt) [n:127.0.0.1:49408__jt c:tmp_collection s:shard1 r:core_node1 x:collection1] o.a.s.r.ManagedResourceStorage Reading _rest_managed.json using ZooKeeperStorageIO:path=/configs/conf1
[junit4] 2> 1874683 INFO (coreLoadExecutor-6158-thread-1-processing-n:127.0.0.1:49408__jt) [n:127.0.0.1:49408__jt c:tmp_collection s:shard1 r:core_node1 x:collection1] o.a.s.r.ManagedResourceStorage No data found for znode /configs/conf1/_rest_managed.json
[junit4] 2> 1874683 INFO (coreLoadExecutor-6158-thread-1-processing-n:127.0.0.1:49408__jt) [n:127.0.0.1:49408__jt c:tmp_collection s:shard1 r:core_node1 x:collection1] o.a.s.r.ManagedResourceStorage Loaded null at path _rest_managed.json using ZooKeeperStorageIO:path=/configs/conf1
[junit4] 2> 1874683 INFO (coreLoadExecutor-6158-thread-1-processing-n:127.0.0.1:49408__jt) [n:127.0.0.1:49408__jt c:tmp_collection s:shard1 r:core_node1 x:collection1] o.a.s.r.RestManager Initializing 0 registered ManagedResources
[junit4] 2> 1874683 INFO (coreLoadExecutor-6158-thread-1-processing-n:127.0.0.1:49408__jt) [n:127.0.0.1:49408__jt c:tmp_collection s:shard1 r:core_node1 x:collection1] o.a.s.h.ReplicationHandler Commits will be reserved for 10000
[junit4] 2> 1874685 INFO (coreLoadExecutor-6158-thread-1-processing-n:127.0.0.1:49408__jt) [n:127.0.0.1:49408__jt c:tmp_collection s:shard1 r:core_node1 x:collection1] o.a.s.c.c.SolrZkClient makePath: /collections/tmp_collection/cdcr/state
[junit4] 2> 1874689 INFO (coreLoadExecutor-6158-thread-1-processing-n:127.0.0.1:49408__jt) [n:127.0.0.1:49408__jt c:tmp_collection s:shard1 r:core_node1 x:collection1] o.a.s.h.CdcrBufferStateManager Created znode /collections/tmp_collection/cdcr/state/buffer
[junit4] 2> 1874691 INFO (coreLoadExecutor-6158-thread-1-processing-n:127.0.0.1:49408__jt) [n:127.0.0.1:49408__jt c:tmp_collection s:shard1 r:core_node1 x:collection1] o.a.s.h.CdcrProcessStateManager Created znode /collections/tmp_collection/cdcr/state/process
[junit4] 2> 1874693 INFO (coreLoadExecutor-6158-thread-1-processing-n:127.0.0.1:49408__jt) [n:127.0.0.1:49408__jt c:tmp_collection s:shard1 r:core_node1 x:collection1] o.a.s.u.UpdateLog Looking up max value of version field to seed version buckets
[junit4] 2> 1874693 INFO (coreLoadExecutor-6158-thread-1-processing-n:127.0.0.1:49408__jt) [n:127.0.0.1:49408__jt c:tmp_collection s:shard1 r:core_node1 x:collection1] o.a.s.u.VersionInfo Refreshing highest value of _version_ for 65536 version buckets from index
[junit4] 2> 1874693 INFO (coreLoadExecutor-6158-thread-1-processing-n:127.0.0.1:49408__jt) [n:127.0.0.1:49408__jt c:tmp_collection s:shard1 r:core_node1 x:collection1] o.a.s.u.VersionInfo No terms found for _version_, cannot seed version bucket highest value from index
[junit4] 2> 1874693 INFO (coreLoadExecutor-6158-thread-1-processing-n:127.0.0.1:49408__jt) [n:127.0.0.1:49408__jt c:tmp_collection s:shard1 r:core_node1 x:collection1] o.a.s.u.UpdateLog Could not find max version in index or recent updates, using new clock 1509706192210886656
[junit4] 2> 1874695 INFO (coreLoadExecutor-6158-thread-1-processing-n:127.0.0.1:49408__jt) [n:127.0.0.1:49408__jt c:tmp_collection s:shard1 r:core_node1 x:collection1] o.a.s.u.UpdateLog Took 1.0ms to seed version buckets with highest version 1509706192210886656
[junit4] 2> 1874695 INFO (coreLoadExecutor-6158-thread-1-processing-n:127.0.0.1:49408__jt) [n:127.0.0.1:49408__jt c:tmp_collection s:shard1 r:core_node1 x:collection1] o.a.s.c.ZkController watch zkdir /configs/conf1
[junit4] 2> 1874695 INFO (searcherExecutor-6159-thread-1-processing-n:127.0.0.1:49408__jt x:collection1 s:shard1 c:tmp_collection r:core_node1) [n:127.0.0.1:49408__jt c:tmp_collection s:shard1 r:core_node1 x:collection1] o.a.s.c.SolrCore [collection1] Registered new searcher Searcher@56b18429[collection1] main{ExitableDirectoryReader(UninvertingDirectoryReader())}
[junit4] 2> 1874696 INFO (coreLoadExecutor-6158-thread-1-processing-n:127.0.0.1:49408__jt) [n:127.0.0.1:49408__jt c:tmp_collection s:shard1 r:core_node1 x:collection1] o.a.s.c.CoreContainer registering core: collection1
[junit4] 2> 1874697 INFO (coreZkRegister-6152-thread-1-processing-n:127.0.0.1:49408__jt x:collection1 s:shard1 c:tmp_collection r:core_node1) [n:127.0.0.1:49408__jt c:tmp_collection s:shard1 r:core_node1 x:collection1] o.a.s.c.ZkController Register replica - core:collection1 address:http://127.0.0.1:49408/_jt collection:tmp_collection shard:shard1
[junit4] 2> 1874698 INFO (coreZkRegister-6152-thread-1-processing-n:127.0.0.1:49408__jt x:collection1 s:shard1 c:tmp_collection r:core_node1) [n:127.0.0.1:49408__jt c:tmp_collection s:shard1 r:core_node1 x:collection1] o.a.s.c.c.SolrZkClient makePath: /collections/tmp_collection/leader_elect/shard1/election
[junit4] 2> 1874702 INFO (coreZkRegister-6152-thread-1-processing-n:127.0.0.1:49408__jt x:collection1 s:shard1 c:tmp_collection r:core_node1) [n:127.0.0.1:49408__jt c:tmp_collection s:shard1 r:core_node1 x:collection1] o.a.s.c.LeaderElector Joined leadership election with path: /collections/tmp_collection/leader_elect/shard1/election/94356636881256452-core_node1-n_0000000000
[junit4] 2> 1874702 INFO (coreZkRegister-6152-thread-1-processing-n:127.0.0.1:49408__jt x:collection1 s:shard1 c:tmp_collection r:core_node1) [n:127.0.0.1:49408__jt c:tmp_collection s:shard1 r:core_node1 x:collection1] o.a.s.c.ShardLeaderElectionContext Running the leader process for shard shard1
[junit4] 2> 1874703 INFO (zkCallback-1791-thread-1-processing-n:127.0.0.1:49408__jt) [n:127.0.0.1:49408__jt ] o.a.s.c.DistributedQueue NodeChildrenChanged fired on path /overseer/queue state SyncConnected
[junit4] 2> 1874703 INFO (coreZkRegister-6152-thread-1-processing-n:127.0.0.1:49408__jt x:collection1 s:shard1 c:tmp_collection r:core_node1) [n:127.0.0.1:49408__jt c:tmp_collection s:shard1 r:core_node1 x:collection1] o.a.s.c.ShardLeaderElectionContext Enough replicas found to continue.
[junit4] 2> 1874703 INFO (coreZkRegister-6152-thread-1-processing-n:127.0.0.1:49408__jt x:collection1 s:shard1 c:tmp_collection r:core_node1) [n:127.0.0.1:49408__jt c:tmp_collection s:shard1 r:core_node1 x:collection1] o.a.s.c.ShardLeaderElectionContext I may be the new leader - try and sync
[junit4] 2> 1874704 INFO (coreZkRegister-6152-thread-1-processing-n:127.0.0.1:49408__jt x:collection1 s:shard1 c:tmp_collection r:core_node1) [n:127.0.0.1:49408__jt c:tmp_collection s:shard1 r:core_node1 x:collection1] o.a.s.c.SyncStrategy Sync replicas to http://127.0.0.1:49408/_jt/collection1/
[junit4] 2> 1874704 INFO (coreZkRegister-6152-thread-1-processing-n:127.0.0.1:49408__jt x:collection1 s:shard1 c:tmp_collection r:core_node1) [n:127.0.0.1:49408__jt c:tmp_collection s:shard1 r:core_node1 x:collection1] o.a.s.c.SyncStrategy Sync Success - now sync replicas to me
[junit4] 2> 1874704 INFO (coreZkRegister-6152-thread-1-processing-n:127.0.0.1:49408__jt x:collection1 s:shard1 c:tmp_collection r:core_node1) [n:127.0.0.1:49408__jt c:tmp_collection s:shard1 r:core_node1 x:collection1] o.a.s.c.SyncStrategy http://127.0.0.1:49408/_jt/collection1/ has no replicas
[junit4] 2> 1874704 INFO (coreZkRegister-6152-thread-1-processing-n:127.0.0.1:49408__jt x:collection1 s:shard1 c:tmp_collection r:core_node1) [n:127.0.0.1:49408__jt c:tmp_collection s:shard1 r:core_node1 x:collection1] o.a.s.c.ShardLeaderElectionContext I am the new leader: http://127.0.0.1:49408/_jt/collection1/ shard1
[junit4] 2> 1874704 INFO (OverseerStateUpdate-94356636881256452-127.0.0.1:49408__jt-n_0000000000) [n:127.0.0.1:49408__jt ] o.a.s.c.Overseer processMessage: queueSize: 1, message = {
[junit4] 2> "operation":"leader",
[junit4] 2> "shard":"shard1",
[junit4] 2> "collection":"tmp_collection"} current state version: 1
[junit4] 2> 1874704 INFO (coreZkRegister-6152-thread-1-processing-n:127.0.0.1:49408__jt x:collection1 s:shard1 c:tmp_collection r:core_node1) [n:127.0.0.1:49408__jt c:tmp_collection s:shard1 r:core_node1 x:collection1] o.a.s.c.c.SolrZkClient makePath: /collections/tmp_collection/leaders/shard1
[junit4] 2> 1874707 INFO (zkCallback-1791-thread-1-processing-n:127.0.0.1:49408__jt) [n:127.0.0.1:49408__jt ] o.a.s.h.CdcrProcessStateManager Received new leader state @ tmp_collection:shard1
[junit4] 2> 1874709 INFO (zkCallback-1791-thread-1-processing-n:127.0.0.1:49408__jt) [n:127.0.0.1:49408__jt ] o.a.s.c.DistributedQueue NodeChildrenChanged fired on path /overseer/queue state SyncConnected
[junit4] 2> 1874710 INFO (OverseerStateUpdate-94356636881256452-127.0.0.1:49408__jt-n_0000000000) [n:127.0.0.1:49408__jt ] o.a.s.c.Overseer processMessage: queueSize: 1, message = {
[junit4] 2> "operation":"leader",
[junit4] 2> "shard":"shard1",
[junit4] 2> "collection":"tmp_collection",
[junit4] 2> "base_url":"http://127.0.0.1:49408/_jt",
[junit4] 2> "core":"collection1",
[junit4] 2> "state":"active"} current state version: 1
[junit4] 2> 1874810 INFO (zkCallback-1791-thread-1-processing-n:127.0.0.1:49408__jt) [n:127.0.0.1:49408__jt ] o.a.s.c.c.ZkStateReader A cluster state change: WatchedEvent state:SyncConnected type:NodeDataChanged path:/clusterstate.json, has occurred - updating... (live nodes size: 1)
[junit4] 2> 1874858 INFO (coreZkRegister-6152-thread-1-processing-n:127.0.0.1:49408__jt x:collection1 s:shard1 c:tmp_collection r:core_node1) [n:127.0.0.1:49408__jt c:tmp_collection s:shard1 r:core_node1 x:collection1] o.a.s.c.ZkController We are http://127.0.0.1:49408/_jt/collection1/ and leader is http://127.0.0.1:49408/_jt/collection1/
[junit4] 2> 1874858 INFO (coreZkRegister-6152-thread-1-processing-n:127.0.0.1:49408__jt x:collection1 s:shard1 c:tmp_collection r:core_node1) [n:127.0.0.1:49408__jt c:tmp_collection s:shard1 r:core_node1 x:collection1] o.a.s.c.ZkController No LogReplay needed for core=collection1 baseURL=http://127.0.0.1:49408/_jt
[junit4] 2> 1874858 INFO (coreZkRegister-6152-thread-1-processing-n:127.0.0.1:49408__jt x:collection1 s:shard1 c:tmp_collection r:core_node1) [n:127.0.0.1:49408__jt c:tmp_collection s:shard1 r:core_node1 x:collection1] o.a.s.c.ZkController I am the leader, no recovery necessary
[junit4] 2> 1874858 INFO (coreZkRegister-6152-thread-1-processing-n:127.0.0.1:49408__jt x:collection1 s:shard1 c:tmp_collection r:core_node1) [n:127.0.0.1:49408__jt c:tmp_collection s:shard1 r:core_node1 x:collection1] o.a.s.c.ZkController publishing state=active
[junit4] 2> 1874858 INFO (coreZkRegister-6152-thread-1-processing-n:127.0.0.1:49408__jt x:collection1 s:shard1 c:tmp_collection r:core_node1) [n:127.0.0.1:49408__jt c:tmp_collection s:shard1 r:core_node1 x:collection1] o.a.s.c.ZkController numShards not found on descriptor - reading it from system property
[junit4] 2> 1874859 INFO (zkCallback-1791-thread-1-processing-n:127.0.0.1:49408__jt) [n:127.0.0.1:49408__jt ] o.a.s.c.DistributedQueue NodeChildrenChanged fired on path /overseer/queue state SyncConnected
[junit4] 2> 1874861 INFO (OverseerStateUpdate-94356636881256452-127.0.0.1:49408__jt-n_0000000000) [n:127.0.0.1:49408__jt ] o.a.s.c.Overseer processMessage: queueSize: 1, message = {
[junit4] 2> "core":"collection1",
[junit4] 2> "core_node_name":"core_node1",
[junit4] 2> "roles":null,
[junit4] 2> "base_url":"http://127.0.0.1:49408/_jt",
[junit4] 2> "node_name":"127.0.0.1:49408__jt",
[junit4] 2> "numShards":"1",
[junit4] 2> "state":"active",
[junit4] 2> "shard":"shard1",
[junit4] 2> "collection":"tmp_collection",
[junit4] 2> "operation":"state"} current state version: 2
[junit4] 2> 1874862 INFO (OverseerStateUpdate-94356636881256452-127.0.0.1:49408__jt-n_0000000000) [n:127.0.0.1:49408__jt ] o.a.s.c.o.ReplicaMutator Update state numShards=1 message={
[junit4] 2> "core":"collection1",
[junit4] 2> "core_node_name":"core_node1",
[junit4] 2> "roles":null,
[junit4] 2> "base_url":"http://127.0.0.1:49408/_jt",
[junit4] 2> "node_name":"127.0.0.1:49408__jt",
[junit4] 2> "numShards":"1",
[junit4] 2> "state":"active",
[junit4] 2> "shard":"shard1",
[junit4] 2> "collection":"tmp_collection",
[junit4] 2> "operation":"state"}
[junit4] 2> 1874961 INFO (zkCallback-1791-thread-1-processing-n:127.0.0.1:49408__jt) [n:127.0.0.1:49408__jt ] o.a.s.c.c.ZkStateReader A cluster state change: WatchedEvent state:SyncConnected type:NodeDataChanged path:/clusterstate.json, has occurred - updating... (live nodes size: 1)
[junit4] 2> 1875206 INFO (TEST-CdcrReplicationHandlerTest.doTest-seed#[A64E87B43ED22D4]) [ ] o.a.s.SolrTestCaseJ4 Writing core.properties file to C:\Users\JenkinsSlave\workspace\Lucene-Solr-trunk-Windows\solr\build\solr-core\test\J1\temp\solr.cloud.CdcrReplicationHandlerTest_A64E87B43ED22D4-001\jetty-002\cores\collection1
[junit4] 2> 1875209 INFO (TEST-CdcrReplicationHandlerTest.doTest-seed#[A64E87B43ED22D4]) [ ] o.e.j.s.Server jetty-9.2.11.v20150529
[junit4] 2> 1875222 INFO (TEST-CdcrReplicationHandlerTest.doTest-seed#[A64E87B43ED22D4]) [ ] o.e.j.s.h.ContextHandler Started o.e.j.s.ServletContextHandler@6d2a5ef1{/_jt,null,AVAILABLE}
[junit4] 2> 1875223 INFO (TEST-CdcrReplicationHandlerTest.doTest-seed#[A64E87B43ED22D4]) [ ] o.e.j.s.ServerConnector Started ServerConnector@103926ee{HTTP/1.1}{127.0.0.1:49438}
[junit4] 2> 1875223 INFO (TEST-CdcrReplicationHandlerTest.doTest-seed#[A64E87B43ED22D4]) [ ] o.e.j.s.Server Started @1879490ms
[junit4] 2> 1875223 INFO (TEST-CdcrReplicationHandlerTest.doTest-seed#[A64E87B43ED22D4]) [ ] o.a.s.c.s.e.JettySolrRunner Jetty properties: {shards=shard2, hostContext=/_jt, hostPort=49438, coreRootDirectory=C:\Users\JenkinsSlave\workspace\Lucene-Solr-trunk-Windows\solr\build\solr-core\test\J1\temp\solr.cloud.CdcrReplicationHandlerTest_A64E87B43ED22D4-001\jetty-002\cores}
[junit4] 2> 1875224 INFO (TEST-CdcrReplicationHandlerTest.doTest-seed#[A64E87B43ED22D4]) [ ] o.a.s.s.SolrDispatchFilter SolrDispatchFilter.init(): sun.misc.Launcher$AppClassLoader@4e0e2f2a
[junit4] 2> 1875224 INFO (TEST-CdcrReplicationHandlerTest.doTest-seed#[A64E87B43ED22D4]) [ ] o.a.s.c.SolrResourceLoader new SolrResourceLoader for directory: 'C:\Users\JenkinsSlave\workspace\Lucene-Solr-trunk-Windows\solr\build\solr-core\test\J1\temp\solr.cloud.CdcrReplicationHandlerTest_A64E87B43ED22D4-001\jetty-002\'
[junit4] 2> 1875248 INFO (TEST-CdcrReplicationHandlerTest.doTest-seed#[A64E87B43ED22D4]) [ ] o.a.s.c.c.SolrZkClient Using default ZkCredentialsProvider
[junit4] 2> 1875250 INFO (TEST-CdcrReplicationHandlerTest.doTest-seed#[A64E87B43ED22D4]) [ ] o.a.s.c.c.ConnectionManager Waiting for client to connect to ZooKeeper
[junit4] 2> 1875252 INFO (zkCallback-1792-thread-1) [ ] o.a.s.c.c.ConnectionManager Watcher org.apache.solr.common.cloud.ConnectionManager@63aadf23 name:ZooKeeperConnection Watcher:127.0.0.1:49389/solr got event WatchedEvent state:SyncConnected type:None path:null path:null type:None
[junit4] 2> 1875252 INFO (TEST-CdcrReplicationHandlerTest.doTest-seed#[A64E87B43ED22D4]) [ ] o.a.s.c.c.ConnectionManager Client is connected to ZooKeeper
[junit4] 2> 1875252 INFO (TEST-CdcrReplicationHandlerTest.doTest-seed#[A64E87B43ED22D4]) [ ] o.a.s.c.c.SolrZkClient Using default ZkACLProvider
[junit4] 2> 1875254 INFO (TEST-CdcrReplicationHandlerTest.doTest-seed#[A64E87B43ED22D4]) [ ] o.a.s.s.SolrDispatchFilter Loading solr.xml from SolrHome (not found in ZooKeeper)
[junit4] 2> 1875254 INFO (TEST-CdcrReplicationHandlerTest.doTest-seed#[A64E87B43ED22D4]) [ ] o.a.s.c.SolrXmlConfig Loading container configuration from C:\Users\JenkinsSlave\workspace\Lucene-Solr-trunk-Windows\solr\build\solr-core\test\J1\temp\solr.cloud.CdcrReplicationHandlerTest_A64E87B43ED22D4-001\jetty-002\solr.xml
[junit4] 2> 1875262 INFO (TEST-CdcrReplicationHandlerTest.doTest-seed#[A64E87B43ED22D4]) [ ] o.a.s.c.CoresLocator Config-defined core root directory: C:\Users\JenkinsSlave\workspace\Lucene-Solr-trunk-Windows\solr\build\solr-core\test\J1\temp\solr.cloud.CdcrReplicationHandlerTest_A64E87B43ED22D4-001\jetty-002\cores
[junit4] 2> 1875262 INFO (TEST-CdcrReplicationHandlerTest.doTest-seed#[A64E87B43ED22D4]) [ ] o.a.s.c.CoreContainer New CoreContainer 1409261338
[junit4] 2> 1875262 INFO (TEST-CdcrReplicationHandlerTest.doTest-seed#[A64E87B43ED22D4]) [ ] o.a.s.c.CoreContainer Loading cores into CoreContainer [instanceDir=C:\Users\JenkinsSlave\workspace\Lucene-Solr-trunk-Windows\solr\build\solr-core\test\J1\temp\solr.cloud.CdcrReplicationHandlerTest_A64E87B43ED22D4-001\jetty-002\]
[junit4] 2> 1875262 INFO (TEST-CdcrReplicationHandlerTest.doTest-seed#[A64E87B43ED22D4]) [ ] o.a.s.c.CoreContainer loading shared library: C:\Users\JenkinsSlave\workspace\Lucene-Solr-trunk-Windows\solr\build\solr-core\test\J1\temp\solr.cloud.CdcrReplicationHandlerTest_A64E87B43ED22D4-001\jetty-002\lib
[junit4] 2> 1875263 WARN (TEST-CdcrReplicationHandlerTest.doTest-seed#[A64E87B43ED22D4]) [ ] o.a.s.c.SolrResourceLoader Can't find (or read) directory to add to classloader: lib (resolved as: C:\Users\JenkinsSlave\workspace\Lucene-Solr-trunk-Windows\solr\build\solr-core\test\J1\temp\solr.cloud.CdcrReplicationHandlerTest_A64E87B43ED22D4-001\jetty-002\lib).
[junit4] 2> 1875270 INFO (TEST-CdcrReplicationHandlerTest.doTest-seed#[A64E87B43ED22D4]) [ ] o.a.s.h.c.HttpShardHandlerFactory created with socketTimeout : 90000,urlScheme : ,connTimeout : 15000,maxConnectionsPerHost : 20,maxConnections : 10000,corePoolSize : 0,maximumPoolSize : 2147483647,maxThreadIdleTime : 5,sizeOfQueue : -1,fairnessPolicy : false,useRetries : false,
[junit4] 2> 1875272 INFO (TEST-CdcrReplicationHandlerTest.doTest-seed#[A64E87B43ED22D4]) [ ] o.a.s.u.UpdateShardHandler Creating UpdateShardHandler HTTP client with params: socketTimeout=340000&connTimeout=45000&retry=true
[junit4] 2> 1875273 INFO (TEST-CdcrReplicationHandlerTest.doTest-seed#[A64E87B43ED22D4]) [ ] o.a.s.l.LogWatcher SLF4J impl is org.slf4j.impl.Log4jLoggerFactory
[junit4] 2> 1875273 INFO (TEST-CdcrReplicationHandlerTest.doTest-seed#[A64E87B43ED22D4]) [ ] o.a.s.l.LogWatcher Registering Log Listener [Log4j (org.slf4j.impl.Log4jLoggerFactory)]
[junit4] 2> 1875273 INFO (TEST-CdcrReplicationHandlerTest.doTest-seed#[A64E87B43ED22D4]) [ ] o.a.s.c.ZkContainer Zookeeper client=127.0.0.1:49389/solr
[junit4] 2> 1875273 INFO (TEST-CdcrReplicationHandlerTest.doTest-seed#[A64E87B43ED22D4]) [ ] o.a.s.c.ZkController zkHost includes chroot
[junit4] 2> 1875273 INFO (TEST-CdcrReplicationHandlerTest.doTest-seed#[A64E87B43ED22D4]) [ ] o.a.s.c.c.SolrZkClient Using default ZkCredentialsProvider
[junit4] 2> 1875275 INFO (TEST-CdcrReplicationHandlerTest.doTest-seed#[A64E87B43ED22D4]) [ ] o.a.s.c.c.ConnectionManager Waiting for client to connect to ZooKeeper
[junit4] 2> 1875276 INFO (zkCallback-1794-thread-1) [ ] o.a.s.c.c.ConnectionManager Watcher org.apache.solr.common.cloud.ConnectionManager@237e49cf name:ZooKeeperConnection Watcher:127.0.0.1:49389 got event WatchedEvent state:SyncConnected type:None path:null path:null type:None
[junit4] 2> 1875276 INFO (TEST-CdcrReplicationHandlerTest.doTest-seed#[A64E87B43ED22D4]) [ ] o.a.s.c.c.ConnectionManager Client is connected to ZooKeeper
[junit4] 2> 1875276 INFO (TEST-CdcrReplicationHandlerTest.doTest-seed#[A64E87B43ED22D4]) [ ] o.a.s.c.c.SolrZkClient Using default ZkACLProvider
[junit4] 2> 1875279 INFO (TEST-CdcrReplicationHandlerTest.doTest-seed#[A64E87B43ED22D4]) [n:127.0.0.1:49438__jt ] o.a.s.c.c.ConnectionManager Waiting for client to connect to ZooKeeper
[junit4] 2> 1875280 INFO (zkCallback-1795-thread-1-processing-n:127.0.0.1:49438__jt) [n:127.0.0.1:49438__jt ] o.a.s.c.c.ConnectionManager Watcher org.apache.solr.common.cloud.ConnectionManager@68acc5bd name:ZooKeeperConnection Watcher:127.0.0.1:49389/solr got event WatchedEvent state:SyncConnected type:None path:null path:null type:None
[junit4] 2> 1875280 INFO (TEST-CdcrReplicationHandlerTest.doTest-seed#[A64E87B43ED22D4]) [n:127.0.0.1:49438__jt ] o.a.s.c.c.ConnectionManager Client is connected to ZooKeeper
[junit4] 2> 1875286 INFO (TEST-CdcrReplicationHandlerTest.doTest-seed#[A64E87B43ED22D4]) [n:127.0.0.1:49438__jt ] o.a.s.c.c.ZkStateReader Updating cluster state from ZooKeeper...
[junit4] 2> 1876293 INFO (TEST-CdcrReplicationHandlerTest.doTest-seed#[A64E87B43ED22D4]) [n:127.0.0.1:49438__jt ] o.a.s.c.ZkController Register node as live in ZooKeeper:/live_nodes/127.0.0.1:49438__jt
[junit4] 2> 1876294 INFO (TEST-CdcrReplicationHandlerTest.doTest-seed#[A64E87B43ED22D4]) [n:127.0.0.1:49438__jt ] o.a.s.c.c.SolrZkClient makePath: /live_nodes/127.0.0.1:49438__jt
[junit4] 2> 1876295 INFO (zkCallback-1795-thread-1-processing-n:127.0.0.1:49438__jt) [n:127.0.0.1:49438__jt ] o.a.s.c.c.ZkStateReader A live node change: WatchedEvent state:SyncConnected type:NodeChildrenChanged path:/live_nodes, has occurred - updating... (live nodes size: 1)
[junit4] 2> 1876295 INFO (zkCallback-1791-thread-1-processing-n:127.0.0.1:49408__jt) [n:127.0.0.1:49408__jt ] o.a.s.c.c.ZkStateReader A live node change: WatchedEvent state:SyncConnected type:NodeChildrenChanged path:/live_nodes, has occurred - updating... (live nodes size: 1)
[junit4] 2> 1876297 INFO (TEST-CdcrReplicationHandlerTest.doTest-seed#[A64E87B43ED22D4]) [n:127.0.0.1:49438__jt ] o.a.s.c.Overseer Overseer (id=null) closing
[junit4] 2> 1876298 INFO (TEST-CdcrReplicationHandlerTest.doTest-seed#[A64E87B43ED22D4]) [n:127.0.0.1:49438__jt ] o.a.s.c.LeaderElector Joined leadership election with path: /overseer_elect/election/94356636881256455-127.0.0.1:49438__jt-n_0000000001
[junit4] 2> 1876299 INFO (TEST-CdcrReplicationHandlerTest.doTest-seed#[A64E87B43ED22D4]) [n:127.0.0.1:49438__jt ] o.a.s.c.LeaderElector Watching path /overseer_elect/election/94356636881256452-127.0.0.1:49408__jt-n_0000000000 to know if I could be the leader
[junit4] 2> 1876307 INFO (TEST-CdcrReplicationHandlerTest.doTest-seed#[A64E87B43ED22D4]) [n:127.0.0.1:49438__jt ] o.a.s.c.CoreContainer Security conf doesn't exist. Skipping setup for authorization module.
[junit4] 2> 1876307 INFO (TEST-CdcrReplicationHandlerTest.doTest-seed#[A64E87B43ED22D4]) [n:127.0.0.1:49438__jt ] o.a.s.c.CoreContainer No authentication plugin used.
[junit4] 2> 1876309 INFO (TEST-CdcrReplicationHandlerTest.doTest-seed#[A64E87B43ED22D4]) [n:127.0.0.1:49438__jt ] o.a.s.c.CoresLocator Looking for core definitions underneath C:\Users\JenkinsSlave\workspace\Lucene-Solr-trunk-Windows\solr\build\solr-core\test\J1\temp\solr.cloud.CdcrReplicationHandlerTest_A64E87B43ED22D4-001\jetty-002\cores
[junit4] 2> 1876310 INFO (TEST-CdcrReplicationHandlerTest.doTest-seed#[A64E87B43ED22D4]) [n:127.0.0.1:49438__jt ] o.a.s.c.SolrCore Created CoreDescriptor: {name=collection1, config=solrconfig.xml, transient=false, schema=schema.xml, loadOnStartup=true, configSetProperties=configsetprops.json, instanceDir=C:\Users\JenkinsSlave\workspace\Lucene-Solr-trunk-Windows\solr\build\solr-core\test\J1\temp\solr.cloud.CdcrReplicationHandlerTest_A64E87B43ED22D4-001\jetty-002\cores\collection1, collection=tmp_collection, absoluteInstDir=C:\Users\JenkinsSlave\workspace\Lucene-Solr-trunk-Windows\solr\build\solr-core\test\J1\temp\solr.cloud.CdcrReplicationHandlerTest_A64E87B43ED22D4-001\jetty-002\cores\collection1\, coreNodeName=, dataDir=data\, shard=}
[junit4] 2> 1876310 INFO (TEST-CdcrReplicationHandlerTest.doTest-seed#[A64E87B43ED22D4]) [n:127.0.0.1:49438__jt ] o.a.s.c.CoresLocator Found core collection1 in C:\Users\JenkinsSlave\workspace\Lucene-Solr-trunk-Windows\solr\build\solr-core\test\J1\temp\solr.cloud.CdcrReplicationHandlerTest_A64E87B43ED22D4-001\jetty-002\cores\collection1\
[junit4] 2> 1876310 INFO (TEST-CdcrReplicationHandlerTest.doTest-seed#[A64E87B43ED22D4]) [n:127.0.0.1:49438__jt ] o.a.s.c.CoresLocator Found 1 core definitions
[junit4] 2> 1876311 INFO (TEST-CdcrReplicationHandlerTest.doTest-seed#[A64E87B43ED22D4]) [n:127.0.0.1:49438__jt ] o.a.s.s.SolrDispatchFilter user.dir=C:\Users\JenkinsSlave\workspace\Lucene-Solr-trunk-Windows\solr\build\solr-core\test\J1
[junit4] 2> 1876312 INFO (TEST-CdcrReplicationHandlerTest.doTest-seed#[A64E87B43ED22D4]) [n:127.0.0.1:49438__jt ] o.a.s.s.SolrDispatchFilter SolrDispatchFilter.init() done
[junit4] 2> 1876311 INFO (coreLoadExecutor-6170-thread-1-processing-n:127.0.0.1:49438__jt) [n:127.0.0.1:49438__jt c:tmp_collection x:collection1] o.a.s.c.ZkController publishing state=down
[junit4] 2> 1876312 INFO (coreLoadExecutor-6170-thread-1-processing-n:127.0.0.1:49438__jt) [n:127.0.0.1:49438__jt c:tmp_collection x:collection1] o.a.s.c.ZkController numShards not found on descriptor - reading it from system property
[junit4] 2> 1876313 INFO (zkCallback-1791-thread-1-processing-n:127.0.0.1:49408__jt) [n:127.0.0.1:49408__jt ] o.a.s.c.DistributedQueue NodeChildrenChanged fired on path /overseer/queue state SyncConnected
[junit4] 2> 1876313 INFO (coreLoadExecutor-6170-thread-1-processing-n:127.0.0.1:49438__jt) [n:127.0.0.1:49438__jt c:tmp_collection x:collection1] o.a.s.c.ZkController Registering watch for collection tmp_collection
[junit4] 2> 1876313 INFO (coreLoadExecutor-6170-thread-1-processing-n:127.0.0.1:49438__jt) [n:127.0.0.1:49438__jt c:tmp_collection x:collection1] o.a.s.c.c.ZkStateReader addZkWatch tmp_collection
[junit4] 2> 1876313 INFO (coreLoadExecutor-6170-thread-1-processing-n:127.0.0.1:49438__jt) [n:127.0.0.1:49438__jt c:tmp_collection x:collection1] o.a.s.c.c.ZkStateReader Deleting data for tmp_collection
[junit4] 2> 1876314 INFO (coreLoadExecutor-6170-thread-1-processing-n:127.0.0.1:49438__jt) [n:127.0.0.1:49438__jt c:tmp_collection x:collection1] o.a.s.c.ZkController look for our core node name
[junit4] 2> 1876314 INFO (OverseerStateUpdate-94356636881256452-127.0.0.1:49408__jt-n_0000000000) [n:127.0.0.1:49408__jt ] o.a.s.c.Overseer processMessage: queueSize: 1, message = {
[junit4] 2> "core":"collection1",
[junit4] 2> "roles":null,
[junit4] 2> "base_url":"http://127.0.0.1:49438/_jt",
[junit4] 2> "node_name":"127.0.0.1:49438__jt",
[junit4] 2> "numShards":"1",
[junit4] 2> "state":"down",
[junit4] 2> "shard":null,
[junit4] 2> "collection":"tmp_collection",
[junit4] 2> "operation":"state"} current state version: 3
[junit4] 2> 1876314 INFO (OverseerStateUpdate-94356636881256452-127.0.0.1:49408__jt-n_0000000000) [n:127.0.0.1:49408__jt ] o.a.s.c.o.ReplicaMutator Update state numShards=1 message={
[junit4] 2> "core":"collection1",
[junit4] 2> "roles":null,
[junit4] 2> "base_url":"http://127.0.0.1:49438/_jt",
[junit4] 2> "node_name":"127.0.0.1:49438__jt",
[junit4] 2> "numShards":"1",
[junit4] 2> "state":"down",
[junit4] 2> "shard":null,
[junit4] 2> "collection":"tmp_collection",
[junit4] 2> "operation":"state"}
[junit4] 2> 1876315 INFO (OverseerStateUpdate-94356636881256452-127.0.0.1:49408__jt-n_0000000000) [n:127.0.0.1:49408__jt ] o.a.s.c.o.ReplicaMutator Collection already exists with numShards=1
[junit4] 2> 1876315 INFO (OverseerStateUpdate-94356636881256452-127.0.0.1:49408__jt-n_0000000000) [n:127.0.0.1:49408__jt ] o.a.s.c.o.ReplicaMutator Assigning new node to shard shard=shard1
[junit4] 2> 1876418 INFO (zkCallback-1791-thread-1-processing-n:127.0.0.1:49408__jt) [n:127.0.0.1:49408__jt ] o.a.s.c.c.ZkStateReader A cluster state change: WatchedEvent state:SyncConnected type:NodeDataChanged path:/clusterstate.json, has occurred - updating... (live nodes size: 2)
[junit4] 2> 1876418 INFO (zkCallback-1795-thread-1-processing-n:127.0.0.1:49438__jt) [n:127.0.0.1:49438__jt ] o.a.s.c.c.ZkStateReader A cluster state change: WatchedEvent state:SyncConnected type:NodeDataChanged path:/clusterstate.json, has occurred - updating... (live nodes size: 2)
[junit4] 2> 1877314 INFO (coreLoadExecutor-6170-thread-1-processing-n:127.0.0.1:49438__jt) [n:127.0.0.1:49438__jt c:tmp_collection x:collection1] o.a.s.c.ZkController waiting to find shard id in clusterstate for collection1
[junit4] 2> 1877314 INFO (coreLoadExecutor-6170-thread-1-processing-n:127.0.0.1:49438__jt) [n:127.0.0.1:49438__jt c:tmp_collection x:collection1] o.a.s.c.ZkController Check for collection zkNode:tmp_collection
[junit4] 2> 1877314 INFO (coreLoadExecutor-6170-thread-1-processing-n:127.0.0.1:49438__jt) [n:127.0.0.1:49438__jt c:tmp_collection x:collection1] o.a.s.c.ZkController Collection zkNode exists
[junit4] 2> 1877315 INFO (coreLoadExecutor-6170-thread-1-processing-n:127.0.0.1:49438__jt) [n:127.0.0.1:49438__jt c:tmp_collection x:collection1] o.a.s.c.c.ZkStateReader Load collection config from:/collections/tmp_collection
[junit4] 2> 1877316 INFO (coreLoadExecutor-6170-thread-1-processing-n:127.0.0.1:49438__jt) [n:127.0.0.1:49438__jt c:tmp_collection x:collection1] o.a.s.c.c.ZkStateReader path=/collections/tmp_collection configName=conf1 specified config exists in ZooKeeper
[junit4] 2> 1877316 INFO (coreLoadExecutor-6170-thread-1-processing-n:127.0.0.1:49438__jt) [n:127.0.0.1:49438__jt c:tmp_collection x:collection1] o.a.s.c.SolrResourceLoader new SolrResourceLoader for directory: 'C:\Users\JenkinsSlave\workspace\Lucene-Solr-trunk-Windows\solr\build\solr-core\test\J1\temp\solr.cloud.CdcrReplicationHandlerTest_A64E87B43ED22D4-001\jetty-002\cores\collection1\'
[junit4] 2> 1877328 INFO (coreLoadExecutor-6170-thread-1-processing-n:127.0.0.1:49438__jt) [n:127.0.0.1:49438__jt c:tmp_collection x:collection1] o.a.s.c.Config loaded config solrconfig.xml with version 0
[junit4] 2> 1877335 INFO (coreLoadExecutor-6170-thread-1-processing-n:127.0.0.1:49438__jt) [n:127.0.0.1:49438__jt c:tmp_collection x:collection1] o.a.s.c.SolrConfig current version of requestparams : -1
[junit4] 2> 1877337 INFO (coreLoadExecutor-6170-thread-1-processing-n:127.0.0.1:49438__jt) [n:127.0.0.1:49438__jt c:tmp_collection x:collection1] o.a.s.c.SolrConfig Using Lucene MatchVersion: 6.0.0
[junit4] 2> 1877343 INFO (coreLoadExecutor-6170-thread-1-processing-n:127.0.0.1:49438__jt) [n:127.0.0.1:49438__jt c:tmp_collection x:collection1] o.a.s.c.Config Loaded SolrConfig: solrconfig.xml
[junit4] 2> 1877344 INFO (coreLoadExecutor-6170-thread-1-processing-n:127.0.0.1:49438__jt) [n:127.0.0.1:49438__jt c:tmp_collection x:collection1] o.a.s.s.IndexSchema Reading Solr Schema from /configs/conf1/schema.xml
[junit4] 2> 1877348 INFO (coreLoadExecutor-6170-thread-1-processing-n:127.0.0.1:49438__jt) [n:127.0.0.1:49438__jt c:tmp_collection x:collection1] o.a.s.s.IndexSchema [collection1] Schema name=test
[junit4] 2> 1877423 INFO (coreLoadExecutor-6170-thread-1-processing-n:127.0.0.1:49438__jt) [n:127.0.0.1:49438__jt c:tmp_collection x:collection1] o.a.s.s.IndexSchema default search field in schema is text
[junit4] 2> 1877424 INFO (coreLoadExecutor-6170-thread-1-processing-n:127.0.0.1:49438__jt) [n:127.0.0.1:49438__jt c:tmp_collection x:collection1] o.a.s.s.IndexSchema unique key field: id
[junit4] 2> 1877425 INFO (coreLoadExecutor-6170-thread-1-processing-n:127.0.0.1:49438__jt) [n:127.0.0.1:49438__jt c:tmp_collection x:collection1] o.a.s.s.FileExchangeRateProvider Reloading exchange rates from file currency.xml
[junit4] 2> 1877427 INFO (coreLoadExecutor-6170-thread-1-processing-n:127.0.0.1:49438__jt) [n:127.0.0.1:49438__jt c:tmp_collection x:collection1] o.a.s.s.FileExchangeRateProvider Reloading exchange rates from file currency.xml
[junit4] 2> 1877445 INFO (coreLoadExecutor-6170-thread-1-processing-n:127.0.0.1:49438__jt) [n:127.0.0.1:49438__jt c:tmp_collection x:collection1] o.a.s.c.ConfigSetProperties Did not find ConfigSet properties, assuming default properties: Can't find resource 'configsetprops.json' in classpath or '/configs/conf1', cwd=C:\Users\JenkinsSlave\workspace\Lucene-Solr-trunk-Windows\solr\build\solr-core\test\J1
[junit4] 2> 1877446 INFO (coreLoadExecutor-6170-thread-1-processing-n:127.0.0.1:49438__jt) [n:127.0.0.1:49438__jt c:tmp_collection x:collection1] o.a.s.c.CoreContainer Creating SolrCore 'collection1' using configuration from collection tmp_collection
[junit4] 2> 1877446 INFO (coreLoadExecutor-6170-thread-1-processing-n:127.0.0.1:49438__jt) [n:127.0.0.1:49438__jt c:tmp_collection s:shard1 r:core_node2 x:collection1] o.a.s.c.SolrCore solr.StandardDirectoryFactory
[junit4] 2> 1877446 INFO (coreLoadExecutor-6170-thread-1-processing-n:127.0.0.1:49438__jt) [n:127.0.0.1:49438__jt c:tmp_collection s:shard1 r:core_node2 x:collection1] o.a.s.c.SolrCore [[collection1] ] Opening new SolrCore at [C:\Users\JenkinsSlave\workspace\Lucene-Solr-trunk-Windows\solr\build\solr-core\test\J1\temp\solr.cloud.CdcrReplicationHandlerTest_A64E87B43ED22D4-001\jetty-002\cores\collection1\], dataDir=[null]
[junit4] 2> 1877447 INFO (coreLoadExecutor-6170-thread-1-processing-n:127.0.0.1:49438__jt) [n:127.0.0.1:49438__jt c:tmp_collection s:shard1 r:core_node2 x:collection1] o.a.s.c.JmxMonitoredMap JMX monitoring is enabled. Adding Solr mbeans to JMX Server: com.sun.jmx.mbeanserver.JmxMBeanServer@1549156e
[junit4] 2> 1877448 INFO (coreLoadExecutor-6170-thread-1-processing-n:127.0.0.1:49438__jt) [n:127.0.0.1:49438__jt c:tmp_collection s:shard1 r:core_node2 x:collection1] o.a.s.c.CachingDirectoryFactory return new directory for C:\Users\JenkinsSlave\workspace\Lucene-Solr-trunk-Windows\solr\build\solr-core\test\J1\temp\solr.cloud.CdcrReplicationHandlerTest_A64E87B43ED22D4-001\jetty-002\cores\collection1\data
[junit4] 2> 1877449 INFO (coreLoadExecutor-6170-thread-1-processing-n:127.0.0.1:49438__jt) [n:127.0.0.1:49438__jt c:tmp_collection s:shard1 r:core_node2 x:collection1] o.a.s.c.SolrCore New index directory detected: old=null new=C:\Users\JenkinsSlave\workspace\Lucene-Solr-trunk-Windows\solr\build\solr-core\test\J1\temp\solr.cloud.CdcrReplicationHandlerTest_A64E87B43ED22D4-001\jetty-002\cores\collection1\data\index/
[junit4] 2> 1877449 WARN (coreLoadExecutor-6170-thread-1-processing-n:127.0.0.1:49438__jt) [n:127.0.0.1:49438__jt c:tmp_collection s:shard1 r:core_node2 x:collection1] o.a.s.c.SolrCore [collection1] Solr index directory 'C:\Users\JenkinsSlave\workspace\Lucene-Solr-trunk-Windows\solr\build\solr-core\test\J1\temp\solr.cloud.CdcrReplicationHandlerTest_A64E87B43ED22D4-001\jetty-002\cores\collection1\data\index' doesn't exist. Creating new index...
[junit4] 2> 1877450 INFO (coreLoadExecutor-6170-thread-1-processing-n:127.0.0.1:49438__jt) [n:127.0.0.1:49438__jt c:tmp_collection s:shard1 r:core_node2 x:collection1] o.a.s.c.CachingDirectoryFactory return new directory for C:\Users\JenkinsSlave\workspace\Lucene-Solr-trunk-Windows\solr\build\solr-core\test\J1\temp\solr.cloud.CdcrReplicationHandlerTest_A64E87B43ED22D4-001\jetty-002\cores\collection1\data\index
[junit4] 2> 1877451 INFO (coreLoadExecutor-6170-thread-1-processing-n:127.0.0.1:49438__jt) [n:127.0.0.1:49438__jt c:tmp_collection s:shard1 r:core_node2 x:collection1] o.a.s.u.RandomMergePolicy RandomMergePolicy wrapping class org.apache.lucene.index.LogByteSizeMergePolicy: [LogByteSizeMergePolicy: minMergeSize=1677721, mergeFactor=38, maxMergeSize=2147483648, maxMergeSizeForForcedMerge=9223372036854775807, calibrateSizeByDeletes=true, maxMergeDocs=2147483647, maxCFSSegmentSizeMB=8.796093022207999E12, noCFSRatio=0.6842141773188191]
[junit4] 2> 1877676 INFO (coreLoadExecutor-6170-thread-1-processing-n:127.0.0.1:49438__jt) [n:127.0.0.1:49438__jt c:tmp_collection s:shard1 r:core_node2 x:collection1] o.a.s.c.SolrCore SolrDeletionPolicy.onCommit: commits: num=1
[junit4] 2> commit{dir=C:\Users\JenkinsSlave\workspace\Lucene-Solr-trunk-Windows\solr\build\solr-core\test\J1\temp\solr.cloud.CdcrReplicationHandlerTest_A64E87B43ED22D4-001\jetty-002\cores\collection1\data\index,segFN=segments_1,generation=1}
[junit4] 2> 1877676 INFO (coreLoadExecutor-6170-thread-1-processing-n:127.0.0.1:49438__jt) [n:127.0.0.1:49438__jt c:tmp_collection s:shard1 r:core_node2 x:collection1] o.a.s.c.SolrCore newest commit generation = 1
[junit4] 2> 1877677 INFO (OldIndexDirectoryCleanupThreadForCore-collection1) [n:127.0.0.1:49438__jt c:tmp_collection s:shard1 r:core_node2 x:collection1] o.a.s.c.SolrCore Looking for old index directories to cleanup for core collection1 in C:\Users\JenkinsSlave\workspace\Lucene-Solr-trunk-Windows\solr\build\solr-core\test\J1\temp\solr.cloud.CdcrReplicationHandlerTest_A64E87B43ED22D4-001\jetty-002\cores\collection1\data\
[junit4] 2> 1877679 INFO (coreLoadExecutor-6170-thread-1-processing-n:127.0.0.1:49438__jt) [n:127.0.0.1:49438__jt c:tmp_collection
[...truncated too long message...]
/solr/clusterstate.json
[junit4] 2> 4 /solr/collections/collection1/state.json
[junit4] 2>
[junit4] 2> Maximum concurrent children watches above limit:
[junit4] 2>
[junit4] 2> 6 /solr/live_nodes
[junit4] 2> 4 /solr/overseer/collection-queue-work
[junit4] 2> 2 /solr/overseer/queue
[junit4] 2>
[junit4] 2> NOTE: reproduce with: ant test -Dtestcase=TestAuthorizationFramework -Dtests.method=authorizationFrameworkTest -Dtests.seed=A64E87B43ED22D4 -Dtests.slow=true -Dtests.locale=ar_LB -Dtests.timezone=Atlantic/Cape_Verde -Dtests.asserts=true -Dtests.file.encoding=Cp1252
[junit4] FAILURE 31.7s J0 | TestAuthorizationFramework.authorizationFrameworkTest <<<
[junit4] > Throwable #1: java.lang.AssertionError: This should have failed
[junit4] > at __randomizedtesting.SeedInfo.seed([A64E87B43ED22D4:44C79DA8523633C4]:0)
[junit4] > at org.apache.solr.security.TestAuthorizationFramework.authorizationFrameworkTest(TestAuthorizationFramework.java:69)
[junit4] > at org.apache.solr.BaseDistributedSearchTestCase$ShardsRepeatRule$ShardsFixedStatement.callStatement(BaseDistributedSearchTestCase.java:963)
[junit4] > at org.apache.solr.BaseDistributedSearchTestCase$ShardsRepeatRule$ShardsStatement.evaluate(BaseDistributedSearchTestCase.java:938)
[junit4] > at java.lang.Thread.run(Thread.java:745)
[junit4] 2> 3023901 INFO (SUITE-TestAuthorizationFramework-seed#[A64E87B43ED22D4]-worker) [n:127.0.0.1:55193_ c:collection1 s:shard1 r:core_node4 x:collection1] o.a.s.SolrTestCaseJ4 ###deleteCore
[junit4] 2> NOTE: leaving temporary files on disk at: C:\Users\JenkinsSlave\workspace\Lucene-Solr-trunk-Windows\solr\build\solr-core\test\J0\temp\solr.security.TestAuthorizationFramework_A64E87B43ED22D4-001
[junit4] 2> NOTE: test params are: codec=CheapBastard, sim=RandomSimilarityProvider(queryNorm=true,coord=no): {}, locale=ar_LB, timezone=Atlantic/Cape_Verde
[junit4] 2> NOTE: Windows 7 6.1 amd64/Oracle Corporation 1.8.0_51 (64-bit)/cpus=3,threads=1,free=56131176,total=528482304
[junit4] 2> NOTE: All tests run in this JVM: [SharedFSAutoReplicaFailoverUtilsTest, TestDefaultStatsCache, CacheHeaderTest, DocValuesMultiTest, CleanupOldIndexTest, SOLR749Test, SolrCoreCheckLockOnStartupTest, TestExceedMaxTermLength, ExplicitHLLTest, PeerSyncTest, TestNamedUpdateProcessors, TestMaxScoreQueryParser, TestHashQParserPlugin, DistributedFacetPivotSmallTest, TestCoreContainer, TriLevelCompositeIdRoutingTest, TestBlendedInfixSuggestions, TestCollectionAPI, HdfsDirectoryTest, TestPhraseSuggestions, TestConfigSetProperties, TestSchemaManager, TestSolrCLIRunExample, HdfsRecoveryZkTest, HdfsSyncSliceTest, TestExactStatsCache, TestSolrIndexConfig, RuleEngineTest, TestFunctionQuery, TestSchemaNameResource, TestCloudManagedSchemaConcurrent, HdfsBasicDistributedZkTest, CoreMergeIndexesAdminHandlerTest, RequestHandlersTest, OutOfBoxZkACLAndCredentialsProvidersTest, SuggesterFSTTest, DistributedSpellCheckComponentTest, TestCollationFieldDocValues, TestSolrQueryParserDefaultOperatorResource, TestFastLRUCache, HttpPartitionTest, CursorMarkTest, DistributedDebugComponentTest, CloudExitableDirectoryReaderTest, SortByFunctionTest, TestExpandComponent, TestCursorMarkWithoutUniqueKey, TestStressReorder, ConcurrentDeleteAndCreateCollectionTest, TestCSVLoader, TestLFUCache, DeleteReplicaTest, TestFieldCollectionResource, MultiTermTest, HdfsNNFailoverTest, DistributedFacetPivotWhiteBoxTest, SystemInfoHandlerTest, QueryElevationComponentTest, TestInitParams, TestReRankQParserPlugin, TestSolrDynamicMBean, HdfsDirectoryFactoryTest, CoreAdminRequestStatusTest, SolrPluginUtilsTest, TestRandomDVFaceting, UniqFieldsUpdateProcessorFactoryTest, DirectUpdateHandlerTest, ClusterStateUpdateTest, TestConfigSetImmutable, TestIndexSearcher, PathHierarchyTokenizerFactoryTest, TestWriterPerf, DistributedExpandComponentTest, PingRequestHandlerTest, CustomCollectionTest, TestCollationField, TestFieldTypeCollectionResource, AddSchemaFieldsUpdateProcessorFactoryTest, SoftAutoCommitTest, IgnoreCommitOptimizeUpdateProcessorFactoryTest, TimeZoneUtilsTest, DocumentAnalysisRequestHandlerTest, TestHashPartitioner, PreAnalyzedUpdateProcessorTest, PreAnalyzedFieldTest, CachingDirectoryFactoryTest, TestDownShardTolerantSearch, ResponseLogComponentTest, SliceStateTest, SynonymTokenizerTest, SolrInfoMBeanTest, VMParamsZkACLAndCredentialsProvidersTest, TestDefaultSearchFieldResource, SecurityConfHandlerTest, ParsingFieldUpdateProcessorsTest, NumericFieldsTest, BasicDistributedZkTest, TestJsonFacets, DOMUtilTest, ChaosMonkeyNothingIsSafeTest, AlternateDirectoryTest, OutputWriterTest, LukeRequestHandlerTest, TestReplicationHandler, TestRebalanceLeaders, TestManagedResourceStorage, TestSweetSpotSimilarityFactory, SolrIndexSplitterTest, OverseerTest, DistributedSuggestComponentTest, TestCloudSchemaless, UUIDFieldTest, TestCloudInspectUtil, URLClassifyProcessorTest, LeaderElectionTest, SolrCoreTest, TestIndexingPerformance, TestStressLucene, BlockCacheTest, TestDistributedStatsComponentCardinality, TestIBSimilarityFactory, TestSortingResponseWriter, AnalysisErrorHandlingTest, DocValuesTest, ZkStateReaderTest, TestDistributedMissingSort, HLLSerializationTest, SyncSliceTest, TestShortCircuitedRequests, UnloadDistributedZkTest, TestSurroundQueryParser, TestZkChroot, ZkCLITest, TestDistributedGrouping, TestFaceting, TestRecovery, ZkControllerTest, TestRealTimeGet, TestReload, TestStressVersions, HardAutoCommitTest, TestRangeQuery, SimpleFacetsTest, TestSolr4Spatial, SpellCheckComponentTest, TestGroupingSearch, BadIndexSchemaTest, ConvertedLegacyTest, TestSort, TestFiltering, BasicFunctionalityTest, TestLazyCores, TestBadConfig, OverseerCollectionProcessorTest, ShowFileRequestHandlerTest, CurrencyFieldOpenExchangeTest, DistributedQueryElevationComponentTest, AnalysisAfterCoreReloadTest, TestExtendedDismaxParser, CoreAdminHandlerTest, SolrRequestParserTest, TestFoldingMultitermQuery, SuggesterTSTTest, SuggesterTest, TestTrie, SpatialFilterTest, SuggesterWFSTTest, NoCacheHeaderTest, TestPseudoReturnFields, TestUpdate, TestAtomicUpdateErrorCases, TestWordDelimiterFilterFactory, DefaultValueUpdateProcessorTest, StatelessScriptUpdateProcessorFactoryTest, DistanceFunctionTest, IndexBasedSpellCheckerTest, StandardRequestHandlerTest, DirectSolrSpellCheckerTest, PrimitiveFieldTypeTest, TestOmitPositions, DocumentBuilderTest, TermVectorComponentTest, RequiredFieldsTest, TestSolrQueryParser, IndexSchemaRuntimeFieldTest, LoggingHandlerTest, IndexSchemaTest, JSONWriterTest, MBeansHandlerTest, TestPartialUpdateDeduplication, TestPHPSerializedResponseWriter, TestComponentsName, SearchHandlerTest, HighlighterConfigTest, BadComponentTest, TestStressRecovery, TestBinaryField, ExternalFileFieldSortTest, TestSolrCoreProperties, DirectSolrConnectionTest, TestCharFilters, TestDFRSimilarityFactory, TestPerFieldSimilarity, TestBM25SimilarityFactory, TestFastOutputStream, ScriptEngineTest, PluginInfoTest, PrimUtilsTest, TestDocumentBuilder, FileUtilsTest, TestRTGBase, CursorPagingTest, DistributedIntervalFacetingTest, TestEmbeddedSolrServerConstructors, TestJettySolrRunner, AsyncMigrateRouteKeyTest, CdcrRequestHandlerTest, CollectionReloadTest, CollectionsAPIAsyncDistributedZkTest, ConnectionManagerTest, DeleteInactiveReplicaTest, DeleteLastCustomShardedReplicaTest, DeleteShardTest, DistribDocExpirationUpdateProcessorTest, DistribJoinFromCollectionTest, DistributedQueueTest, DistributedVersionInfoTest, MultiThreadedOCPTest, RecoveryAfterSoftCommitTest, RollingRestartTest, SolrCloudExampleTest, TestCryptoKeys, TestLeaderElectionZkExpiry, TestMiniSolrCloudClusterSSL, TestReplicaProperties, TestRequestStatusCollectionAPI, HdfsBasicDistributedZk2Test, HdfsChaosMonkeySafeLeaderTest, HdfsCollectionsAPIDistributedZkTest, HdfsThreadLeakTest, HdfsUnloadDistributedZkTest, StressHdfsTest, TestClusterStateMutator, RulesTest, TestConfigReload, TestSolrConfigHandlerConcurrent, DistributedFacetPivotLongTailTest, TestPivotHelperCode, TestTrackingShardHandlerFactory, TestDynamicFieldResource, TestFieldTypeResource, TestManagedSchemaFieldResource, TestRemoveLastDynamicCopyField, TestSchemaSimilarityResource, TestSerializedLuceneMatchVersion, TestManagedSynonymFilterFactory, TestCloudManagedSchema, AnalyticsMergeStrategyTest, RankQueryTest, TestComplexPhraseQParserPlugin, TestSearcherReuse, TestStressUserVersions, BJQParserTest, TestScoreJoinQPScore, TestJsonRequest, TestNonDefinedSimilarityFactory, TestDistribIDF, TestExactSharedStatsCache, TestAuthorizationFramework]
[junit4] Completed [540/540] on J0 in 31.67s, 1 test, 1 failure <<< FAILURES!
[...truncated 11 lines...]
BUILD FAILED
C:\Users\JenkinsSlave\workspace\Lucene-Solr-trunk-Windows\build.xml:775: The following error occurred while executing this line:
C:\Users\JenkinsSlave\workspace\Lucene-Solr-trunk-Windows\build.xml:719: The following error occurred while executing this line:
C:\Users\JenkinsSlave\workspace\Lucene-Solr-trunk-Windows\build.xml:59: The following error occurred while executing this line:
C:\Users\JenkinsSlave\workspace\Lucene-Solr-trunk-Windows\solr\build.xml:233: The following error occurred while executing this line:
C:\Users\JenkinsSlave\workspace\Lucene-Solr-trunk-Windows\solr\common-build.xml:514: The following error occurred while executing this line:
C:\Users\JenkinsSlave\workspace\Lucene-Solr-trunk-Windows\lucene\common-build.xml:1429: The following error occurred while executing this line:
C:\Users\JenkinsSlave\workspace\Lucene-Solr-trunk-Windows\lucene\common-build.xml:984: There were test failures: 540 suites, 2131 tests, 2 failures, 77 ignored (41 assumptions)
Total time: 67 minutes 13 seconds
Build step 'Invoke Ant' marked build as failure
Archiving artifacts
[WARNINGS] Skipping publisher since build result is FAILURE
Recording test results
Email was triggered for: Failure - Any
Sending email for trigger: Failure - Any