You are viewing a plain text version of this content. The canonical link for it is here.
Posted to dev@lucene.apache.org by Policeman Jenkins Server <je...@thetaphi.de> on 2015/09/28 10:00:45 UTC
[JENKINS] Lucene-Solr-trunk-Solaris (64bit/jdk1.8.0) - Build # 84 -
Still Failing!
Build: http://jenkins.thetaphi.de/job/Lucene-Solr-trunk-Solaris/84/
Java: 64bit/jdk1.8.0 -XX:+UseCompressedOops -XX:+UseConcMarkSweepGC
2 tests failed.
FAILED: org.apache.solr.cloud.RemoteQueryErrorTest.test
Error Message:
There are still nodes recoverying - waited for 15 seconds
Stack Trace:
java.lang.AssertionError: There are still nodes recoverying - waited for 15 seconds
at __randomizedtesting.SeedInfo.seed([2172154495F25F90:A9262A9E3B0E3268]:0)
at org.junit.Assert.fail(Assert.java:93)
at org.apache.solr.cloud.AbstractDistribZkTestBase.waitForRecoveriesToFinish(AbstractDistribZkTestBase.java:172)
at org.apache.solr.cloud.AbstractFullDistribZkTestBase.waitForRecoveriesToFinish(AbstractFullDistribZkTestBase.java:836)
at org.apache.solr.cloud.AbstractFullDistribZkTestBase.waitForThingsToLevelOut(AbstractFullDistribZkTestBase.java:1393)
at org.apache.solr.cloud.RemoteQueryErrorTest.test(RemoteQueryErrorTest.java:48)
at sun.reflect.NativeMethodAccessorImpl.invoke0(Native Method)
at sun.reflect.NativeMethodAccessorImpl.invoke(NativeMethodAccessorImpl.java:62)
at sun.reflect.DelegatingMethodAccessorImpl.invoke(DelegatingMethodAccessorImpl.java:43)
at java.lang.reflect.Method.invoke(Method.java:497)
at com.carrotsearch.randomizedtesting.RandomizedRunner.invoke(RandomizedRunner.java:1665)
at com.carrotsearch.randomizedtesting.RandomizedRunner$8.evaluate(RandomizedRunner.java:864)
at com.carrotsearch.randomizedtesting.RandomizedRunner$9.evaluate(RandomizedRunner.java:900)
at com.carrotsearch.randomizedtesting.RandomizedRunner$10.evaluate(RandomizedRunner.java:914)
at org.apache.solr.BaseDistributedSearchTestCase$ShardsRepeatRule$ShardsFixedStatement.callStatement(BaseDistributedSearchTestCase.java:963)
at org.apache.solr.BaseDistributedSearchTestCase$ShardsRepeatRule$ShardsStatement.evaluate(BaseDistributedSearchTestCase.java:938)
at com.carrotsearch.randomizedtesting.rules.SystemPropertiesRestoreRule$1.evaluate(SystemPropertiesRestoreRule.java:57)
at org.apache.lucene.util.TestRuleSetupTeardownChained$1.evaluate(TestRuleSetupTeardownChained.java:50)
at org.apache.lucene.util.AbstractBeforeAfterRule$1.evaluate(AbstractBeforeAfterRule.java:46)
at org.apache.lucene.util.TestRuleThreadAndTestName$1.evaluate(TestRuleThreadAndTestName.java:49)
at org.apache.lucene.util.TestRuleIgnoreAfterMaxFailures$1.evaluate(TestRuleIgnoreAfterMaxFailures.java:65)
at org.apache.lucene.util.TestRuleMarkFailure$1.evaluate(TestRuleMarkFailure.java:48)
at com.carrotsearch.randomizedtesting.rules.StatementAdapter.evaluate(StatementAdapter.java:36)
at com.carrotsearch.randomizedtesting.ThreadLeakControl$StatementRunner.run(ThreadLeakControl.java:367)
at com.carrotsearch.randomizedtesting.ThreadLeakControl.forkTimeoutingTask(ThreadLeakControl.java:809)
at com.carrotsearch.randomizedtesting.ThreadLeakControl$3.evaluate(ThreadLeakControl.java:460)
at com.carrotsearch.randomizedtesting.RandomizedRunner.runSingleTest(RandomizedRunner.java:873)
at com.carrotsearch.randomizedtesting.RandomizedRunner$5.evaluate(RandomizedRunner.java:775)
at com.carrotsearch.randomizedtesting.RandomizedRunner$6.evaluate(RandomizedRunner.java:809)
at com.carrotsearch.randomizedtesting.RandomizedRunner$7.evaluate(RandomizedRunner.java:820)
at com.carrotsearch.randomizedtesting.rules.StatementAdapter.evaluate(StatementAdapter.java:36)
at com.carrotsearch.randomizedtesting.rules.SystemPropertiesRestoreRule$1.evaluate(SystemPropertiesRestoreRule.java:57)
at org.apache.lucene.util.AbstractBeforeAfterRule$1.evaluate(AbstractBeforeAfterRule.java:46)
at com.carrotsearch.randomizedtesting.rules.StatementAdapter.evaluate(StatementAdapter.java:36)
at org.apache.lucene.util.TestRuleStoreClassName$1.evaluate(TestRuleStoreClassName.java:42)
at com.carrotsearch.randomizedtesting.rules.NoShadowingOrOverridesOnMethodsRule$1.evaluate(NoShadowingOrOverridesOnMethodsRule.java:39)
at com.carrotsearch.randomizedtesting.rules.NoShadowingOrOverridesOnMethodsRule$1.evaluate(NoShadowingOrOverridesOnMethodsRule.java:39)
at com.carrotsearch.randomizedtesting.rules.StatementAdapter.evaluate(StatementAdapter.java:36)
at com.carrotsearch.randomizedtesting.rules.StatementAdapter.evaluate(StatementAdapter.java:36)
at com.carrotsearch.randomizedtesting.rules.StatementAdapter.evaluate(StatementAdapter.java:36)
at org.apache.lucene.util.TestRuleAssertionsRequired$1.evaluate(TestRuleAssertionsRequired.java:54)
at org.apache.lucene.util.TestRuleMarkFailure$1.evaluate(TestRuleMarkFailure.java:48)
at org.apache.lucene.util.TestRuleIgnoreAfterMaxFailures$1.evaluate(TestRuleIgnoreAfterMaxFailures.java:65)
at org.apache.lucene.util.TestRuleIgnoreTestSuites$1.evaluate(TestRuleIgnoreTestSuites.java:55)
at com.carrotsearch.randomizedtesting.rules.StatementAdapter.evaluate(StatementAdapter.java:36)
at com.carrotsearch.randomizedtesting.ThreadLeakControl$StatementRunner.run(ThreadLeakControl.java:367)
at java.lang.Thread.run(Thread.java:745)
FAILED: org.apache.solr.handler.TestReplicationHandler.doTestIndexAndConfigAliasReplication
Error Message:
Index: 0, Size: 0
Stack Trace:
java.lang.IndexOutOfBoundsException: Index: 0, Size: 0
at __randomizedtesting.SeedInfo.seed([2172154495F25F90:D601FB1C531AF076]:0)
at java.util.ArrayList.rangeCheck(ArrayList.java:653)
at java.util.ArrayList.get(ArrayList.java:429)
at org.apache.solr.handler.TestReplicationHandler.doTestIndexAndConfigAliasReplication(TestReplicationHandler.java:1239)
at sun.reflect.NativeMethodAccessorImpl.invoke0(Native Method)
at sun.reflect.NativeMethodAccessorImpl.invoke(NativeMethodAccessorImpl.java:62)
at sun.reflect.DelegatingMethodAccessorImpl.invoke(DelegatingMethodAccessorImpl.java:43)
at java.lang.reflect.Method.invoke(Method.java:497)
at com.carrotsearch.randomizedtesting.RandomizedRunner.invoke(RandomizedRunner.java:1665)
at com.carrotsearch.randomizedtesting.RandomizedRunner$8.evaluate(RandomizedRunner.java:864)
at com.carrotsearch.randomizedtesting.RandomizedRunner$9.evaluate(RandomizedRunner.java:900)
at com.carrotsearch.randomizedtesting.RandomizedRunner$10.evaluate(RandomizedRunner.java:914)
at com.carrotsearch.randomizedtesting.rules.SystemPropertiesRestoreRule$1.evaluate(SystemPropertiesRestoreRule.java:57)
at org.apache.lucene.util.TestRuleSetupTeardownChained$1.evaluate(TestRuleSetupTeardownChained.java:50)
at org.apache.lucene.util.AbstractBeforeAfterRule$1.evaluate(AbstractBeforeAfterRule.java:46)
at org.apache.lucene.util.TestRuleThreadAndTestName$1.evaluate(TestRuleThreadAndTestName.java:49)
at org.apache.lucene.util.TestRuleIgnoreAfterMaxFailures$1.evaluate(TestRuleIgnoreAfterMaxFailures.java:65)
at org.apache.lucene.util.TestRuleMarkFailure$1.evaluate(TestRuleMarkFailure.java:48)
at com.carrotsearch.randomizedtesting.rules.StatementAdapter.evaluate(StatementAdapter.java:36)
at com.carrotsearch.randomizedtesting.ThreadLeakControl$StatementRunner.run(ThreadLeakControl.java:367)
at com.carrotsearch.randomizedtesting.ThreadLeakControl.forkTimeoutingTask(ThreadLeakControl.java:809)
at com.carrotsearch.randomizedtesting.ThreadLeakControl$3.evaluate(ThreadLeakControl.java:460)
at com.carrotsearch.randomizedtesting.RandomizedRunner.runSingleTest(RandomizedRunner.java:873)
at com.carrotsearch.randomizedtesting.RandomizedRunner$5.evaluate(RandomizedRunner.java:775)
at com.carrotsearch.randomizedtesting.RandomizedRunner$6.evaluate(RandomizedRunner.java:809)
at com.carrotsearch.randomizedtesting.RandomizedRunner$7.evaluate(RandomizedRunner.java:820)
at com.carrotsearch.randomizedtesting.rules.StatementAdapter.evaluate(StatementAdapter.java:36)
at com.carrotsearch.randomizedtesting.rules.SystemPropertiesRestoreRule$1.evaluate(SystemPropertiesRestoreRule.java:57)
at org.apache.lucene.util.AbstractBeforeAfterRule$1.evaluate(AbstractBeforeAfterRule.java:46)
at com.carrotsearch.randomizedtesting.rules.StatementAdapter.evaluate(StatementAdapter.java:36)
at org.apache.lucene.util.TestRuleStoreClassName$1.evaluate(TestRuleStoreClassName.java:42)
at com.carrotsearch.randomizedtesting.rules.NoShadowingOrOverridesOnMethodsRule$1.evaluate(NoShadowingOrOverridesOnMethodsRule.java:39)
at com.carrotsearch.randomizedtesting.rules.NoShadowingOrOverridesOnMethodsRule$1.evaluate(NoShadowingOrOverridesOnMethodsRule.java:39)
at com.carrotsearch.randomizedtesting.rules.StatementAdapter.evaluate(StatementAdapter.java:36)
at com.carrotsearch.randomizedtesting.rules.StatementAdapter.evaluate(StatementAdapter.java:36)
at com.carrotsearch.randomizedtesting.rules.StatementAdapter.evaluate(StatementAdapter.java:36)
at org.apache.lucene.util.TestRuleAssertionsRequired$1.evaluate(TestRuleAssertionsRequired.java:54)
at org.apache.lucene.util.TestRuleMarkFailure$1.evaluate(TestRuleMarkFailure.java:48)
at org.apache.lucene.util.TestRuleIgnoreAfterMaxFailures$1.evaluate(TestRuleIgnoreAfterMaxFailures.java:65)
at org.apache.lucene.util.TestRuleIgnoreTestSuites$1.evaluate(TestRuleIgnoreTestSuites.java:55)
at com.carrotsearch.randomizedtesting.rules.StatementAdapter.evaluate(StatementAdapter.java:36)
at com.carrotsearch.randomizedtesting.ThreadLeakControl$StatementRunner.run(ThreadLeakControl.java:367)
at java.lang.Thread.run(Thread.java:745)
Build Log:
[...truncated 9882 lines...]
[junit4] Suite: org.apache.solr.cloud.RemoteQueryErrorTest
[junit4] 2> Creating dataDir: /export/home/jenkins/workspace/Lucene-Solr-trunk-Solaris/solr/build/solr-core/test/J0/temp/solr.cloud.RemoteQueryErrorTest_2172154495F25F90-001/init-core-data-001
[junit4] 2> 1375283 INFO (SUITE-RemoteQueryErrorTest-seed#[2172154495F25F90]-worker) [ ] o.a.s.SolrTestCaseJ4 Randomized ssl (false) and clientAuth (false)
[junit4] 2> 1375283 INFO (SUITE-RemoteQueryErrorTest-seed#[2172154495F25F90]-worker) [ ] o.a.s.BaseDistributedSearchTestCase Setting hostContext system property: /
[junit4] 2> 1375286 INFO (TEST-RemoteQueryErrorTest.test-seed#[2172154495F25F90]) [ ] o.a.s.c.ZkTestServer STARTING ZK TEST SERVER
[junit4] 2> 1375287 INFO (Thread-3556) [ ] o.a.s.c.ZkTestServer client port:0.0.0.0/0.0.0.0:0
[junit4] 2> 1375287 INFO (Thread-3556) [ ] o.a.s.c.ZkTestServer Starting server
[junit4] 2> 1375388 INFO (TEST-RemoteQueryErrorTest.test-seed#[2172154495F25F90]) [ ] o.a.s.c.ZkTestServer start zk server on port:45429
[junit4] 2> 1375388 INFO (TEST-RemoteQueryErrorTest.test-seed#[2172154495F25F90]) [ ] o.a.s.c.c.SolrZkClient Using default ZkCredentialsProvider
[junit4] 2> 1375389 INFO (TEST-RemoteQueryErrorTest.test-seed#[2172154495F25F90]) [ ] o.a.s.c.c.ConnectionManager Waiting for client to connect to ZooKeeper
[junit4] 2> 1375394 INFO (zkCallback-1708-thread-1) [ ] o.a.s.c.c.ConnectionManager Watcher org.apache.solr.common.cloud.ConnectionManager@39741cf8 name:ZooKeeperConnection Watcher:127.0.0.1:45429 got event WatchedEvent state:SyncConnected type:None path:null path:null type:None
[junit4] 2> 1375395 INFO (TEST-RemoteQueryErrorTest.test-seed#[2172154495F25F90]) [ ] o.a.s.c.c.ConnectionManager Client is connected to ZooKeeper
[junit4] 2> 1375395 INFO (TEST-RemoteQueryErrorTest.test-seed#[2172154495F25F90]) [ ] o.a.s.c.c.SolrZkClient Using default ZkACLProvider
[junit4] 2> 1375395 INFO (TEST-RemoteQueryErrorTest.test-seed#[2172154495F25F90]) [ ] o.a.s.c.c.SolrZkClient makePath: /solr
[junit4] 2> 1375401 INFO (TEST-RemoteQueryErrorTest.test-seed#[2172154495F25F90]) [ ] o.a.s.c.c.SolrZkClient Using default ZkCredentialsProvider
[junit4] 2> 1375401 INFO (TEST-RemoteQueryErrorTest.test-seed#[2172154495F25F90]) [ ] o.a.s.c.c.ConnectionManager Waiting for client to connect to ZooKeeper
[junit4] 2> 1375407 INFO (zkCallback-1709-thread-1) [ ] o.a.s.c.c.ConnectionManager Watcher org.apache.solr.common.cloud.ConnectionManager@5b8da9b1 name:ZooKeeperConnection Watcher:127.0.0.1:45429/solr got event WatchedEvent state:SyncConnected type:None path:null path:null type:None
[junit4] 2> 1375407 INFO (TEST-RemoteQueryErrorTest.test-seed#[2172154495F25F90]) [ ] o.a.s.c.c.ConnectionManager Client is connected to ZooKeeper
[junit4] 2> 1375407 INFO (TEST-RemoteQueryErrorTest.test-seed#[2172154495F25F90]) [ ] o.a.s.c.c.SolrZkClient Using default ZkACLProvider
[junit4] 2> 1375408 INFO (TEST-RemoteQueryErrorTest.test-seed#[2172154495F25F90]) [ ] o.a.s.c.c.SolrZkClient makePath: /collections/collection1
[junit4] 2> 1375411 INFO (TEST-RemoteQueryErrorTest.test-seed#[2172154495F25F90]) [ ] o.a.s.c.c.SolrZkClient makePath: /collections/collection1/shards
[junit4] 2> 1375413 INFO (TEST-RemoteQueryErrorTest.test-seed#[2172154495F25F90]) [ ] o.a.s.c.c.SolrZkClient makePath: /collections/control_collection
[junit4] 2> 1375415 INFO (TEST-RemoteQueryErrorTest.test-seed#[2172154495F25F90]) [ ] o.a.s.c.c.SolrZkClient makePath: /collections/control_collection/shards
[junit4] 2> 1375418 INFO (TEST-RemoteQueryErrorTest.test-seed#[2172154495F25F90]) [ ] o.a.s.c.AbstractZkTestCase put /export/home/jenkins/workspace/Lucene-Solr-trunk-Solaris/solr/core/src/test-files/solr/collection1/conf/solrconfig-tlog.xml to /configs/conf1/solrconfig.xml
[junit4] 2> 1375426 INFO (TEST-RemoteQueryErrorTest.test-seed#[2172154495F25F90]) [ ] o.a.s.c.c.SolrZkClient makePath: /configs/conf1/solrconfig.xml
[junit4] 2> 1375431 INFO (TEST-RemoteQueryErrorTest.test-seed#[2172154495F25F90]) [ ] o.a.s.c.AbstractZkTestCase put /export/home/jenkins/workspace/Lucene-Solr-trunk-Solaris/solr/core/src/test-files/solr/collection1/conf/schema.xml to /configs/conf1/schema.xml
[junit4] 2> 1375435 INFO (TEST-RemoteQueryErrorTest.test-seed#[2172154495F25F90]) [ ] o.a.s.c.c.SolrZkClient makePath: /configs/conf1/schema.xml
[junit4] 2> 1375440 INFO (TEST-RemoteQueryErrorTest.test-seed#[2172154495F25F90]) [ ] o.a.s.c.AbstractZkTestCase put /export/home/jenkins/workspace/Lucene-Solr-trunk-Solaris/solr/core/src/test-files/solr/collection1/conf/solrconfig.snippet.randomindexconfig.xml to /configs/conf1/solrconfig.snippet.randomindexconfig.xml
[junit4] 2> 1375445 INFO (TEST-RemoteQueryErrorTest.test-seed#[2172154495F25F90]) [ ] o.a.s.c.c.SolrZkClient makePath: /configs/conf1/solrconfig.snippet.randomindexconfig.xml
[junit4] 2> 1375449 INFO (TEST-RemoteQueryErrorTest.test-seed#[2172154495F25F90]) [ ] o.a.s.c.AbstractZkTestCase put /export/home/jenkins/workspace/Lucene-Solr-trunk-Solaris/solr/core/src/test-files/solr/collection1/conf/stopwords.txt to /configs/conf1/stopwords.txt
[junit4] 2> 1375450 INFO (TEST-RemoteQueryErrorTest.test-seed#[2172154495F25F90]) [ ] o.a.s.c.c.SolrZkClient makePath: /configs/conf1/stopwords.txt
[junit4] 2> 1375454 INFO (TEST-RemoteQueryErrorTest.test-seed#[2172154495F25F90]) [ ] o.a.s.c.AbstractZkTestCase put /export/home/jenkins/workspace/Lucene-Solr-trunk-Solaris/solr/core/src/test-files/solr/collection1/conf/protwords.txt to /configs/conf1/protwords.txt
[junit4] 2> 1375456 INFO (TEST-RemoteQueryErrorTest.test-seed#[2172154495F25F90]) [ ] o.a.s.c.c.SolrZkClient makePath: /configs/conf1/protwords.txt
[junit4] 2> 1375459 INFO (TEST-RemoteQueryErrorTest.test-seed#[2172154495F25F90]) [ ] o.a.s.c.AbstractZkTestCase put /export/home/jenkins/workspace/Lucene-Solr-trunk-Solaris/solr/core/src/test-files/solr/collection1/conf/currency.xml to /configs/conf1/currency.xml
[junit4] 2> 1375463 INFO (TEST-RemoteQueryErrorTest.test-seed#[2172154495F25F90]) [ ] o.a.s.c.c.SolrZkClient makePath: /configs/conf1/currency.xml
[junit4] 2> 1375466 INFO (TEST-RemoteQueryErrorTest.test-seed#[2172154495F25F90]) [ ] o.a.s.c.AbstractZkTestCase put /export/home/jenkins/workspace/Lucene-Solr-trunk-Solaris/solr/core/src/test-files/solr/collection1/conf/enumsConfig.xml to /configs/conf1/enumsConfig.xml
[junit4] 2> 1375474 INFO (TEST-RemoteQueryErrorTest.test-seed#[2172154495F25F90]) [ ] o.a.s.c.c.SolrZkClient makePath: /configs/conf1/enumsConfig.xml
[junit4] 2> 1375479 INFO (TEST-RemoteQueryErrorTest.test-seed#[2172154495F25F90]) [ ] o.a.s.c.AbstractZkTestCase put /export/home/jenkins/workspace/Lucene-Solr-trunk-Solaris/solr/core/src/test-files/solr/collection1/conf/open-exchange-rates.json to /configs/conf1/open-exchange-rates.json
[junit4] 2> 1375479 INFO (TEST-RemoteQueryErrorTest.test-seed#[2172154495F25F90]) [ ] o.a.s.c.c.SolrZkClient makePath: /configs/conf1/open-exchange-rates.json
[junit4] 2> 1375487 INFO (TEST-RemoteQueryErrorTest.test-seed#[2172154495F25F90]) [ ] o.a.s.c.AbstractZkTestCase put /export/home/jenkins/workspace/Lucene-Solr-trunk-Solaris/solr/core/src/test-files/solr/collection1/conf/mapping-ISOLatin1Accent.txt to /configs/conf1/mapping-ISOLatin1Accent.txt
[junit4] 2> 1375487 INFO (TEST-RemoteQueryErrorTest.test-seed#[2172154495F25F90]) [ ] o.a.s.c.c.SolrZkClient makePath: /configs/conf1/mapping-ISOLatin1Accent.txt
[junit4] 2> 1375492 INFO (TEST-RemoteQueryErrorTest.test-seed#[2172154495F25F90]) [ ] o.a.s.c.AbstractZkTestCase put /export/home/jenkins/workspace/Lucene-Solr-trunk-Solaris/solr/core/src/test-files/solr/collection1/conf/old_synonyms.txt to /configs/conf1/old_synonyms.txt
[junit4] 2> 1375493 INFO (TEST-RemoteQueryErrorTest.test-seed#[2172154495F25F90]) [ ] o.a.s.c.c.SolrZkClient makePath: /configs/conf1/old_synonyms.txt
[junit4] 2> 1375498 INFO (TEST-RemoteQueryErrorTest.test-seed#[2172154495F25F90]) [ ] o.a.s.c.AbstractZkTestCase put /export/home/jenkins/workspace/Lucene-Solr-trunk-Solaris/solr/core/src/test-files/solr/collection1/conf/synonyms.txt to /configs/conf1/synonyms.txt
[junit4] 2> 1375499 INFO (TEST-RemoteQueryErrorTest.test-seed#[2172154495F25F90]) [ ] o.a.s.c.c.SolrZkClient makePath: /configs/conf1/synonyms.txt
[junit4] 2> 1377741 INFO (TEST-RemoteQueryErrorTest.test-seed#[2172154495F25F90]) [ ] o.a.s.SolrTestCaseJ4 Writing core.properties file to /export/home/jenkins/workspace/Lucene-Solr-trunk-Solaris/solr/build/solr-core/test/J0/temp/solr.cloud.RemoteQueryErrorTest_2172154495F25F90-001/control-001/cores/collection1
[junit4] 2> 1377745 INFO (TEST-RemoteQueryErrorTest.test-seed#[2172154495F25F90]) [ ] o.e.j.s.Server jetty-9.2.13.v20150730
[junit4] 2> 1377748 INFO (TEST-RemoteQueryErrorTest.test-seed#[2172154495F25F90]) [ ] o.e.j.s.h.ContextHandler Started o.e.j.s.ServletContextHandler@7f14d5e3{/,null,AVAILABLE}
[junit4] 2> 1377758 INFO (TEST-RemoteQueryErrorTest.test-seed#[2172154495F25F90]) [ ] o.e.j.s.ServerConnector Started ServerConnector@249db85a{HTTP/1.1}{127.0.0.1:39249}
[junit4] 2> 1377758 INFO (TEST-RemoteQueryErrorTest.test-seed#[2172154495F25F90]) [ ] o.e.j.s.Server Started @1403004ms
[junit4] 2> 1377758 INFO (TEST-RemoteQueryErrorTest.test-seed#[2172154495F25F90]) [ ] o.a.s.c.s.e.JettySolrRunner Jetty properties: {solr.data.dir=/export/home/jenkins/workspace/Lucene-Solr-trunk-Solaris/solr/build/solr-core/test/J0/temp/solr.cloud.RemoteQueryErrorTest_2172154495F25F90-001/tempDir-001/control/data, hostContext=/, hostPort=39249, coreRootDirectory=/export/home/jenkins/workspace/Lucene-Solr-trunk-Solaris/solr/build/solr-core/test/J0/temp/solr.cloud.RemoteQueryErrorTest_2172154495F25F90-001/control-001/cores}
[junit4] 2> 1377758 INFO (TEST-RemoteQueryErrorTest.test-seed#[2172154495F25F90]) [ ] o.a.s.s.SolrDispatchFilter SolrDispatchFilter.init(): sun.misc.Launcher$AppClassLoader@659e0bfd
[junit4] 2> 1377759 INFO (TEST-RemoteQueryErrorTest.test-seed#[2172154495F25F90]) [ ] o.a.s.c.SolrResourceLoader new SolrResourceLoader for directory: '/export/home/jenkins/workspace/Lucene-Solr-trunk-Solaris/solr/build/solr-core/test/J0/temp/solr.cloud.RemoteQueryErrorTest_2172154495F25F90-001/control-001/'
[junit4] 2> 1377811 INFO (TEST-RemoteQueryErrorTest.test-seed#[2172154495F25F90]) [ ] o.a.s.c.c.SolrZkClient Using default ZkCredentialsProvider
[junit4] 2> 1377812 INFO (TEST-RemoteQueryErrorTest.test-seed#[2172154495F25F90]) [ ] o.a.s.c.c.ConnectionManager Waiting for client to connect to ZooKeeper
[junit4] 2> 1377827 INFO (zkCallback-1710-thread-1) [ ] o.a.s.c.c.ConnectionManager Watcher org.apache.solr.common.cloud.ConnectionManager@1ccc0c19 name:ZooKeeperConnection Watcher:127.0.0.1:45429/solr got event WatchedEvent state:SyncConnected type:None path:null path:null type:None
[junit4] 2> 1377827 INFO (TEST-RemoteQueryErrorTest.test-seed#[2172154495F25F90]) [ ] o.a.s.c.c.ConnectionManager Client is connected to ZooKeeper
[junit4] 2> 1377828 INFO (TEST-RemoteQueryErrorTest.test-seed#[2172154495F25F90]) [ ] o.a.s.c.c.SolrZkClient Using default ZkACLProvider
[junit4] 2> 1377830 INFO (TEST-RemoteQueryErrorTest.test-seed#[2172154495F25F90]) [ ] o.a.s.s.SolrDispatchFilter Loading solr.xml from SolrHome (not found in ZooKeeper)
[junit4] 2> 1377830 INFO (TEST-RemoteQueryErrorTest.test-seed#[2172154495F25F90]) [ ] o.a.s.c.SolrXmlConfig Loading container configuration from /export/home/jenkins/workspace/Lucene-Solr-trunk-Solaris/solr/build/solr-core/test/J0/temp/solr.cloud.RemoteQueryErrorTest_2172154495F25F90-001/control-001/solr.xml
[junit4] 2> 1377835 INFO (TEST-RemoteQueryErrorTest.test-seed#[2172154495F25F90]) [ ] o.a.s.c.CoresLocator Config-defined core root directory: /export/home/jenkins/workspace/Lucene-Solr-trunk-Solaris/solr/build/solr-core/test/J0/temp/solr.cloud.RemoteQueryErrorTest_2172154495F25F90-001/control-001/cores
[junit4] 2> 1377835 INFO (TEST-RemoteQueryErrorTest.test-seed#[2172154495F25F90]) [ ] o.a.s.c.CoreContainer New CoreContainer 2144114866
[junit4] 2> 1377835 INFO (TEST-RemoteQueryErrorTest.test-seed#[2172154495F25F90]) [ ] o.a.s.c.CoreContainer Loading cores into CoreContainer [instanceDir=/export/home/jenkins/workspace/Lucene-Solr-trunk-Solaris/solr/build/solr-core/test/J0/temp/solr.cloud.RemoteQueryErrorTest_2172154495F25F90-001/control-001/]
[junit4] 2> 1377835 INFO (TEST-RemoteQueryErrorTest.test-seed#[2172154495F25F90]) [ ] o.a.s.c.CoreContainer loading shared library: /export/home/jenkins/workspace/Lucene-Solr-trunk-Solaris/solr/build/solr-core/test/J0/temp/solr.cloud.RemoteQueryErrorTest_2172154495F25F90-001/control-001/lib
[junit4] 2> 1377835 WARN (TEST-RemoteQueryErrorTest.test-seed#[2172154495F25F90]) [ ] o.a.s.c.SolrResourceLoader Can't find (or read) directory to add to classloader: lib (resolved as: /export/home/jenkins/workspace/Lucene-Solr-trunk-Solaris/solr/build/solr-core/test/J0/temp/solr.cloud.RemoteQueryErrorTest_2172154495F25F90-001/control-001/lib).
[junit4] 2> 1377885 INFO (TEST-RemoteQueryErrorTest.test-seed#[2172154495F25F90]) [ ] o.a.s.h.c.HttpShardHandlerFactory created with socketTimeout : 90000,urlScheme : ,connTimeout : 15000,maxConnectionsPerHost : 20,maxConnections : 10000,corePoolSize : 0,maximumPoolSize : 2147483647,maxThreadIdleTime : 5,sizeOfQueue : -1,fairnessPolicy : false,useRetries : false,
[junit4] 2> 1377889 INFO (TEST-RemoteQueryErrorTest.test-seed#[2172154495F25F90]) [ ] o.a.s.u.UpdateShardHandler Creating UpdateShardHandler HTTP client with params: socketTimeout=340000&connTimeout=45000&retry=true
[junit4] 2> 1377889 INFO (TEST-RemoteQueryErrorTest.test-seed#[2172154495F25F90]) [ ] o.a.s.l.LogWatcher SLF4J impl is org.slf4j.impl.Log4jLoggerFactory
[junit4] 2> 1377889 INFO (TEST-RemoteQueryErrorTest.test-seed#[2172154495F25F90]) [ ] o.a.s.l.LogWatcher Registering Log Listener [Log4j (org.slf4j.impl.Log4jLoggerFactory)]
[junit4] 2> 1377889 INFO (TEST-RemoteQueryErrorTest.test-seed#[2172154495F25F90]) [ ] o.a.s.c.ZkContainer Zookeeper client=127.0.0.1:45429/solr
[junit4] 2> 1377889 INFO (TEST-RemoteQueryErrorTest.test-seed#[2172154495F25F90]) [ ] o.a.s.c.ZkController zkHost includes chroot
[junit4] 2> 1377890 INFO (TEST-RemoteQueryErrorTest.test-seed#[2172154495F25F90]) [ ] o.a.s.c.c.SolrZkClient Using default ZkCredentialsProvider
[junit4] 2> 1377892 INFO (TEST-RemoteQueryErrorTest.test-seed#[2172154495F25F90]) [ ] o.a.s.c.c.ConnectionManager Waiting for client to connect to ZooKeeper
[junit4] 2> 1377900 INFO (zkCallback-1712-thread-1) [ ] o.a.s.c.c.ConnectionManager Watcher org.apache.solr.common.cloud.ConnectionManager@43f5d48c name:ZooKeeperConnection Watcher:127.0.0.1:45429 got event WatchedEvent state:SyncConnected type:None path:null path:null type:None
[junit4] 2> 1377900 INFO (TEST-RemoteQueryErrorTest.test-seed#[2172154495F25F90]) [ ] o.a.s.c.c.ConnectionManager Client is connected to ZooKeeper
[junit4] 2> 1377901 INFO (TEST-RemoteQueryErrorTest.test-seed#[2172154495F25F90]) [ ] o.a.s.c.c.SolrZkClient Using default ZkACLProvider
[junit4] 2> 1377904 INFO (TEST-RemoteQueryErrorTest.test-seed#[2172154495F25F90]) [n:127.0.0.1:39249_ ] o.a.s.c.c.ConnectionManager Waiting for client to connect to ZooKeeper
[junit4] 2> 1377911 INFO (zkCallback-1713-thread-1-processing-n:127.0.0.1:39249_) [n:127.0.0.1:39249_ ] o.a.s.c.c.ConnectionManager Watcher org.apache.solr.common.cloud.ConnectionManager@6ca6b9ef name:ZooKeeperConnection Watcher:127.0.0.1:45429/solr got event WatchedEvent state:SyncConnected type:None path:null path:null type:None
[junit4] 2> 1377911 INFO (TEST-RemoteQueryErrorTest.test-seed#[2172154495F25F90]) [n:127.0.0.1:39249_ ] o.a.s.c.c.ConnectionManager Client is connected to ZooKeeper
[junit4] 2> 1377914 INFO (TEST-RemoteQueryErrorTest.test-seed#[2172154495F25F90]) [n:127.0.0.1:39249_ ] o.a.s.c.c.SolrZkClient makePath: /overseer/queue
[junit4] 2> 1377919 INFO (TEST-RemoteQueryErrorTest.test-seed#[2172154495F25F90]) [n:127.0.0.1:39249_ ] o.a.s.c.c.SolrZkClient makePath: /overseer/collection-queue-work
[junit4] 2> 1377926 INFO (TEST-RemoteQueryErrorTest.test-seed#[2172154495F25F90]) [n:127.0.0.1:39249_ ] o.a.s.c.c.SolrZkClient makePath: /overseer/collection-map-running
[junit4] 2> 1377930 INFO (TEST-RemoteQueryErrorTest.test-seed#[2172154495F25F90]) [n:127.0.0.1:39249_ ] o.a.s.c.c.SolrZkClient makePath: /overseer/collection-map-completed
[junit4] 2> 1377936 INFO (TEST-RemoteQueryErrorTest.test-seed#[2172154495F25F90]) [n:127.0.0.1:39249_ ] o.a.s.c.c.SolrZkClient makePath: /overseer/collection-map-failure
[junit4] 2> 1377940 INFO (TEST-RemoteQueryErrorTest.test-seed#[2172154495F25F90]) [n:127.0.0.1:39249_ ] o.a.s.c.c.SolrZkClient makePath: /live_nodes
[junit4] 2> 1377944 INFO (TEST-RemoteQueryErrorTest.test-seed#[2172154495F25F90]) [n:127.0.0.1:39249_ ] o.a.s.c.c.SolrZkClient makePath: /aliases.json
[junit4] 2> 1377947 INFO (TEST-RemoteQueryErrorTest.test-seed#[2172154495F25F90]) [n:127.0.0.1:39249_ ] o.a.s.c.c.SolrZkClient makePath: /clusterstate.json
[junit4] 2> 1377950 INFO (TEST-RemoteQueryErrorTest.test-seed#[2172154495F25F90]) [n:127.0.0.1:39249_ ] o.a.s.c.c.SolrZkClient makePath: /security.json
[junit4] 2> 1377951 INFO (TEST-RemoteQueryErrorTest.test-seed#[2172154495F25F90]) [n:127.0.0.1:39249_ ] o.a.s.c.ZkController Register node as live in ZooKeeper:/live_nodes/127.0.0.1:39249_
[junit4] 2> 1377952 INFO (TEST-RemoteQueryErrorTest.test-seed#[2172154495F25F90]) [n:127.0.0.1:39249_ ] o.a.s.c.c.SolrZkClient makePath: /live_nodes/127.0.0.1:39249_
[junit4] 2> 1377956 INFO (TEST-RemoteQueryErrorTest.test-seed#[2172154495F25F90]) [n:127.0.0.1:39249_ ] o.a.s.c.c.SolrZkClient makePath: /overseer_elect
[junit4] 2> 1377958 INFO (TEST-RemoteQueryErrorTest.test-seed#[2172154495F25F90]) [n:127.0.0.1:39249_ ] o.a.s.c.c.SolrZkClient makePath: /overseer_elect/election
[junit4] 2> 1377960 INFO (TEST-RemoteQueryErrorTest.test-seed#[2172154495F25F90]) [n:127.0.0.1:39249_ ] o.a.s.c.Overseer Overseer (id=null) closing
[junit4] 2> 1377961 INFO (TEST-RemoteQueryErrorTest.test-seed#[2172154495F25F90]) [n:127.0.0.1:39249_ ] o.a.s.c.LeaderElector Joined leadership election with path: /overseer_elect/election/94596348901916676-127.0.0.1:39249_-n_0000000000
[junit4] 2> 1377962 INFO (TEST-RemoteQueryErrorTest.test-seed#[2172154495F25F90]) [n:127.0.0.1:39249_ ] o.a.s.c.OverseerElectionContext I am going to be the leader 127.0.0.1:39249_
[junit4] 2> 1377962 INFO (TEST-RemoteQueryErrorTest.test-seed#[2172154495F25F90]) [n:127.0.0.1:39249_ ] o.a.s.c.c.SolrZkClient makePath: /overseer_elect/leader
[junit4] 2> 1377964 INFO (TEST-RemoteQueryErrorTest.test-seed#[2172154495F25F90]) [n:127.0.0.1:39249_ ] o.a.s.c.Overseer Overseer (id=94596348901916676-127.0.0.1:39249_-n_0000000000) starting
[junit4] 2> 1377968 INFO (TEST-RemoteQueryErrorTest.test-seed#[2172154495F25F90]) [n:127.0.0.1:39249_ ] o.a.s.c.c.SolrZkClient makePath: /overseer/queue-work
[junit4] 2> 1377978 INFO (TEST-RemoteQueryErrorTest.test-seed#[2172154495F25F90]) [n:127.0.0.1:39249_ ] o.a.s.c.OverseerAutoReplicaFailoverThread Starting OverseerAutoReplicaFailoverThread autoReplicaFailoverWorkLoopDelay=10000 autoReplicaFailoverWaitAfterExpiration=30000 autoReplicaFailoverBadNodeExpiration=60000
[junit4] 2> 1377979 INFO (TEST-RemoteQueryErrorTest.test-seed#[2172154495F25F90]) [n:127.0.0.1:39249_ ] o.a.s.c.c.ZkStateReader Updating cluster state from ZooKeeper...
[junit4] 2> 1377979 INFO (OverseerCollectionConfigSetProcessor-94596348901916676-127.0.0.1:39249_-n_0000000000) [n:127.0.0.1:39249_ ] o.a.s.c.OverseerTaskProcessor Process current queue of overseer operations
[junit4] 2> 1377980 INFO (OverseerStateUpdate-94596348901916676-127.0.0.1:39249_-n_0000000000) [n:127.0.0.1:39249_ ] o.a.s.c.Overseer Starting to work on the main queue
[junit4] 2> 1377998 INFO (TEST-RemoteQueryErrorTest.test-seed#[2172154495F25F90]) [n:127.0.0.1:39249_ ] o.a.s.c.CoreContainer Security conf doesn't exist. Skipping setup for authorization module.
[junit4] 2> 1377998 INFO (TEST-RemoteQueryErrorTest.test-seed#[2172154495F25F90]) [n:127.0.0.1:39249_ ] o.a.s.c.CoreContainer No authentication plugin used.
[junit4] 2> 1377999 INFO (TEST-RemoteQueryErrorTest.test-seed#[2172154495F25F90]) [n:127.0.0.1:39249_ ] o.a.s.c.CoresLocator Looking for core definitions underneath /export/home/jenkins/workspace/Lucene-Solr-trunk-Solaris/solr/build/solr-core/test/J0/temp/solr.cloud.RemoteQueryErrorTest_2172154495F25F90-001/control-001/cores
[junit4] 2> 1378000 INFO (TEST-RemoteQueryErrorTest.test-seed#[2172154495F25F90]) [n:127.0.0.1:39249_ ] o.a.s.c.SolrCore Created CoreDescriptor: {name=collection1, config=solrconfig.xml, transient=false, schema=schema.xml, loadOnStartup=true, configSetProperties=configsetprops.json, instanceDir=/export/home/jenkins/workspace/Lucene-Solr-trunk-Solaris/solr/build/solr-core/test/J0/temp/solr.cloud.RemoteQueryErrorTest_2172154495F25F90-001/control-001/cores/collection1, collection=control_collection, absoluteInstDir=/export/home/jenkins/workspace/Lucene-Solr-trunk-Solaris/solr/build/solr-core/test/J0/temp/solr.cloud.RemoteQueryErrorTest_2172154495F25F90-001/control-001/cores/collection1/, coreNodeName=, dataDir=data/, shard=}
[junit4] 2> 1378000 INFO (TEST-RemoteQueryErrorTest.test-seed#[2172154495F25F90]) [n:127.0.0.1:39249_ ] o.a.s.c.CoresLocator Found core collection1 in /export/home/jenkins/workspace/Lucene-Solr-trunk-Solaris/solr/build/solr-core/test/J0/temp/solr.cloud.RemoteQueryErrorTest_2172154495F25F90-001/control-001/cores/collection1/
[junit4] 2> 1378000 INFO (TEST-RemoteQueryErrorTest.test-seed#[2172154495F25F90]) [n:127.0.0.1:39249_ ] o.a.s.c.CoresLocator Found 1 core definitions
[junit4] 2> 1378005 INFO (TEST-RemoteQueryErrorTest.test-seed#[2172154495F25F90]) [n:127.0.0.1:39249_ ] o.a.s.s.SolrDispatchFilter user.dir=/export/home/jenkins/workspace/Lucene-Solr-trunk-Solaris/solr/build/solr-core/test/J0
[junit4] 2> 1378005 INFO (TEST-RemoteQueryErrorTest.test-seed#[2172154495F25F90]) [n:127.0.0.1:39249_ ] o.a.s.s.SolrDispatchFilter SolrDispatchFilter.init() done
[junit4] 2> 1378006 INFO (coreLoadExecutor-3628-thread-1-processing-n:127.0.0.1:39249_) [n:127.0.0.1:39249_ c:control_collection x:collection1] o.a.s.c.ZkController publishing state=down
[junit4] 2> 1378006 INFO (coreLoadExecutor-3628-thread-1-processing-n:127.0.0.1:39249_) [n:127.0.0.1:39249_ c:control_collection x:collection1] o.a.s.c.ZkController numShards not found on descriptor - reading it from system property
[junit4] 2> 1378008 INFO (OverseerStateUpdate-94596348901916676-127.0.0.1:39249_-n_0000000000) [n:127.0.0.1:39249_ ] o.a.s.c.Overseer processMessage: queueSize: 1, message = {
[junit4] 2> "core":"collection1",
[junit4] 2> "roles":null,
[junit4] 2> "base_url":"http://127.0.0.1:39249",
[junit4] 2> "node_name":"127.0.0.1:39249_",
[junit4] 2> "numShards":"1",
[junit4] 2> "state":"down",
[junit4] 2> "shard":null,
[junit4] 2> "collection":"control_collection",
[junit4] 2> "operation":"state"} current state version: 0
[junit4] 2> 1378009 INFO (coreLoadExecutor-3628-thread-1-processing-n:127.0.0.1:39249_) [n:127.0.0.1:39249_ c:control_collection x:collection1] o.a.s.c.ZkController look for our core node name
[junit4] 2> 1378009 INFO (OverseerStateUpdate-94596348901916676-127.0.0.1:39249_-n_0000000000) [n:127.0.0.1:39249_ ] o.a.s.c.o.ReplicaMutator Update state numShards=1 message={
[junit4] 2> "core":"collection1",
[junit4] 2> "roles":null,
[junit4] 2> "base_url":"http://127.0.0.1:39249",
[junit4] 2> "node_name":"127.0.0.1:39249_",
[junit4] 2> "numShards":"1",
[junit4] 2> "state":"down",
[junit4] 2> "shard":null,
[junit4] 2> "collection":"control_collection",
[junit4] 2> "operation":"state"}
[junit4] 2> 1378010 INFO (OverseerStateUpdate-94596348901916676-127.0.0.1:39249_-n_0000000000) [n:127.0.0.1:39249_ ] o.a.s.c.o.ClusterStateMutator building a new cName: control_collection
[junit4] 2> 1378010 INFO (OverseerStateUpdate-94596348901916676-127.0.0.1:39249_-n_0000000000) [n:127.0.0.1:39249_ ] o.a.s.c.o.ReplicaMutator Assigning new node to shard shard=shard1
[junit4] 2> 1378012 INFO (zkCallback-1713-thread-1-processing-n:127.0.0.1:39249_) [n:127.0.0.1:39249_ ] o.a.s.c.c.ZkStateReader A cluster state change: WatchedEvent state:SyncConnected type:NodeDataChanged path:/clusterstate.json, has occurred - updating... (live nodes size: 1)
[junit4] 2> 1379010 INFO (coreLoadExecutor-3628-thread-1-processing-n:127.0.0.1:39249_) [n:127.0.0.1:39249_ c:control_collection x:collection1] o.a.s.c.ZkController waiting to find shard id in clusterstate for collection1
[junit4] 2> 1379010 INFO (coreLoadExecutor-3628-thread-1-processing-n:127.0.0.1:39249_) [n:127.0.0.1:39249_ c:control_collection x:collection1] o.a.s.c.ZkController Check for collection zkNode:control_collection
[junit4] 2> 1379011 INFO (coreLoadExecutor-3628-thread-1-processing-n:127.0.0.1:39249_) [n:127.0.0.1:39249_ c:control_collection x:collection1] o.a.s.c.ZkController Collection zkNode exists
[junit4] 2> 1379011 INFO (coreLoadExecutor-3628-thread-1-processing-n:127.0.0.1:39249_) [n:127.0.0.1:39249_ c:control_collection x:collection1] o.a.s.c.c.ZkStateReader Load collection config from:/collections/control_collection
[junit4] 2> 1379012 INFO (coreLoadExecutor-3628-thread-1-processing-n:127.0.0.1:39249_) [n:127.0.0.1:39249_ c:control_collection x:collection1] o.a.s.c.c.ZkStateReader path=/collections/control_collection configName=conf1 specified config exists in ZooKeeper
[junit4] 2> 1379012 INFO (coreLoadExecutor-3628-thread-1-processing-n:127.0.0.1:39249_) [n:127.0.0.1:39249_ c:control_collection x:collection1] o.a.s.c.SolrResourceLoader new SolrResourceLoader for directory: '/export/home/jenkins/workspace/Lucene-Solr-trunk-Solaris/solr/build/solr-core/test/J0/temp/solr.cloud.RemoteQueryErrorTest_2172154495F25F90-001/control-001/cores/collection1/'
[junit4] 2> 1379065 INFO (coreLoadExecutor-3628-thread-1-processing-n:127.0.0.1:39249_) [n:127.0.0.1:39249_ c:control_collection x:collection1] o.a.s.c.Config loaded config solrconfig.xml with version 0
[junit4] 2> 1379071 INFO (coreLoadExecutor-3628-thread-1-processing-n:127.0.0.1:39249_) [n:127.0.0.1:39249_ c:control_collection x:collection1] o.a.s.c.SolrConfig current version of requestparams : -1
[junit4] 2> 1379074 INFO (coreLoadExecutor-3628-thread-1-processing-n:127.0.0.1:39249_) [n:127.0.0.1:39249_ c:control_collection x:collection1] o.a.s.c.SolrConfig Using Lucene MatchVersion: 6.0.0
[junit4] 2> 1379080 INFO (coreLoadExecutor-3628-thread-1-processing-n:127.0.0.1:39249_) [n:127.0.0.1:39249_ c:control_collection x:collection1] o.a.s.c.Config Loaded SolrConfig: solrconfig.xml
[junit4] 2> 1379081 INFO (coreLoadExecutor-3628-thread-1-processing-n:127.0.0.1:39249_) [n:127.0.0.1:39249_ c:control_collection x:collection1] o.a.s.s.IndexSchema Reading Solr Schema from /configs/conf1/schema.xml
[junit4] 2> 1379086 INFO (coreLoadExecutor-3628-thread-1-processing-n:127.0.0.1:39249_) [n:127.0.0.1:39249_ c:control_collection x:collection1] o.a.s.s.IndexSchema [collection1] Schema name=test
[junit4] 2> 1379315 INFO (coreLoadExecutor-3628-thread-1-processing-n:127.0.0.1:39249_) [n:127.0.0.1:39249_ c:control_collection x:collection1] o.a.s.s.OpenExchangeRatesOrgProvider Initialized with rates=open-exchange-rates.json, refreshInterval=1440.
[junit4] 2> 1379322 INFO (coreLoadExecutor-3628-thread-1-processing-n:127.0.0.1:39249_) [n:127.0.0.1:39249_ c:control_collection x:collection1] o.a.s.s.IndexSchema default search field in schema is text
[junit4] 2> 1379322 INFO (coreLoadExecutor-3628-thread-1-processing-n:127.0.0.1:39249_) [n:127.0.0.1:39249_ c:control_collection x:collection1] o.a.s.s.IndexSchema unique key field: id
[junit4] 2> 1379341 INFO (coreLoadExecutor-3628-thread-1-processing-n:127.0.0.1:39249_) [n:127.0.0.1:39249_ c:control_collection x:collection1] o.a.s.s.FileExchangeRateProvider Reloading exchange rates from file currency.xml
[junit4] 2> 1379344 INFO (coreLoadExecutor-3628-thread-1-processing-n:127.0.0.1:39249_) [n:127.0.0.1:39249_ c:control_collection x:collection1] o.a.s.s.FileExchangeRateProvider Reloading exchange rates from file currency.xml
[junit4] 2> 1379349 INFO (coreLoadExecutor-3628-thread-1-processing-n:127.0.0.1:39249_) [n:127.0.0.1:39249_ c:control_collection x:collection1] o.a.s.s.OpenExchangeRatesOrgProvider Reloading exchange rates from open-exchange-rates.json
[junit4] 2> 1379350 WARN (coreLoadExecutor-3628-thread-1-processing-n:127.0.0.1:39249_) [n:127.0.0.1:39249_ c:control_collection x:collection1] o.a.s.s.OpenExchangeRatesOrgProvider Unknown key IMPORTANT NOTE
[junit4] 2> 1379351 WARN (coreLoadExecutor-3628-thread-1-processing-n:127.0.0.1:39249_) [n:127.0.0.1:39249_ c:control_collection x:collection1] o.a.s.s.OpenExchangeRatesOrgProvider Expected key, got STRING
[junit4] 2> 1379351 INFO (coreLoadExecutor-3628-thread-1-processing-n:127.0.0.1:39249_) [n:127.0.0.1:39249_ c:control_collection x:collection1] o.a.s.s.OpenExchangeRatesOrgProvider Reloading exchange rates from open-exchange-rates.json
[junit4] 2> 1379352 WARN (coreLoadExecutor-3628-thread-1-processing-n:127.0.0.1:39249_) [n:127.0.0.1:39249_ c:control_collection x:collection1] o.a.s.s.OpenExchangeRatesOrgProvider Unknown key IMPORTANT NOTE
[junit4] 2> 1379352 WARN (coreLoadExecutor-3628-thread-1-processing-n:127.0.0.1:39249_) [n:127.0.0.1:39249_ c:control_collection x:collection1] o.a.s.s.OpenExchangeRatesOrgProvider Expected key, got STRING
[junit4] 2> 1379354 INFO (coreLoadExecutor-3628-thread-1-processing-n:127.0.0.1:39249_) [n:127.0.0.1:39249_ c:control_collection x:collection1] o.a.s.c.ConfigSetProperties Did not find ConfigSet properties, assuming default properties: Can't find resource 'configsetprops.json' in classpath or '/configs/conf1', cwd=/export/home/jenkins/workspace/Lucene-Solr-trunk-Solaris/solr/build/solr-core/test/J0
[junit4] 2> 1379354 INFO (coreLoadExecutor-3628-thread-1-processing-n:127.0.0.1:39249_) [n:127.0.0.1:39249_ c:control_collection x:collection1] o.a.s.c.CoreContainer Creating SolrCore 'collection1' using configuration from collection control_collection
[junit4] 2> 1379354 INFO (coreLoadExecutor-3628-thread-1-processing-n:127.0.0.1:39249_) [n:127.0.0.1:39249_ c:control_collection s:shard1 r:core_node1 x:collection1] o.a.s.c.SolrCore org.apache.solr.core.MockDirectoryFactory
[junit4] 2> 1379355 INFO (coreLoadExecutor-3628-thread-1-processing-n:127.0.0.1:39249_) [n:127.0.0.1:39249_ c:control_collection s:shard1 r:core_node1 x:collection1] o.a.s.c.SolrCore [[collection1] ] Opening new SolrCore at [/export/home/jenkins/workspace/Lucene-Solr-trunk-Solaris/solr/build/solr-core/test/J0/temp/solr.cloud.RemoteQueryErrorTest_2172154495F25F90-001/control-001/cores/collection1/], dataDir=[null]
[junit4] 2> 1379355 INFO (coreLoadExecutor-3628-thread-1-processing-n:127.0.0.1:39249_) [n:127.0.0.1:39249_ c:control_collection s:shard1 r:core_node1 x:collection1] o.a.s.c.JmxMonitoredMap JMX monitoring is enabled. Adding Solr mbeans to JMX Server: com.sun.jmx.mbeanserver.JmxMBeanServer@68d3a3d8
[junit4] 2> 1379355 INFO (coreLoadExecutor-3628-thread-1-processing-n:127.0.0.1:39249_) [n:127.0.0.1:39249_ c:control_collection s:shard1 r:core_node1 x:collection1] o.a.s.c.CachingDirectoryFactory return new directory for /export/home/jenkins/workspace/Lucene-Solr-trunk-Solaris/solr/build/solr-core/test/J0/temp/solr.cloud.RemoteQueryErrorTest_2172154495F25F90-001/control-001/cores/collection1/data
[junit4] 2> 1379355 INFO (coreLoadExecutor-3628-thread-1-processing-n:127.0.0.1:39249_) [n:127.0.0.1:39249_ c:control_collection s:shard1 r:core_node1 x:collection1] o.a.s.c.SolrCore New index directory detected: old=null new=/export/home/jenkins/workspace/Lucene-Solr-trunk-Solaris/solr/build/solr-core/test/J0/temp/solr.cloud.RemoteQueryErrorTest_2172154495F25F90-001/control-001/cores/collection1/data/index/
[junit4] 2> 1379355 WARN (coreLoadExecutor-3628-thread-1-processing-n:127.0.0.1:39249_) [n:127.0.0.1:39249_ c:control_collection s:shard1 r:core_node1 x:collection1] o.a.s.c.SolrCore [collection1] Solr index directory '/export/home/jenkins/workspace/Lucene-Solr-trunk-Solaris/solr/build/solr-core/test/J0/temp/solr.cloud.RemoteQueryErrorTest_2172154495F25F90-001/control-001/cores/collection1/data/index' doesn't exist. Creating new index...
[junit4] 2> 1379356 INFO (coreLoadExecutor-3628-thread-1-processing-n:127.0.0.1:39249_) [n:127.0.0.1:39249_ c:control_collection s:shard1 r:core_node1 x:collection1] o.a.s.c.CachingDirectoryFactory return new directory for /export/home/jenkins/workspace/Lucene-Solr-trunk-Solaris/solr/build/solr-core/test/J0/temp/solr.cloud.RemoteQueryErrorTest_2172154495F25F90-001/control-001/cores/collection1/data/index
[junit4] 2> 1379356 INFO (coreLoadExecutor-3628-thread-1-processing-n:127.0.0.1:39249_) [n:127.0.0.1:39249_ c:control_collection s:shard1 r:core_node1 x:collection1] o.a.s.u.RandomMergePolicy RandomMergePolicy wrapping class org.apache.lucene.index.TieredMergePolicy: [TieredMergePolicy: maxMergeAtOnce=38, maxMergeAtOnceExplicit=36, maxMergedSegmentMB=58.0986328125, floorSegmentMB=1.9716796875, forceMergeDeletesPctAllowed=27.796546976065674, segmentsPerTier=16.0, maxCFSSegmentSizeMB=8.796093022207999E12, noCFSRatio=0.0
[junit4] 2> 1379356 INFO (coreLoadExecutor-3628-thread-1-processing-n:127.0.0.1:39249_) [n:127.0.0.1:39249_ c:control_collection s:shard1 r:core_node1 x:collection1] o.a.s.c.SolrCore SolrDeletionPolicy.onCommit: commits: num=1
[junit4] 2> commit{dir=MockDirectoryWrapper(RAMDirectory@2153292d lockFactory=org.apache.lucene.store.SingleInstanceLockFactory@10cb78e7),segFN=segments_1,generation=1}
[junit4] 2> 1379356 INFO (coreLoadExecutor-3628-thread-1-processing-n:127.0.0.1:39249_) [n:127.0.0.1:39249_ c:control_collection s:shard1 r:core_node1 x:collection1] o.a.s.c.SolrCore newest commit generation = 1
[junit4] 2> 1379357 INFO (OldIndexDirectoryCleanupThreadForCore-collection1) [n:127.0.0.1:39249_ c:control_collection s:shard1 r:core_node1 x:collection1] o.a.s.c.SolrCore Looking for old index directories to cleanup for core collection1 in /export/home/jenkins/workspace/Lucene-Solr-trunk-Solaris/solr/build/solr-core/test/J0/temp/solr.cloud.RemoteQueryErrorTest_2172154495F25F90-001/control-001/cores/collection1/data/
[junit4] 2> 1379358 WARN (OldIndexDirectoryCleanupThreadForCore-collection1) [n:127.0.0.1:39249_ c:control_collection s:shard1 r:core_node1 x:collection1] o.a.s.c.DirectoryFactory /export/home/jenkins/workspace/Lucene-Solr-trunk-Solaris/solr/build/solr-core/test/J0/temp/solr.cloud.RemoteQueryErrorTest_2172154495F25F90-001/control-001/cores/collection1/data/ does not point to a valid data directory; skipping clean-up of old index directories.
[junit4] 2> 1379360 INFO (coreLoadExecutor-3628-thread-1-processing-n:127.0.0.1:39249_) [n:127.0.0.1:39249_ c:control_collection s:shard1 r:core_node1 x:collection1] o.a.s.u.p.UpdateRequestProcessorChain creating updateRequestProcessorChain "nodistrib"
[junit4] 2> 1379361 INFO (coreLoadExecutor-3628-thread-1-processing-n:127.0.0.1:39249_) [n:127.0.0.1:39249_ c:control_collection s:shard1 r:core_node1 x:collection1] o.a.s.u.p.UpdateRequestProcessorChain creating updateRequestProcessorChain "dedupe"
[junit4] 2> 1379361 INFO (coreLoadExecutor-3628-thread-1-processing-n:127.0.0.1:39249_) [n:127.0.0.1:39249_ c:control_collection s:shard1 r:core_node1 x:collection1] o.a.s.u.p.UpdateRequestProcessorChain inserting DistributedUpdateProcessorFactory into updateRequestProcessorChain "dedupe"
[junit4] 2> 1379361 INFO (coreLoadExecutor-3628-thread-1-processing-n:127.0.0.1:39249_) [n:127.0.0.1:39249_ c:control_collection s:shard1 r:core_node1 x:collection1] o.a.s.u.p.UpdateRequestProcessorChain creating updateRequestProcessorChain "stored_sig"
[junit4] 2> 1379361 INFO (coreLoadExecutor-3628-thread-1-processing-n:127.0.0.1:39249_) [n:127.0.0.1:39249_ c:control_collection s:shard1 r:core_node1 x:collection1] o.a.s.u.p.UpdateRequestProcessorChain inserting DistributedUpdateProcessorFactory into updateRequestProcessorChain "stored_sig"
[junit4] 2> 1379361 INFO (coreLoadExecutor-3628-thread-1-processing-n:127.0.0.1:39249_) [n:127.0.0.1:39249_ c:control_collection s:shard1 r:core_node1 x:collection1] o.a.s.u.p.UpdateRequestProcessorChain creating updateRequestProcessorChain "distrib-dup-test-chain-explicit"
[junit4] 2> 1379361 INFO (coreLoadExecutor-3628-thread-1-processing-n:127.0.0.1:39249_) [n:127.0.0.1:39249_ c:control_collection s:shard1 r:core_node1 x:collection1] o.a.s.u.p.UpdateRequestProcessorChain creating updateRequestProcessorChain "distrib-dup-test-chain-implicit"
[junit4] 2> 1379361 INFO (coreLoadExecutor-3628-thread-1-processing-n:127.0.0.1:39249_) [n:127.0.0.1:39249_ c:control_collection s:shard1 r:core_node1 x:collection1] o.a.s.u.p.UpdateRequestProcessorChain inserting DistributedUpdateProcessorFactory into updateRequestProcessorChain "distrib-dup-test-chain-implicit"
[junit4] 2> 1379361 INFO (coreLoadExecutor-3628-thread-1-processing-n:127.0.0.1:39249_) [n:127.0.0.1:39249_ c:control_collection s:shard1 r:core_node1 x:collection1] o.a.s.c.SolrCore no updateRequestProcessorChain defined as default, creating implicit default
[junit4] 2> 1379367 INFO (coreLoadExecutor-3628-thread-1-processing-n:127.0.0.1:39249_) [n:127.0.0.1:39249_ c:control_collection s:shard1 r:core_node1 x:collection1] o.a.s.h.l.XMLLoader xsltCacheLifetimeSeconds=60
[junit4] 2> 1379369 INFO (coreLoadExecutor-3628-thread-1-processing-n:127.0.0.1:39249_) [n:127.0.0.1:39249_ c:control_collection s:shard1 r:core_node1 x:collection1] o.a.s.h.l.XMLLoader xsltCacheLifetimeSeconds=60
[junit4] 2> 1379370 INFO (coreLoadExecutor-3628-thread-1-processing-n:127.0.0.1:39249_) [n:127.0.0.1:39249_ c:control_collection s:shard1 r:core_node1 x:collection1] o.a.s.h.l.XMLLoader xsltCacheLifetimeSeconds=60
[junit4] 2> 1379372 INFO (coreLoadExecutor-3628-thread-1-processing-n:127.0.0.1:39249_) [n:127.0.0.1:39249_ c:control_collection s:shard1 r:core_node1 x:collection1] o.a.s.h.l.XMLLoader xsltCacheLifetimeSeconds=60
[junit4] 2> 1379375 INFO (coreLoadExecutor-3628-thread-1-processing-n:127.0.0.1:39249_) [n:127.0.0.1:39249_ c:control_collection s:shard1 r:core_node1 x:collection1] o.a.s.c.RequestHandlers Registered paths: /admin/mbeans,standard,/update/csv,/update/json/docs,/admin/luke,/admin/segments,/get,/admin/system,/replication,/admin/properties,/config,/schema,/admin/plugins,/admin/logging,/update/json,/admin/threads,/admin/ping,/update,/admin/file
[junit4] 2> 1379375 INFO (coreLoadExecutor-3628-thread-1-processing-n:127.0.0.1:39249_) [n:127.0.0.1:39249_ c:control_collection s:shard1 r:core_node1 x:collection1] o.a.s.c.SolrCore Using default statsCache cache: org.apache.solr.search.stats.LocalStatsCache
[junit4] 2> 1379376 INFO (coreLoadExecutor-3628-thread-1-processing-n:127.0.0.1:39249_) [n:127.0.0.1:39249_ c:control_collection s:shard1 r:core_node1 x:collection1] o.a.s.u.UpdateHandler Using UpdateLog implementation: org.apache.solr.update.UpdateLog
[junit4] 2> 1379376 INFO (coreLoadExecutor-3628-thread-1-processing-n:127.0.0.1:39249_) [n:127.0.0.1:39249_ c:control_collection s:shard1 r:core_node1 x:collection1] o.a.s.u.UpdateLog Initializing UpdateLog: dataDir= defaultSyncLevel=FLUSH numRecordsToKeep=100 maxNumLogsToKeep=10 numVersionBuckets=65536
[junit4] 2> 1379378 INFO (coreLoadExecutor-3628-thread-1-processing-n:127.0.0.1:39249_) [n:127.0.0.1:39249_ c:control_collection s:shard1 r:core_node1 x:collection1] o.a.s.c.SolrCore Hard AutoCommit: disabled
[junit4] 2> 1379378 INFO (coreLoadExecutor-3628-thread-1-processing-n:127.0.0.1:39249_) [n:127.0.0.1:39249_ c:control_collection s:shard1 r:core_node1 x:collection1] o.a.s.c.SolrCore Soft AutoCommit: disabled
[junit4] 2> 1379378 INFO (coreLoadExecutor-3628-thread-1-processing-n:127.0.0.1:39249_) [n:127.0.0.1:39249_ c:control_collection s:shard1 r:core_node1 x:collection1] o.a.s.u.RandomMergePolicy RandomMergePolicy wrapping class org.apache.lucene.index.TieredMergePolicy: [TieredMergePolicy: maxMergeAtOnce=27, maxMergeAtOnceExplicit=42, maxMergedSegmentMB=83.296875, floorSegmentMB=0.57421875, forceMergeDeletesPctAllowed=2.8533859872449288, segmentsPerTier=50.0, maxCFSSegmentSizeMB=8.796093022207999E12, noCFSRatio=0.755299615963971
[junit4] 2> 1379379 INFO (coreLoadExecutor-3628-thread-1-processing-n:127.0.0.1:39249_) [n:127.0.0.1:39249_ c:control_collection s:shard1 r:core_node1 x:collection1] o.a.s.c.SolrCore SolrDeletionPolicy.onInit: commits: num=1
[junit4] 2> commit{dir=MockDirectoryWrapper(RAMDirectory@2153292d lockFactory=org.apache.lucene.store.SingleInstanceLockFactory@10cb78e7),segFN=segments_1,generation=1}
[junit4] 2> 1379379 INFO (coreLoadExecutor-3628-thread-1-processing-n:127.0.0.1:39249_) [n:127.0.0.1:39249_ c:control_collection s:shard1 r:core_node1 x:collection1] o.a.s.c.SolrCore newest commit generation = 1
[junit4] 2> 1379379 INFO (coreLoadExecutor-3628-thread-1-processing-n:127.0.0.1:39249_) [n:127.0.0.1:39249_ c:control_collection s:shard1 r:core_node1 x:collection1] o.a.s.s.SolrIndexSearcher Opening Searcher@107c8455[collection1] main
[junit4] 2> 1379379 INFO (coreLoadExecutor-3628-thread-1-processing-n:127.0.0.1:39249_) [n:127.0.0.1:39249_ c:control_collection s:shard1 r:core_node1 x:collection1] o.a.s.c.c.ZkStateReader Load collection config from:/collections/control_collection
[junit4] 2> 1379380 INFO (coreLoadExecutor-3628-thread-1-processing-n:127.0.0.1:39249_) [n:127.0.0.1:39249_ c:control_collection s:shard1 r:core_node1 x:collection1] o.a.s.c.c.ZkStateReader path=/collections/control_collection configName=conf1 specified config exists in ZooKeeper
[junit4] 2> 1379380 INFO (coreLoadExecutor-3628-thread-1-processing-n:127.0.0.1:39249_) [n:127.0.0.1:39249_ c:control_collection s:shard1 r:core_node1 x:collection1] o.a.s.r.ManagedResourceStorage Setting up ZooKeeper-based storage for the RestManager with znodeBase: /configs/conf1
[junit4] 2> 1379381 INFO (coreLoadExecutor-3628-thread-1-processing-n:127.0.0.1:39249_) [n:127.0.0.1:39249_ c:control_collection s:shard1 r:core_node1 x:collection1] o.a.s.r.ManagedResourceStorage Configured ZooKeeperStorageIO with znodeBase: /configs/conf1
[junit4] 2> 1379381 INFO (coreLoadExecutor-3628-thread-1-processing-n:127.0.0.1:39249_) [n:127.0.0.1:39249_ c:control_collection s:shard1 r:core_node1 x:collection1] o.a.s.r.RestManager Initializing RestManager with initArgs: {}
[junit4] 2> 1379381 INFO (coreLoadExecutor-3628-thread-1-processing-n:127.0.0.1:39249_) [n:127.0.0.1:39249_ c:control_collection s:shard1 r:core_node1 x:collection1] o.a.s.r.ManagedResourceStorage Reading _rest_managed.json using ZooKeeperStorageIO:path=/configs/conf1
[junit4] 2> 1379381 INFO (coreLoadExecutor-3628-thread-1-processing-n:127.0.0.1:39249_) [n:127.0.0.1:39249_ c:control_collection s:shard1 r:core_node1 x:collection1] o.a.s.r.ManagedResourceStorage No data found for znode /configs/conf1/_rest_managed.json
[junit4] 2> 1379381 INFO (coreLoadExecutor-3628-thread-1-processing-n:127.0.0.1:39249_) [n:127.0.0.1:39249_ c:control_collection s:shard1 r:core_node1 x:collection1] o.a.s.r.ManagedResourceStorage Loaded null at path _rest_managed.json using ZooKeeperStorageIO:path=/configs/conf1
[junit4] 2> 1379382 INFO (coreLoadExecutor-3628-thread-1-processing-n:127.0.0.1:39249_) [n:127.0.0.1:39249_ c:control_collection s:shard1 r:core_node1 x:collection1] o.a.s.r.RestManager Initializing 0 registered ManagedResources
[junit4] 2> 1379382 INFO (coreLoadExecutor-3628-thread-1-processing-n:127.0.0.1:39249_) [n:127.0.0.1:39249_ c:control_collection s:shard1 r:core_node1 x:collection1] o.a.s.h.ReplicationHandler Commits will be reserved for 10000
[junit4] 2> 1379382 INFO (coreLoadExecutor-3628-thread-1-processing-n:127.0.0.1:39249_) [n:127.0.0.1:39249_ c:control_collection s:shard1 r:core_node1 x:collection1] o.a.s.u.UpdateLog Looking up max value of version field to seed version buckets
[junit4] 2> 1379382 INFO (coreLoadExecutor-3628-thread-1-processing-n:127.0.0.1:39249_) [n:127.0.0.1:39249_ c:control_collection s:shard1 r:core_node1 x:collection1] o.a.s.u.VersionInfo Refreshing highest value of _version_ for 65536 version buckets from index
[junit4] 2> 1379382 INFO (coreLoadExecutor-3628-thread-1-processing-n:127.0.0.1:39249_) [n:127.0.0.1:39249_ c:control_collection s:shard1 r:core_node1 x:collection1] o.a.s.u.VersionInfo No terms found for _version_, cannot seed version bucket highest value from index
[junit4] 2> 1379382 INFO (coreLoadExecutor-3628-thread-1-processing-n:127.0.0.1:39249_) [n:127.0.0.1:39249_ c:control_collection s:shard1 r:core_node1 x:collection1] o.a.s.u.UpdateLog Could not find max version in index or recent updates, using new clock 1513541586720391168
[junit4] 2> 1379384 INFO (coreLoadExecutor-3628-thread-1-processing-n:127.0.0.1:39249_) [n:127.0.0.1:39249_ c:control_collection s:shard1 r:core_node1 x:collection1] o.a.s.u.UpdateLog Took 1.0ms to seed version buckets with highest version 1513541586720391168
[junit4] 2> 1379385 INFO (coreLoadExecutor-3628-thread-1-processing-n:127.0.0.1:39249_) [n:127.0.0.1:39249_ c:control_collection s:shard1 r:core_node1 x:collection1] o.a.s.c.ZkController watch zkdir /configs/conf1
[junit4] 2> 1379387 INFO (coreLoadExecutor-3628-thread-1-processing-n:127.0.0.1:39249_) [n:127.0.0.1:39249_ c:control_collection s:shard1 r:core_node1 x:collection1] o.a.s.c.CoreContainer registering core: collection1
[junit4] 2> 1379387 INFO (searcherExecutor-3629-thread-1-processing-n:127.0.0.1:39249_ x:collection1 s:shard1 c:control_collection r:core_node1) [n:127.0.0.1:39249_ c:control_collection s:shard1 r:core_node1 x:collection1] o.a.s.c.SolrCore [collection1] Registered new searcher Searcher@107c8455[collection1] main{ExitableDirectoryReader(UninvertingDirectoryReader())}
[junit4] 2> 1379390 INFO (coreZkRegister-3622-thread-1-processing-n:127.0.0.1:39249_ x:collection1 s:shard1 c:control_collection r:core_node1) [n:127.0.0.1:39249_ c:control_collection s:shard1 r:core_node1 x:collection1] o.a.s.c.ZkController Register replica - core:collection1 address:http://127.0.0.1:39249 collection:control_collection shard:shard1
[junit4] 2> 1379392 INFO (coreZkRegister-3622-thread-1-processing-n:127.0.0.1:39249_ x:collection1 s:shard1 c:control_collection r:core_node1) [n:127.0.0.1:39249_ c:control_collection s:shard1 r:core_node1 x:collection1] o.a.s.c.c.SolrZkClient makePath: /collections/control_collection/leader_elect/shard1/election
[junit4] 2> 1379397 INFO (coreZkRegister-3622-thread-1-processing-n:127.0.0.1:39249_ x:collection1 s:shard1 c:control_collection r:core_node1) [n:127.0.0.1:39249_ c:control_collection s:shard1 r:core_node1 x:collection1] o.a.s.c.LeaderElector Joined leadership election with path: /collections/control_collection/leader_elect/shard1/election/94596348901916676-core_node1-n_0000000000
[junit4] 2> 1379398 INFO (coreZkRegister-3622-thread-1-processing-n:127.0.0.1:39249_ x:collection1 s:shard1 c:control_collection r:core_node1) [n:127.0.0.1:39249_ c:control_collection s:shard1 r:core_node1 x:collection1] o.a.s.c.ShardLeaderElectionContext Running the leader process for shard shard1
[junit4] 2> 1379401 INFO (coreZkRegister-3622-thread-1-processing-n:127.0.0.1:39249_ x:collection1 s:shard1 c:control_collection r:core_node1) [n:127.0.0.1:39249_ c:control_collection s:shard1 r:core_node1 x:collection1] o.a.s.c.ShardLeaderElectionContext Enough replicas found to continue.
[junit4] 2> 1379402 INFO (OverseerStateUpdate-94596348901916676-127.0.0.1:39249_-n_0000000000) [n:127.0.0.1:39249_ ] o.a.s.c.Overseer processMessage: queueSize: 1, message = {
[junit4] 2> "operation":"leader",
[junit4] 2> "shard":"shard1",
[junit4] 2> "collection":"control_collection"} current state version: 1
[junit4] 2> 1379402 INFO (coreZkRegister-3622-thread-1-processing-n:127.0.0.1:39249_ x:collection1 s:shard1 c:control_collection r:core_node1) [n:127.0.0.1:39249_ c:control_collection s:shard1 r:core_node1 x:collection1] o.a.s.c.ShardLeaderElectionContext I may be the new leader - try and sync
[junit4] 2> 1379403 INFO (coreZkRegister-3622-thread-1-processing-n:127.0.0.1:39249_ x:collection1 s:shard1 c:control_collection r:core_node1) [n:127.0.0.1:39249_ c:control_collection s:shard1 r:core_node1 x:collection1] o.a.s.c.SyncStrategy Sync replicas to http://127.0.0.1:39249/collection1/
[junit4] 2> 1379403 INFO (coreZkRegister-3622-thread-1-processing-n:127.0.0.1:39249_ x:collection1 s:shard1 c:control_collection r:core_node1) [n:127.0.0.1:39249_ c:control_collection s:shard1 r:core_node1 x:collection1] o.a.s.c.SyncStrategy Sync Success - now sync replicas to me
[junit4] 2> 1379403 INFO (coreZkRegister-3622-thread-1-processing-n:127.0.0.1:39249_ x:collection1 s:shard1 c:control_collection r:core_node1) [n:127.0.0.1:39249_ c:control_collection s:shard1 r:core_node1 x:collection1] o.a.s.c.SyncStrategy http://127.0.0.1:39249/collection1/ has no replicas
[junit4] 2> 1379403 INFO (coreZkRegister-3622-thread-1-processing-n:127.0.0.1:39249_ x:collection1 s:shard1 c:control_collection r:core_node1) [n:127.0.0.1:39249_ c:control_collection s:shard1 r:core_node1 x:collection1] o.a.s.c.ShardLeaderElectionContext I am the new leader: http://127.0.0.1:39249/collection1/ shard1
[junit4] 2> 1379404 INFO (coreZkRegister-3622-thread-1-processing-n:127.0.0.1:39249_ x:collection1 s:shard1 c:control_collection r:core_node1) [n:127.0.0.1:39249_ c:control_collection s:shard1 r:core_node1 x:collection1] o.a.s.c.c.SolrZkClient makePath: /collections/control_collection/leaders/shard1
[junit4] 2> 1379409 INFO (coreZkRegister-3622-thread-1-processing-n:127.0.0.1:39249_ x:collection1 s:shard1 c:control_collection r:core_node1) [n:127.0.0.1:39249_ c:control_collection s:shard1 r:core_node1 x:collection1] o.a.s.c.ShardLeaderElectionContextBase Creating leader registration node
[junit4] 2> 1379413 INFO (OverseerStateUpdate-94596348901916676-127.0.0.1:39249_-n_0000000000) [n:127.0.0.1:39249_ ] o.a.s.c.Overseer processMessage: queueSize: 1, message = {
[junit4] 2> "operation":"leader",
[junit4] 2> "shard":"shard1",
[junit4] 2> "collection":"control_collection",
[junit4] 2> "base_url":"http://127.0.0.1:39249",
[junit4] 2> "core":"collection1",
[junit4] 2> "state":"active"} current state version: 1
[junit4] 2> 1379510 INFO (TEST-RemoteQueryErrorTest.test-seed#[2172154495F25F90]) [ ] o.a.s.c.c.SolrZkClient Using default ZkCredentialsProvider
[junit4] 2> 1379511 INFO (TEST-RemoteQueryErrorTest.test-seed#[2172154495F25F90]) [ ] o.a.s.c.c.ConnectionManager Waiting for client to connect to ZooKeeper
[junit4] 2> 1379517 INFO (zkCallback-1715-thread-1) [ ] o.a.s.c.c.ConnectionManager Watcher org.apache.solr.common.cloud.ConnectionManager@14e55e02 name:ZooKeeperConnection Watcher:127.0.0.1:45429/solr got event WatchedEvent state:SyncConnected type:None path:null path:null type:None
[junit4] 2> 1379517 INFO (TEST-RemoteQueryErrorTest.test-seed#[2172154495F25F90]) [ ] o.a.s.c.c.ConnectionManager Client is connected to ZooKeeper
[junit4] 2> 1379518 INFO (TEST-RemoteQueryErrorTest.test-seed#[2172154495F25F90]) [ ] o.a.s.c.c.SolrZkClient Using default ZkACLProvider
[junit4] 2> 1379518 INFO (TEST-RemoteQueryErrorTest.test-seed#[2172154495F25F90]) [ ] o.a.s.c.c.ZkStateReader Updating cluster state from ZooKeeper...
[junit4] 2> 1379518 INFO (zkCallback-1713-thread-1-processing-n:127.0.0.1:39249_) [n:127.0.0.1:39249_ ] o.a.s.c.c.ZkStateReader A cluster state change: WatchedEvent state:SyncConnected type:NodeDataChanged path:/clusterstate.json, has occurred - updating... (live nodes size: 1)
[junit4] 2> 1379523 INFO (TEST-RemoteQueryErrorTest.test-seed#[2172154495F25F90]) [ ] o.a.s.c.ChaosMonkey monkey: init - expire sessions:false cause connection loss:false
[junit4] 2> 1379524 INFO (TEST-RemoteQueryErrorTest.test-seed#[2172154495F25F90]) [ ] o.a.s.c.AbstractFullDistribZkTestBase Creating collection1 with stateFormat=2
[junit4] 2> 1379524 INFO (TEST-RemoteQueryErrorTest.test-seed#[2172154495F25F90]) [ ] o.a.s.c.c.SolrZkClient Using default ZkCredentialsProvider
[junit4] 2> 1379526 INFO (TEST-RemoteQueryErrorTest.test-seed#[2172154495F25F90]) [ ] o.a.s.c.c.ConnectionManager Waiting for client to connect to ZooKeeper
[junit4] 2> 1379535 INFO (zkCallback-1716-thread-1) [ ] o.a.s.c.c.ConnectionManager Watcher org.apache.solr.common.cloud.ConnectionManager@40919a72 name:ZooKeeperConnection Watcher:127.0.0.1:45429/solr got event WatchedEvent state:SyncConnected type:None path:null path:null type:None
[junit4] 2> 1379535 INFO (TEST-RemoteQueryErrorTest.test-seed#[2172154495F25F90]) [ ] o.a.s.c.c.ConnectionManager Client is connected to ZooKeeper
[junit4] 2> 1379535 INFO (TEST-RemoteQueryErrorTest.test-seed#[2172154495F25F90]) [ ] o.a.s.c.c.SolrZkClient Using default ZkACLProvider
[junit4] 2> 1379539 INFO (OverseerStateUpdate-94596348901916676-127.0.0.1:39249_-n_0000000000) [n:127.0.0.1:39249_ ] o.a.s.c.Overseer processMessage: queueSize: 1, message = {
[junit4] 2> "operation":"create",
[junit4] 2> "name":"collection1",
[junit4] 2> "numShards":"1",
[junit4] 2> "stateFormat":"2"} current state version: 2
[junit4] 2> 1379540 INFO (OverseerStateUpdate-94596348901916676-127.0.0.1:39249_-n_0000000000) [n:127.0.0.1:39249_ ] o.a.s.c.o.ClusterStateMutator building a new cName: collection1
[junit4] 2> 1379567 INFO (coreZkRegister-3622-thread-1-processing-n:127.0.0.1:39249_ x:collection1 s:shard1 c:control_collection r:core_node1) [n:127.0.0.1:39249_ c:control_collection s:shard1 r:core_node1 x:collection1] o.a.s.c.ZkController We are http://127.0.0.1:39249/collection1/ and leader is http://127.0.0.1:39249/collection1/
[junit4] 2> 1379568 INFO (coreZkRegister-3622-thread-1-processing-n:127.0.0.1:39249_ x:collection1 s:shard1 c:control_collection r:core_node1) [n:127.0.0.1:39249_ c:control_collection s:shard1 r:core_node1 x:collection1] o.a.s.c.ZkController No LogReplay needed for core=collection1 baseURL=http://127.0.0.1:39249
[junit4] 2> 1379568 INFO (coreZkRegister-3622-thread-1-processing-n:127.0.0.1:39249_ x:collection1 s:shard1 c:control_collection r:core_node1) [n:127.0.0.1:39249_ c:control_collection s:shard1 r:core_node1 x:collection1] o.a.s.c.ZkController I am the leader, no recovery necessary
[junit4] 2> 1379568 INFO (coreZkRegister-3622-thread-1-processing-n:127.0.0.1:39249_ x:collection1 s:shard1 c:control_collection r:core_node1) [n:127.0.0.1:39249_ c:control_collection s:shard1 r:core_node1 x:collection1] o.a.s.c.ZkController publishing state=active
[junit4] 2> 1379569 INFO (coreZkRegister-3622-thread-1-processing-n:127.0.0.1:39249_ x:collection1 s:shard1 c:control_collection r:core_node1) [n:127.0.0.1:39249_ c:control_collection s:shard1 r:core_node1 x:collection1] o.a.s.c.ZkController numShards not found on descriptor - reading it from system property
[junit4] 2> 1379573 INFO (OverseerStateUpdate-94596348901916676-127.0.0.1:39249_-n_0000000000) [n:127.0.0.1:39249_ ] o.a.s.c.Overseer processMessage: queueSize: 1, message = {
[junit4] 2> "core":"collection1",
[junit4] 2> "core_node_name":"core_node1",
[junit4] 2> "roles":null,
[junit4] 2> "base_url":"http://127.0.0.1:39249",
[junit4] 2> "node_name":"127.0.0.1:39249_",
[junit4] 2> "numShards":"1",
[junit4] 2> "state":"active",
[junit4] 2> "shard":"shard1",
[junit4] 2> "collection":"control_collection",
[junit4] 2> "operation":"state"} current state version: 2
[junit4] 2> 1379574 INFO (OverseerStateUpdate-94596348901916676-127.0.0.1:39249_-n_0000000000) [n:127.0.0.1:39249_ ] o.a.s.c.o.ReplicaMutator Update state numShards=1 message={
[junit4] 2> "core":"collection1",
[junit4] 2> "core_node_name":"core_node1",
[junit4] 2> "roles":null,
[junit4] 2> "base_url":"http://127.0.0.1:39249",
[junit4] 2> "node_name":"127.0.0.1:39249_",
[junit4] 2> "numShards":"1",
[junit4] 2> "state":"active",
[junit4] 2> "shard":"shard1",
[junit4] 2> "collection":"control_collection",
[junit4] 2> "operation":"state"}
[junit4] 2> 1379575 INFO (OverseerStateUpdate-94596348901916676-127.0.0.1:39249_-n_0000000000) [n:127.0.0.1:39249_ ] o.a.s.c.o.ZkStateWriter going to create_collection /collections/collection1/state.json
[junit4] 2> 1379685 INFO (zkCallback-1715-thread-1) [ ] o.a.s.c.c.ZkStateReader A cluster state change: WatchedEvent state:SyncConnected type:NodeDataChanged path:/clusterstate.json, has occurred - updating... (live nodes size: 1)
[junit4] 2> 1379685 INFO (zkCallback-1713-thread-1-processing-n:127.0.0.1:39249_) [n:127.0.0.1:39249_ ] o.a.s.c.c.ZkStateReader A cluster state change: WatchedEvent state:SyncConnected type:NodeDataChanged path:/clusterstate.json, has occurred - updating... (live nodes size: 1)
[junit4] 2> 1380251 INFO (TEST-RemoteQueryErrorTest.test-seed#[2172154495F25F90]) [ ] o.a.s.SolrTestCaseJ4 Writing core.properties file to /export/home/jenkins/workspace/Lucene-Solr-trunk-Solaris/solr/build/solr-core/test/J0/temp/solr.cloud.RemoteQueryErrorTest_2172154495F25F90-001/shard-1-001/cores/collection1
[junit4] 2> 1380254 INFO (TEST-RemoteQueryErrorTest.test-seed#[2172154495F25F90]) [ ] o.a.s.c.AbstractFullDistribZkTestBase create jetty 1 in directory /export/home/jenkins/workspace/Lucene-Solr-trunk-Solaris/solr/build/solr-core/test/J0/temp/solr.cloud.RemoteQueryErrorTest_2172154495F25F90-001/shard-1-001
[junit4] 2> 1380256 INFO (TEST-RemoteQueryErrorTest.test-seed#[2172154495F25F90]) [ ] o.e.j.s.Server jetty-9.2.13.v20150730
[junit4] 2> 1380264 INFO (TEST-RemoteQueryErrorTest.test-seed#[2172154495F25F90]) [ ] o.e.j.s.h.ContextHandler Started o.e.j.s.ServletContextHandler@3306015b{/,null,AVAILABLE}
[junit4] 2> 1380266 INFO (TEST-RemoteQueryErrorTest.test-seed#[2172154495F25F90]) [ ] o.e.j.s.ServerConnector Started ServerConnector@7909d3e6{HTTP/1.1}{127.0.0.1:33514}
[junit4] 2> 1380267 INFO (TEST-RemoteQueryErrorTest.test-seed#[2172154495F25F90]) [ ] o.e.j.s.Server Started @1405521ms
[junit4] 2> 1380267 INFO (TEST-RemoteQueryErrorTest.test-seed#[2172154495F25F90]) [ ] o.a.s.c.s.e.JettySolrRunner Jetty properties: {solr.data.dir=/export/home/jenkins/workspace/Lucene-Solr-trunk-Solaris/solr/build/solr-core/test/J0/temp/solr.cloud.RemoteQueryErrorTest_2172154495F25F90-001/tempDir-001/jetty1, solrconfig=solrconfig.xml, hostContext=/, hostPort=33514, coreRootDirectory=/export/home/jenkins/workspace/Lucene-Solr-trunk-Solaris/solr/build/solr-core/test/J0/../../../../../../../../../../export/home/jenkins/workspace/Lucene-Solr-trunk-Solaris/solr/build/solr-core/test/J0/temp/solr.cloud.RemoteQueryErrorTest_2172154495F25F90-001/shard-1-001/cores}
[junit4] 2> 1380268 INFO (TEST-RemoteQueryErrorTest.test-seed#[2172154495F25F90]) [ ] o.a.s.s.SolrDispatchFilter SolrDispatchFilter.init(): sun.misc.Launcher$AppClassLoader@659e0bfd
[junit4] 2> 1380268 INFO (TEST-RemoteQueryErrorTest.test-seed#[2172154495F25F90]) [ ] o.a.s.c.SolrResourceLoader new SolrResourceLoader for directory: '/export/home/jenkins/workspace/Lucene-Solr-trunk-Solaris/solr/build/solr-core/test/J0/../../../../../../../../../../export/home/jenkins/workspace/Lucene-Solr-trunk-Solaris/solr/build/solr-core/test/J0/temp/solr.cloud.RemoteQueryErrorTest_2172154495F25F90-001/shard-1-001/'
[junit4] 2> 1380377 INFO (TEST-RemoteQueryErrorTest.test-seed#[2172154495F25F90]) [ ] o.a.s.c.c.SolrZkClient Using default ZkCredentialsProvider
[junit4] 2> 1380378 INFO (TEST-RemoteQueryErrorTest.test-seed#[2172154495F25F90]) [ ] o.a.s.c.c.ConnectionManager Waiting for client to connect to ZooKeeper
[junit4] 2> 1380396 INFO (zkCallback-1717-thread-1) [ ] o.a.s.c.c.ConnectionManager Watcher org.apache.solr.common.cloud.ConnectionManager@310cd4a name:ZooKeeperConnection Watcher:127.0.0.1:45429/solr got event WatchedEvent state:SyncConnected type:None path:null path:null type:None
[junit4] 2> 1380397 INFO (TEST-RemoteQueryErrorTest.test-seed#[2172154495F25F90]) [ ] o.a.s.c.c.ConnectionManager Client is connected to ZooKeeper
[junit4] 2> 1380398 INFO (TEST-RemoteQueryErrorTest.test-seed#[2172154495F25F90]) [ ] o.a.s.c.c.SolrZkClient Using default ZkACLProvider
[junit4] 2> 1380400 INFO (TEST-RemoteQueryErrorTest.test-seed#[2172154495F25F90]) [ ] o.a.s.s.SolrDispatchFilter Loading solr.xml from SolrHome (not found in ZooKeeper)
[junit4] 2> 1380400 INFO (TEST-RemoteQueryErrorTest.test-seed#[2172154495F25F90]) [ ] o.a.s.c.SolrXmlConfig Loading container configuration from /export/home/jenkins/workspace/Lucene-Solr-trunk-Solaris/solr/build/solr-core/test/J0/../../../../../../../../../../export/home/jenkins/workspace/Lucene-Solr-trunk-Solaris/solr/build/solr-core/test/J0/temp/solr.cloud.RemoteQueryErrorTest_2172154495F25F90-001/shard-1-001/solr.xml
[junit4] 2> 1380408 INFO (TEST-RemoteQueryErrorTest.test-seed#[2172154495F25F90]) [ ] o.a.s.c.CoresLocator Config-defined core root directory: /export/home/jenkins/workspace/Lucene-Solr-trunk-Solaris/solr/build/solr-core/test/J0/../../../../../../../../../../export/home/jenkins/workspace/Lucene-Solr-trunk-Solaris/solr/build/solr-core/test/J0/temp/solr.cloud.RemoteQueryErrorTest_2172154495F25F90-001/shard-1-001/cores
[junit4] 2> 1380408 INFO (TEST-RemoteQueryErrorTest.test-seed#[2172154495F25F90]) [ ] o.a.s.c.CoreContainer New CoreContainer 2056291219
[junit4] 2> 1380408 INFO (TEST-RemoteQueryErrorTest.test-seed#[2172154495F25F90]) [ ] o.a.s.c.CoreContainer Loading cores into CoreContainer [instanceDir=/export/home/jenkins/workspace/Lucene-Solr-trunk-Solaris/solr/build/solr-core/test/J0/../../../../../../../../../../export/home/jenkins/workspace/Lucene-Solr-trunk-Solaris/solr/build/solr-core/test/J0/temp/solr.cloud.RemoteQueryErrorTest_2172154495F25F90-001/shard-1-001/]
[junit4] 2> 1380408 INFO (TEST-RemoteQueryErrorTest.test-seed#[2172154495F25F90]) [ ] o.a.s.c.CoreContainer loading shared library: /export/home/jenkins/workspace/Lucene-Solr-trunk-Solaris/solr/build/solr-core/test/J0/../../../../../../../../../../export/home/jenkins/workspace/Lucene-Solr-trunk-Solaris/solr/build/solr-core/test/J0/temp/solr.cloud.RemoteQueryErrorTest_2172154495F25F90-001/shard-1-001/lib
[junit4] 2> 1380409 WARN (TEST-RemoteQueryErrorTest.test-seed#[2172154495F25F90]) [ ] o.a.s.c.SolrResourceLoader Can't find (or read) directory to add to classloader: lib (resolved as: /export/home/jenkins/workspace/Lucene-Solr-trunk-Solaris/solr/build/solr-core/test/J0/../../../../../../../../../../export/home/jenkins/workspace/Lucene-Solr-trunk-Solaris/solr/build/solr-core/test/J0/temp/solr.cloud.RemoteQueryErrorTest_2172154495F25F90-001/shard-1-001/lib).
[junit4] 2> 1380459 INFO (TEST-RemoteQueryErrorTest.test-seed#[2172154495F25F90]) [ ] o.a.s.h.c.HttpShardHandlerFactory created with socketTimeout : 90000,urlScheme : ,connTimeout : 15000,maxConnectionsPerHost : 20,maxConnections : 10000,corePoolSize : 0,maximumPoolSize : 2147483647,maxThreadIdleTime : 5,sizeOfQueue : -1,fairnessPolicy : false,useRetries : false,
[junit4] 2> 1380463 INFO (TEST-RemoteQueryErrorTest.test-seed#[2172154495F25F90]) [ ] o.a.s.u.UpdateShardHandler Creating UpdateShardHandler HTTP client with params: socketTimeout=340000&connTimeout=45000&retry=true
[junit4] 2> 1380466 INFO (TEST-RemoteQueryErrorTest.test-seed#[2172154495F25F90]) [ ] o.a.s.l.LogWatcher SLF4J impl is org.slf4j.impl.Log4jLoggerFactory
[junit4] 2> 1380466 INFO (TEST-RemoteQueryErrorTest.test-seed#[2172154495F25F90]) [ ] o.a.s.l.LogWatcher Registering Log Listener [Log4j (org.slf4j.impl.Log4jLoggerFactory)]
[junit4] 2> 1380467 INFO (TEST-RemoteQueryErrorTest.test-seed#[2172154495F25F90]) [ ] o.a.s.c.ZkContainer Zookeeper client=127.0.0.1:45429/solr
[junit4] 2> 1380467 INFO (TEST-RemoteQueryErrorTest.test-seed#[2172154495F25F90]) [ ] o.a.s.c.ZkController zkHost includes chroot
[junit4] 2> 1380467 INFO (TEST-RemoteQueryErrorTest.test-seed#[2172154495F25F90]) [ ] o.a.s.c.c.SolrZkClient Using default ZkCredentialsProvider
[junit4] 2> 1380468 INFO (TEST-RemoteQueryErrorTest.test-seed#[2172154495F25F90]) [ ] o.a.s.c.c.ConnectionManager Waiting for client to connect to ZooKeeper
[junit4] 2> 1380475 INFO (zkCallback-1719-thread-1) [ ] o.a.s.c.c.ConnectionManager Watcher org.apache.solr.common.cloud.ConnectionManager@289433ed name:ZooKeeperConnection Watcher:127.0.0.1:45429 got event WatchedEvent state:SyncConnected type:None path:null path:null type:None
[junit4] 2> 1380476 INFO (TEST-RemoteQueryErrorTest.test-seed#[2172154495F25F90]) [ ] o.a.s.c.c.ConnectionManager Client is connected to ZooKeeper
[junit4] 2> 1380476 INFO (TEST-RemoteQueryErrorTest.test-seed#[2172154495F25F90]) [ ] o.a.s.c.c.SolrZkClient Using default ZkACLProvider
[junit4] 2> 1380480 INFO (TEST-RemoteQueryErrorTest.test-seed#[2172154495F25F90]) [n:127.0.0.1:33514_ ] o.a.s.c.c.ConnectionManager Waiting for client to connect to ZooKeeper
[junit4] 2> 1380485 INFO (zkCallback-1720-thread-1-processing-n:127.0.0.1:33514_) [n:127.0.0.1:33514_ ] o.a.s.c.c.ConnectionManager Watcher org.apache.solr.common.cloud.ConnectionManager@795a572c name:ZooKeeperConnection Watcher:127.0.0.1:45429/solr got event WatchedEvent state:SyncConnected type:None path:null path:null type:None
[junit4] 2> 1380485 INFO (TEST-RemoteQueryErrorTest.test-seed#[2172154495F25F90]) [n:127.0.0.1:33514_ ] o.a.s.c.c.ConnectionManager Client is connected to ZooKeeper
[junit4] 2> 1380495 INFO (TEST-RemoteQueryErrorTest.test-seed#[2172154495F25F90]) [n:127.0.0.1:33514_ ] o.a.s.c.c.ZkStateReader Updating cluster state from ZooKeeper...
[junit4] 2> 1381508 INFO (TEST-RemoteQueryErrorTest.test-seed#[2172154495F25F90]) [n:127.0.0.1:33514_ ] o.a.s.c.ZkController Register node as live in ZooKeeper:/live_nodes/127.0.0.1:33514_
[junit4] 2> 1381509 INFO (TEST-RemoteQueryErrorTest.test-seed#[2172154495F25F90]) [n:127.0.0.1:33514_ ] o.a.s.c.c.SolrZkClient makePath: /live_nodes/127.0.0.1:33514_
[junit4] 2> 1381511 INFO (zkCallback-1715-thread-1) [ ] o.a.s.c.c.ZkStateReader A live node change: WatchedEvent state:SyncConnected type:NodeChildrenChanged path:/live_nodes, has occurred - updating... (live nodes size: 1)
[junit4] 2> 1381511 INFO (zkCallback-1720-thread-1-processing-n:127.0.0.1:33514_) [n:127.0.0.1:33514_ ] o.a.s.c.c.ZkStateReader A live node change: WatchedEvent state:SyncConnected type:NodeChildrenChanged path:/live_nodes, has occurred - updating... (live nodes size: 1)
[junit4] 2> 1381511 INFO (zkCallback-1713-thread-1-processing-n:127.0.0.1:39249_) [n:127.0.0.1:39249_ ] o.a.s.c.c.ZkStateReader A live node change: WatchedEvent state:SyncConnected type:NodeChildrenChanged path:/live_nodes, has occurred - updating... (live nodes size: 1)
[junit4] 2> 1381515 INFO (TEST-RemoteQueryErrorTest.test-seed#[2172154495F25F90]) [n:127.0.0.1:33514_ ] o.a.s.c.Overseer Overseer (id=null) closing
[junit4] 2> 1381516 INFO (TEST-RemoteQueryErrorTest.test-seed#[2172154495F25F90]) [n:127.0.0.1:33514_ ] o.a.s.c.LeaderElector Joined leadership election with path: /overseer_elect/election/94596348901916681-127.0.0.1:33514_-n_0000000001
[junit4] 2> 1381517 INFO (TEST-RemoteQueryErrorTest.test-seed#[2172154495F25F90]) [n:127.0.0.1:33514_ ] o.a.s.c.LeaderElector Watching path /overseer_elect/election/94596348901916676-127.0.0.1:39249_-n_0000000000 to know if I could be the leader
[junit4] 2> 1381522 INFO (TEST-RemoteQueryErrorTest.test-seed#[2172154495F25F90]) [n:127.0.0.1:33514_ ] o.a.s.c.CoreContainer Security conf doesn't exist. Skipping setup for authorization module.
[junit4] 2> 1381522 INFO (TEST-RemoteQueryErrorTest.test-seed#[2172154495F25F90]) [n:127.0.0.1:33514_ ] o.a.s.c.CoreContainer No authentication plugin used.
[junit4] 2> 1381523 INFO (TEST-RemoteQueryErrorTest.test-seed#[2172154495F25F90]) [n:127.0.0.1:33514_ ] o.a.s.c.CoresLocator Looking for core definitions underneath /export/home/jenkins/workspace/Lucene-Solr-trunk-Solaris/solr/build/solr-core/test/J0/../../../../../../../../../../export/home/jenkins/workspace/Lucene-Solr-trunk-Solaris/solr/build/solr-core/test/J0/temp/solr.cloud.RemoteQueryErrorTest_2172154495F25F90-001/shard-1-001/cores
[junit4] 2> 1381524 INFO (TEST-RemoteQueryErrorTest.test-seed#[2172154495F25F90]) [n:127.0.0.1:33514_ ] o.a.s.c.SolrCore Created CoreDescriptor: {name=collection1, config=solrconfig.xml, transient=false, schema=schema.xml, loadOnStartup=true, configSetProperties=configsetprops.json, instanceDir=/export/home/jenkins/workspace/Lucene-Solr-trunk-Solaris/solr/build/solr-core/test/J0/../../../../../../../../../../export/home/jenkins/workspace/Lucene-Solr-trunk-Solaris/solr/build/solr-core/test/J0/temp/solr.cloud.RemoteQueryErrorTest_2172154495F25F90-001/shard-1-001/cores/collection1, collection=collection1, absoluteInstDir=/export/home/jenkins/workspace/Lucene-Solr-trunk-Solaris/solr/build/solr-core/test/J0/../../../../../../../../../../export/home/jenkins/workspace/Lucene-Solr-trunk-Solaris/solr/build/solr-core/test/J0/temp/solr.cloud.RemoteQueryErrorTest_2172154495F25F90-001/shard-1-001/cores/collection1/, coreNodeName=, dataDir=data/, shard=}
[junit4] 2> 1381524 INFO (TEST-RemoteQueryErrorTest.test-seed#[2172154495F25F90]) [n:127.0.0.1:33514_ ] o.a.s.c.CoresLocator Found core collection1 in /export/home/jenkins/workspace/Lucene-Solr-trunk-Solaris/solr/build/solr-core/test/J0/../../../../../../../../../../export/home/jenkins/workspace/Lucene-Solr-trunk-Solaris/solr/build/solr-core/test/J0/temp/solr.cloud.RemoteQueryErrorTest_2172154495F25F90-001/shard-1-001/cores/collection1/
[junit4] 2> 1381524 INFO (TEST-RemoteQueryErrorTest.test-seed#[2172154495F25F90]) [n:127.0.0.1:33514_ ] o.a.s.c.CoresLocator Found 1 core definitions
[junit4] 2> 1381526 INFO (TEST-RemoteQueryErrorTest.test-seed#[2172154495F25F90]) [n:127.0.0.1:33514_ ] o.a.s.s.SolrDispatchFilter user.dir=/export/home/jenkins/workspace/Lucene-Solr-trunk-Solaris/solr/build/solr-core/test/J0
[junit4] 2> 1381526 INFO (TEST-RemoteQueryErrorTest.test-seed#[2172154495F25F90]) [n:127.0.0.1:33514_ ] o.a.s.s.SolrDispatchFilter SolrDispatchFilter.init() done
[junit4] 2> 1381529 INFO (coreLoadExecutor-3639-thread-1-processing-n:127.0.0.1:33514_) [n:127.0.0.1:33514_ c:collection1 x:collection1] o.a.s.c.ZkController publishing state=down
[junit4] 2> 1381529 INFO (coreLoadExecutor-3639-thread-1-processing-n:127.0.0.1:33514_) [n:127.0.0.1:33514_ c:collection1 x:collection1] o.a.s.c.ZkController numShards not found on descriptor - reading it from system property
[junit4] 2> 1381531 INFO (coreLoadExecutor-3639-thread-1-processing-n:127.0.0.1:33514_) [n:127.0.0.1:33514_ c:collection1 x:collection1] o.a.s.c.ZkController Registering watch for collection collection1
[junit4] 2> 1381531 INFO (coreLoadExecutor-3639-thread-1-processing-n:127.0.0.1:33514_) [n:127.0.0.1:33514_ c:collection1 x:collection1] o.a.s.c.c.ZkStateReader addZkWatch collection1
[junit4] 2> 1381532 INFO (OverseerStateUpdate-94596348901916676-127.0.0.1:39249_-n_0000000000) [n:127.0.0.1:39249_ ] o.a.s.c.Overseer processMessage: queueSize: 1, message = {
[junit4] 2> "core":"collection1",
[junit4] 2> "roles":null,
[junit4] 2> "base_url":"http://127.0.0.1:33514",
[junit4] 2> "node_name":"127.0.0.1:33514_",
[junit4] 2> "numShards":"1",
[junit4] 2> "state":"down",
[junit4] 2> "shard":null,
[junit4] 2> "collection":"collection1",
[junit4] 2> "operation":"state"} current state version: 3
[junit4] 2> 1381533 INFO (OverseerStateUpdate-94596348901916676-127.0.0.1:39249_-n_0000000000) [n:127.0.0.1:39249_ ] o.a.s.c.o.ReplicaMutator Update state numShards=1 message={
[junit4] 2> "core":"collection1",
[junit4] 2> "roles":null,
[junit4] 2> "base_url":"http://127.0.0.1:33514",
[junit4] 2> "node_name":"127.0.0.1:33514_",
[junit4] 2> "numShards":"1",
[junit4] 2> "state":"down",
[junit4] 2> "shard":null,
[junit4] 2> "collection":"collection1",
[junit4] 2> "operation":"state"}
[junit4] 2> 1381533 INFO (coreLoadExecutor-3639-thread-1-processing-n:127.0.0.1:33514_) [n:127.0.0.1:33514_ c:collection1 x:collection1] o.a.s.c.c.ZkStateReader Add data for collection1 ver 0
[junit4] 2> 1381533 INFO (OverseerStateUpdate-94596348901916676-127.0.0.1:39249_-n_0000000000) [n:127.0.0.1:39249_ ] o.a.s.c.o.ReplicaMutator Collection already exists with numShards=1
[junit4] 2> 1381533 INFO (OverseerStateUpdate-94596348901916676-127.0.0.1:39249_-n_0000000000) [n:127.0.0.1:39249_ ] o.a.s.c.o.ReplicaMutator Assigning new node to shard shard=shard1
[junit4] 2> 1381551 INFO (coreLoadExecutor-3639-thread-1-processing-n:127.0.0.1:33514_) [n:127.0.0.1:33514_ c:collection1 x:collection1] o.a.s.c.ZkController look for our core node name
[junit4] 2> 1381553 INFO (OverseerStateUpdate-94596348901916676-127.0.0.1:39249_-n_0000000000) [n:127.0.0.1:39249_ ] o.a.s.c.o.ZkStateWriter going to update_collection /collections/collection1/state.json version: 0
[junit4] 2> 1381555 INFO (zkCallback-1720-thread-1-processing-n:127.0.0.1:33514_) [n:127.0.0.1:33514_ ] o.a.s.c.c.ZkStateReader A cluster state change: WatchedEvent state:SyncConnected type:NodeDataChanged path:/collections/collection1/state.json for collection collection1 has occurred - updating... (live nodes size: 2)
[junit4] 2> 1381556 INFO (zkCallback-1720-thread-1-processing-n:127.0.0.1:33514_) [n:127.0.0.1:33514_ ] o.a.s.c.c.ZkStateReader Updating data for collection1 from 0 to 1
[junit4] 2> 1382551 INFO (coreLoadExecutor-3639-thread-1-processing-n:127.0.0.1:33514_) [n:127.0.0.1:33514_ c:collection1 x:collection1] o.a.s.c.ZkController waiting to find shard id in clusterstate for collection1
[junit4] 2> 1382552 INFO (coreLoadExecutor-3639-thread-1-processing-n:127.0.0.1:33514_) [n:127.0.0.1:33514_ c:collection1 x:collection1] o.a.s.c.ZkController Check for collection zkNode:collection1
[junit4] 2> 1382553 INFO (coreLoadExecutor-3639-thread-1-processing-n:127.0.0.1:33514_) [n:127.0.0.1:33514_ c:collection1 x:collection1] o.a.s.c.ZkController Collection zkNode exists
[junit4] 2> 1382553 INFO (coreLoadExecutor-3639-thread-1-processing-n:127.0.0.1:33514_) [n:127.0.0.1:33514_ c:collection1 x:collection1] o.a.s.c.c.ZkStateReader Load collection config from:/collections/collection1
[junit4] 2> 1382554 INFO (coreLoadExecutor-3639-thread-1-processing-n:127.0.0.1:33514_) [n:127.0.0.1:33514_ c:collection1 x:collection1] o.a.s.c.c.ZkStateReader path=/collections/collection1 configName=conf1 specified config exists in ZooKeeper
[junit4] 2> 1382554 INFO (coreLoadExecutor-3639-thread-1-processing-n:127.0.0.1:33514_) [n:127.0.0.1:33514_ c:collection1 x:collection1] o.a.s.c.SolrResourceLoader new SolrResourceLoader for directory: '/export/home/jenkins/workspace/Lucene-Solr-trunk-Solaris/solr/build/solr-core/test/J0/../../../../../../../../../../export/home/jenkins/workspace/Lucene-Solr-trunk-Solaris/solr/build/solr-core/test/J0/temp/solr.cloud.RemoteQueryErrorTest_2172154495F25F90-001/shard-1-001/cores/collection1/'
[junit4] 2> 1382593 INFO (coreLoadExecutor-3639-thread-1-processing-n:127.0.0.1:33514_) [n:127.0.0.1:33514_ c:collection1 x:collection1] o.a.s.c.Config loaded config solrconfig.xml with version 0
[junit4] 2> 1382601 INFO (coreLoadExecutor-3639-thread-1-processing-n:127.0.0.1:33514_) [n:127.0.0.1:33514_ c:collection1 x:collection1] o.a.s.c.SolrConfig current version of requestparams : -1
[junit4] 2> 1382604 INFO (coreLoadExecutor-3639-thread-1-processing-n:127.0.0.1:33514_) [n:127.0.0.1:33514_ c:collection1 x:collection1] o.a.s.c.SolrConfig Using Lucene MatchVersion: 6.0.0
[junit4] 2> 1382609 INFO (coreLoadExecutor-3639-thread-1-processing-n:127.0.0.1:33514_) [n:127.0.0.1:33514_ c:collection1 x:collection1] o.a.s.c.Config Loaded SolrConfig: solrconfig.xml
[junit4] 2> 1382610 INFO (coreLoadExecutor-3639-thread-1-processing-n:127.0.0.1:33514_) [n:127.0.0.1:33514_ c:collection1 x:collection1] o.a.s.s.IndexSchema Reading Solr Schema from /configs/conf1/schema.xml
[junit4] 2> 1382617 INFO (coreLoadExecutor-3639-thread-1-processing-n:127.0.0.1:33514_) [n:127.0.0.1:33514_ c:collection1 x:collection1] o.a.s.s.IndexSchema [collection1] Schema name=test
[junit4] 2> 1382745 INFO (coreLoadExecutor-3639-thread-1-processing-n:127.0.0.1:33514_) [n:127.0.0.1:33514_ c:collection1 x:collection1] o.a.s.s.OpenExchangeRatesOrgProvider Initialized with rates=open-exchange-rates.json, refreshInterval=1440.
[junit4] 2> 1382752 INFO (coreLoadExecutor-3639-thread-1-processing-n:127.0.0.1:33514_) [n:127.0.0.1:33514_ c:collection1 x:collection1] o.a.s.s.IndexSchema default search field in schema is text
[junit4] 2> 1382753 INFO (coreLoadExecutor-3639-thread-1-processing-n:127.0.0.1:33514_) [n:127.0.0.1:33514_ c:collection1 x:collection1] o.a.s.s.IndexSchema unique key field: id
[junit4] 2> 1382767 INFO (coreLoadExecutor-3639-thread-1-processing-n:127.0.0.1:33514_) [n:127.0.0.1:33514_ c:collection1 x:collection1] o.a.s.s.FileExchangeRateProvider Reloading exchange rates from file currency.xml
[junit4] 2> 1382771 INFO (coreLoadExecutor-3639-thread-1-processing-n:127.0.0.1:33514_) [n:127.0.0.1:33514_ c:collection1 x:collection1] o.a.s.s.FileExchangeRateProvider Reloading exchange rates from file currency.xml
[junit4] 2> 1382774 INFO (coreLoadExecutor-3639-thread-1-processing-n:127.0.0.1:33514_) [n:127.0.0.1:33514_ c:collection1 x:collection1] o.a.s.s.OpenExchangeRatesOrgProvider Reloading exchange rates from open-exchange-rates.json
[junit4] 2> 1382776 WARN (coreLoadExecutor-3639-thread-1-processing-n:127.0.0.1:33514_) [n:127.0.0.1:33514_ c:collection1 x:collection1] o.a.s.s.OpenExchangeRatesOrgProvider Unknown key IMPORTANT NOTE
[junit4] 2> 1382776 WARN (coreLoadExecutor-3639-thread-1-processing-n:127.0.0.1:33514_) [n:127.0.0.1:33514_ c:collection1 x:collection1] o.a.s.s.OpenExchangeRatesOrgProvider Expected key, got STRING
[junit4] 2> 1382776 INFO (coreLoadExecutor-3639-thread-1-processing-n:127.0.0.1:33514_) [n:127.0.0.1:33514_ c:collection1 x:collection1] o.a.s.s.OpenExchangeRatesOrgProvider Reloading exchange rates from open-exchange-rates.json
[junit4] 2> 1382778 WARN (coreLoadExecutor-3639-thread-1-processing-n:127.0.0.1:33514_) [n:127.0.0.1:33514_ c:collection1 x:colle
[...truncated too long message...]
rvletContextHandler@73fcd97b{/solr,null,UNAVAILABLE}
[junit4] 2> 2208706 INFO (TEST-TestReplicationHandler.doTestRepeater-seed#[2172154495F25F90]) [ ] o.e.j.s.ServerConnector Stopped ServerConnector@e5e247f{HTTP/1.1}{127.0.0.1:0}
[junit4] 2> 2208706 INFO (TEST-TestReplicationHandler.doTestRepeater-seed#[2172154495F25F90]) [ ] o.a.s.c.CoreContainer Shutting down CoreContainer instance=669177064
[junit4] 2> 2208706 INFO (TEST-TestReplicationHandler.doTestRepeater-seed#[2172154495F25F90]) [ x:collection1] o.a.s.c.SolrCore [collection1] CLOSING SolrCore org.apache.solr.core.SolrCore@867f873
[junit4] 2> 2208706 INFO (TEST-TestReplicationHandler.doTestRepeater-seed#[2172154495F25F90]) [ x:collection1] o.a.s.u.UpdateHandler closing DirectUpdateHandler2{commits=0,autocommits=0,soft autocommits=0,optimizes=0,rollbacks=0,expungeDeletes=0,docsPending=0,adds=0,deletesById=0,deletesByQuery=0,errors=0,cumulative_adds=0,cumulative_deletesById=0,cumulative_deletesByQuery=0,cumulative_errors=0}
[junit4] 2> 2208707 INFO (TEST-TestReplicationHandler.doTestRepeater-seed#[2172154495F25F90]) [ x:collection1] o.a.s.u.SolrCoreState Closing SolrCoreState
[junit4] 2> 2208707 INFO (TEST-TestReplicationHandler.doTestRepeater-seed#[2172154495F25F90]) [ x:collection1] o.a.s.u.DefaultSolrCoreState SolrCoreState ref count has reached 0 - closing IndexWriter
[junit4] 2> 2208707 INFO (TEST-TestReplicationHandler.doTestRepeater-seed#[2172154495F25F90]) [ x:collection1] o.a.s.u.DefaultSolrCoreState closing IndexWriter with IndexWriterCloser
[junit4] 2> 2208707 INFO (TEST-TestReplicationHandler.doTestRepeater-seed#[2172154495F25F90]) [ x:collection1] o.a.s.c.SolrCore [collection1] Closing main searcher on request.
[junit4] 2> 2208708 INFO (TEST-TestReplicationHandler.doTestRepeater-seed#[2172154495F25F90]) [ x:collection1] o.a.s.c.CachingDirectoryFactory Closing MockDirectoryFactory - 2 directories currently being tracked
[junit4] 2> 2208708 INFO (TEST-TestReplicationHandler.doTestRepeater-seed#[2172154495F25F90]) [ x:collection1] o.a.s.c.CachingDirectoryFactory looking to close /export/home/jenkins/workspace/Lucene-Solr-trunk-Solaris/solr/build/solr-core/test/J1/temp/solr.handler.TestReplicationHandler_2172154495F25F90-001/solr-instance-027/./collection1/data/index [CachedDir<<refCount=0;path=/export/home/jenkins/workspace/Lucene-Solr-trunk-Solaris/solr/build/solr-core/test/J1/temp/solr.handler.TestReplicationHandler_2172154495F25F90-001/solr-instance-027/./collection1/data/index;done=false>>]
[junit4] 2> 2208708 INFO (TEST-TestReplicationHandler.doTestRepeater-seed#[2172154495F25F90]) [ x:collection1] o.a.s.c.CachingDirectoryFactory Closing directory: /export/home/jenkins/workspace/Lucene-Solr-trunk-Solaris/solr/build/solr-core/test/J1/temp/solr.handler.TestReplicationHandler_2172154495F25F90-001/solr-instance-027/./collection1/data/index
[junit4] 2> 2208708 INFO (TEST-TestReplicationHandler.doTestRepeater-seed#[2172154495F25F90]) [ x:collection1] o.a.s.c.CachingDirectoryFactory looking to close /export/home/jenkins/workspace/Lucene-Solr-trunk-Solaris/solr/build/solr-core/test/J1/temp/solr.handler.TestReplicationHandler_2172154495F25F90-001/solr-instance-027/./collection1/data [CachedDir<<refCount=0;path=/export/home/jenkins/workspace/Lucene-Solr-trunk-Solaris/solr/build/solr-core/test/J1/temp/solr.handler.TestReplicationHandler_2172154495F25F90-001/solr-instance-027/./collection1/data;done=false>>]
[junit4] 2> 2208708 INFO (TEST-TestReplicationHandler.doTestRepeater-seed#[2172154495F25F90]) [ x:collection1] o.a.s.c.CachingDirectoryFactory Closing directory: /export/home/jenkins/workspace/Lucene-Solr-trunk-Solaris/solr/build/solr-core/test/J1/temp/solr.handler.TestReplicationHandler_2172154495F25F90-001/solr-instance-027/./collection1/data
[junit4] 2> 2208708 INFO (TEST-TestReplicationHandler.doTestRepeater-seed#[2172154495F25F90]) [ x:collection1] o.e.j.s.h.ContextHandler Stopped o.e.j.s.ServletContextHandler@454cd528{/solr,null,UNAVAILABLE}
[junit4] 2> 2208711 INFO (SUITE-TestReplicationHandler-seed#[2172154495F25F90]-worker) [ ] o.a.s.SolrTestCaseJ4 ###deleteCore
[junit4] 2> NOTE: leaving temporary files on disk at: /export/home/jenkins/workspace/Lucene-Solr-trunk-Solaris/solr/build/solr-core/test/J1/temp/solr.handler.TestReplicationHandler_2172154495F25F90-001
[junit4] 2> NOTE: test params are: codec=Asserting(Lucene53): {name=TestBloomFilteredLucenePostings(BloomFilteringPostingsFormat(Lucene50(blocksize=128))), id=TestBloomFilteredLucenePostings(BloomFilteringPostingsFormat(Lucene50(blocksize=128))), newname=TestBloomFilteredLucenePostings(BloomFilteringPostingsFormat(Lucene50(blocksize=128)))}, docValues:{}, sim=ClassicSimilarity, locale=zh_CN, timezone=Pacific/Palau
[junit4] 2> NOTE: SunOS 5.11 amd64/Oracle Corporation 1.8.0_60 (64-bit)/cpus=3,threads=1,free=231708936,total=518979584
[junit4] 2> NOTE: All tests run in this JVM: [TestRecoveryHdfs, CdcrUpdateLogTest, ConvertedLegacyTest, SolrCoreCheckLockOnStartupTest, TestAuthorizationFramework, TestPerFieldSimilarity, TestOverriddenPrefixQueryForCustomFieldType, FullHLLTest, TestCoreDiscovery, SpellingQueryConverterTest, TestMacros, HighlighterMaxOffsetTest, TestCustomDocTransformer, TestBadConfig, TestSolrConfigHandlerConcurrent, IndexSchemaRuntimeFieldTest, TestStressUserVersions, TestValueSourceCache, RankQueryTest, ClusterStateTest, TestMiniSolrCloudClusterSSL, TestExclusionRuleCollectionAccess, CacheHeaderTest, TestConfigSetImmutable, SpatialRPTFieldTypeTest, QueryParsingTest, TestLMJelinekMercerSimilarityFactory, AsyncCallRequestStatusResponseTest, TestNamedUpdateProcessors, TestReloadAndDeleteDocs, SolrIndexSplitterTest, NotRequiredUniqueKeyTest, SolrCmdDistributorTest, TestRangeQuery, TermVectorComponentTest, DirectUpdateHandlerOptimizeTest, TestRandomRequestDistribution, TestSolrConfigHandlerCloud, TestSmileRequest, TestBulkSchemaAPI, HdfsUnloadDistributedZkTest, TestCopyFieldCollectionResource, TestCollationField, OpenExchangeRatesOrgProviderTest, PreAnalyzedFieldTest, TestHighFrequencyDictionaryFactory, TestDefaultStatsCache, CollectionStateFormat2Test, SolrCloudExampleTest, TestCharFilters, CdcrRequestHandlerTest, RAMDirectoryFactoryTest, TestOmitPositions, CoreAdminHandlerTest, TestReRankQParserPlugin, AddSchemaFieldsUpdateProcessorFactoryTest, SolrTestCaseJ4Test, ResponseHeaderTest, TestSuggestSpellingConverter, TestFuzzyAnalyzedSuggestions, TestRealTimeGet, MultiThreadedOCPTest, CollectionTooManyReplicasTest, BasicFunctionalityTest, TimeZoneUtilsTest, OpenCloseCoreStressTest, TestFreeTextSuggestions, TestIndexSearcher, TestRecovery, ReplicationFactorTest, StatsComponentTest, RecoveryAfterSoftCommitTest, SuggesterTest, TestCollectionAPI, MultiTermTest, TestZkChroot, BigEndianAscendingWordSerializerTest, DirectSolrConnectionTest, SliceStateTest, TestCloudManagedSchema, TestMiniSolrCloudCluster, BasicAuthIntegrationTest, TestSimpleTrackingShardHandler, TestLRUStatsCache, CopyFieldTest, UUIDFieldTest, TestCSVResponseWriter, LukeRequestHandlerTest, TestQueryTypes, SuggesterWFSTTest, SortByFunctionTest, TestManagedSchemaFieldResource, TestScoreJoinQPNoScore, TestManagedSchemaFieldTypeResource, TestRestManager, TestDefaultSearchFieldResource, SSLMigrationTest, TestAtomicUpdateErrorCases, HdfsWriteToMultipleCollectionsTest, HdfsNNFailoverTest, HLLUtilTest, TermVectorComponentDistributedTest, BadIndexSchemaTest, DistanceUnitsTest, NoCacheHeaderTest, TestManagedSynonymFilterFactory, TestFoldingMultitermQuery, SynonymTokenizerTest, SimpleMLTQParserTest, TestMinMaxOnMultiValuedField, TestJsonFacets, FieldAnalysisRequestHandlerTest, FieldMutatingUpdateProcessorTest, RequestHandlersTest, TestChildDocTransformer, PrimUtilsTest, DistributedFacetPivotLongTailTest, DistributedFacetPivotSmallAdvancedTest, AddBlockUpdateTest, TestRuleBasedAuthorizationPlugin, TestBinaryResponseWriter, TestSolrQueryParserDefaultOperatorResource, LeaderInitiatedRecoveryOnCommitTest, UpdateRequestProcessorFactoryTest, DistributedTermsComponentTest, TriLevelCompositeIdRoutingTest, HdfsRecoverLeaseTest, CollectionsAPIAsyncDistributedZkTest, SaslZkACLProviderTest, TestSolrDeletionPolicy2, BlockDirectoryTest, NumericFieldsTest, BasicDistributedZkTest, ChaosMonkeySafeLeaderTest, BasicDistributedZk2Test, CollectionsAPIDistributedZkTest, SyncSliceTest, OverseerTest, LeaderElectionIntegrationTest, ShardRoutingTest, BasicZkTest, FullSolrCloudDistribCmdsTest, TestReplicationHandler]
[junit4] Completed [291/546] on J1 in 122.16s, 13 tests, 1 error <<< FAILURES!
[...truncated 786 lines...]
BUILD FAILED
/export/home/jenkins/workspace/Lucene-Solr-trunk-Solaris/build.xml:775: The following error occurred while executing this line:
/export/home/jenkins/workspace/Lucene-Solr-trunk-Solaris/build.xml:719: The following error occurred while executing this line:
/export/home/jenkins/workspace/Lucene-Solr-trunk-Solaris/build.xml:59: The following error occurred while executing this line:
/export/home/jenkins/workspace/Lucene-Solr-trunk-Solaris/solr/build.xml:233: The following error occurred while executing this line:
/export/home/jenkins/workspace/Lucene-Solr-trunk-Solaris/solr/common-build.xml:514: The following error occurred while executing this line:
/export/home/jenkins/workspace/Lucene-Solr-trunk-Solaris/lucene/common-build.xml:1432: The following error occurred while executing this line:
/export/home/jenkins/workspace/Lucene-Solr-trunk-Solaris/lucene/common-build.xml:987: There were test failures: 546 suites (8 ignored), 2145 tests, 1 error, 1 failure, 47 ignored (35 assumptions) [seed: 2172154495F25F90]
Total time: 77 minutes 57 seconds
Build step 'Invoke Ant' marked build as failure
Archiving artifacts
[WARNINGS] Skipping publisher since build result is FAILURE
Recording test results
Email was triggered for: Failure - Any
Sending email for trigger: Failure - Any
[JENKINS] Lucene-Solr-trunk-Solaris (64bit/jdk1.8.0) - Build # 85 -
Still Failing!
Posted by Policeman Jenkins Server <je...@thetaphi.de>.
Build: http://jenkins.thetaphi.de/job/Lucene-Solr-trunk-Solaris/85/
Java: 64bit/jdk1.8.0 -XX:+UseCompressedOops -XX:+UseConcMarkSweepGC
1 tests failed.
FAILED: org.apache.solr.security.TestAuthorizationFramework.authorizationFrameworkTest
Error Message:
There are still nodes recoverying - waited for 10 seconds
Stack Trace:
java.lang.AssertionError: There are still nodes recoverying - waited for 10 seconds
at __randomizedtesting.SeedInfo.seed([52D7198F3F73812C:1C746C5C2EA8903C]:0)
at org.junit.Assert.fail(Assert.java:93)
at org.apache.solr.cloud.AbstractDistribZkTestBase.waitForRecoveriesToFinish(AbstractDistribZkTestBase.java:172)
at org.apache.solr.cloud.AbstractFullDistribZkTestBase.waitForRecoveriesToFinish(AbstractFullDistribZkTestBase.java:836)
at org.apache.solr.cloud.AbstractFullDistribZkTestBase.waitForThingsToLevelOut(AbstractFullDistribZkTestBase.java:1393)
at org.apache.solr.security.TestAuthorizationFramework.authorizationFrameworkTest(TestAuthorizationFramework.java:60)
at sun.reflect.NativeMethodAccessorImpl.invoke0(Native Method)
at sun.reflect.NativeMethodAccessorImpl.invoke(NativeMethodAccessorImpl.java:62)
at sun.reflect.DelegatingMethodAccessorImpl.invoke(DelegatingMethodAccessorImpl.java:43)
at java.lang.reflect.Method.invoke(Method.java:497)
at com.carrotsearch.randomizedtesting.RandomizedRunner.invoke(RandomizedRunner.java:1665)
at com.carrotsearch.randomizedtesting.RandomizedRunner$8.evaluate(RandomizedRunner.java:864)
at com.carrotsearch.randomizedtesting.RandomizedRunner$9.evaluate(RandomizedRunner.java:900)
at com.carrotsearch.randomizedtesting.RandomizedRunner$10.evaluate(RandomizedRunner.java:914)
at org.apache.solr.BaseDistributedSearchTestCase$ShardsRepeatRule$ShardsFixedStatement.callStatement(BaseDistributedSearchTestCase.java:963)
at org.apache.solr.BaseDistributedSearchTestCase$ShardsRepeatRule$ShardsStatement.evaluate(BaseDistributedSearchTestCase.java:938)
at com.carrotsearch.randomizedtesting.rules.SystemPropertiesRestoreRule$1.evaluate(SystemPropertiesRestoreRule.java:57)
at org.apache.lucene.util.TestRuleSetupTeardownChained$1.evaluate(TestRuleSetupTeardownChained.java:50)
at org.apache.lucene.util.AbstractBeforeAfterRule$1.evaluate(AbstractBeforeAfterRule.java:46)
at org.apache.lucene.util.TestRuleThreadAndTestName$1.evaluate(TestRuleThreadAndTestName.java:49)
at org.apache.lucene.util.TestRuleIgnoreAfterMaxFailures$1.evaluate(TestRuleIgnoreAfterMaxFailures.java:65)
at org.apache.lucene.util.TestRuleMarkFailure$1.evaluate(TestRuleMarkFailure.java:48)
at com.carrotsearch.randomizedtesting.rules.StatementAdapter.evaluate(StatementAdapter.java:36)
at com.carrotsearch.randomizedtesting.ThreadLeakControl$StatementRunner.run(ThreadLeakControl.java:367)
at com.carrotsearch.randomizedtesting.ThreadLeakControl.forkTimeoutingTask(ThreadLeakControl.java:809)
at com.carrotsearch.randomizedtesting.ThreadLeakControl$3.evaluate(ThreadLeakControl.java:460)
at com.carrotsearch.randomizedtesting.RandomizedRunner.runSingleTest(RandomizedRunner.java:873)
at com.carrotsearch.randomizedtesting.RandomizedRunner$5.evaluate(RandomizedRunner.java:775)
at com.carrotsearch.randomizedtesting.RandomizedRunner$6.evaluate(RandomizedRunner.java:809)
at com.carrotsearch.randomizedtesting.RandomizedRunner$7.evaluate(RandomizedRunner.java:820)
at com.carrotsearch.randomizedtesting.rules.StatementAdapter.evaluate(StatementAdapter.java:36)
at com.carrotsearch.randomizedtesting.rules.SystemPropertiesRestoreRule$1.evaluate(SystemPropertiesRestoreRule.java:57)
at org.apache.lucene.util.AbstractBeforeAfterRule$1.evaluate(AbstractBeforeAfterRule.java:46)
at com.carrotsearch.randomizedtesting.rules.StatementAdapter.evaluate(StatementAdapter.java:36)
at org.apache.lucene.util.TestRuleStoreClassName$1.evaluate(TestRuleStoreClassName.java:42)
at com.carrotsearch.randomizedtesting.rules.NoShadowingOrOverridesOnMethodsRule$1.evaluate(NoShadowingOrOverridesOnMethodsRule.java:39)
at com.carrotsearch.randomizedtesting.rules.NoShadowingOrOverridesOnMethodsRule$1.evaluate(NoShadowingOrOverridesOnMethodsRule.java:39)
at com.carrotsearch.randomizedtesting.rules.StatementAdapter.evaluate(StatementAdapter.java:36)
at com.carrotsearch.randomizedtesting.rules.StatementAdapter.evaluate(StatementAdapter.java:36)
at com.carrotsearch.randomizedtesting.rules.StatementAdapter.evaluate(StatementAdapter.java:36)
at org.apache.lucene.util.TestRuleAssertionsRequired$1.evaluate(TestRuleAssertionsRequired.java:54)
at org.apache.lucene.util.TestRuleMarkFailure$1.evaluate(TestRuleMarkFailure.java:48)
at org.apache.lucene.util.TestRuleIgnoreAfterMaxFailures$1.evaluate(TestRuleIgnoreAfterMaxFailures.java:65)
at org.apache.lucene.util.TestRuleIgnoreTestSuites$1.evaluate(TestRuleIgnoreTestSuites.java:55)
at com.carrotsearch.randomizedtesting.rules.StatementAdapter.evaluate(StatementAdapter.java:36)
at com.carrotsearch.randomizedtesting.ThreadLeakControl$StatementRunner.run(ThreadLeakControl.java:367)
at java.lang.Thread.run(Thread.java:745)
Build Log:
[...truncated 10759 lines...]
[junit4] Suite: org.apache.solr.security.TestAuthorizationFramework
[junit4] 2> Creating dataDir: /export/home/jenkins/workspace/Lucene-Solr-trunk-Solaris/solr/build/solr-core/test/J1/temp/solr.security.TestAuthorizationFramework_52D7198F3F73812C-001/init-core-data-001
[junit4] 2> 2949469 INFO (SUITE-TestAuthorizationFramework-seed#[52D7198F3F73812C]-worker) [ ] o.a.s.SolrTestCaseJ4 Randomized ssl (false) and clientAuth (false)
[junit4] 2> 2949469 INFO (SUITE-TestAuthorizationFramework-seed#[52D7198F3F73812C]-worker) [ ] o.a.s.BaseDistributedSearchTestCase Setting hostContext system property: /
[junit4] 2> 2949472 INFO (TEST-TestAuthorizationFramework.authorizationFrameworkTest-seed#[52D7198F3F73812C]) [ ] o.a.s.c.ZkTestServer STARTING ZK TEST SERVER
[junit4] 2> 2949473 INFO (Thread-11622) [ ] o.a.s.c.ZkTestServer client port:0.0.0.0/0.0.0.0:0
[junit4] 2> 2949473 INFO (Thread-11622) [ ] o.a.s.c.ZkTestServer Starting server
[junit4] 2> 2949573 INFO (TEST-TestAuthorizationFramework.authorizationFrameworkTest-seed#[52D7198F3F73812C]) [ ] o.a.s.c.ZkTestServer start zk server on port:41361
[junit4] 2> 2949573 INFO (TEST-TestAuthorizationFramework.authorizationFrameworkTest-seed#[52D7198F3F73812C]) [ ] o.a.s.c.c.SolrZkClient Using default ZkCredentialsProvider
[junit4] 2> 2949573 INFO (TEST-TestAuthorizationFramework.authorizationFrameworkTest-seed#[52D7198F3F73812C]) [ ] o.a.s.c.c.ConnectionManager Waiting for client to connect to ZooKeeper
[junit4] 2> 2949577 INFO (zkCallback-2582-thread-1) [ ] o.a.s.c.c.ConnectionManager Watcher org.apache.solr.common.cloud.ConnectionManager@62b82e2 name:ZooKeeperConnection Watcher:127.0.0.1:41361 got event WatchedEvent state:SyncConnected type:None path:null path:null type:None
[junit4] 2> 2949577 INFO (TEST-TestAuthorizationFramework.authorizationFrameworkTest-seed#[52D7198F3F73812C]) [ ] o.a.s.c.c.ConnectionManager Client is connected to ZooKeeper
[junit4] 2> 2949577 INFO (TEST-TestAuthorizationFramework.authorizationFrameworkTest-seed#[52D7198F3F73812C]) [ ] o.a.s.c.c.SolrZkClient Using default ZkACLProvider
[junit4] 2> 2949577 INFO (TEST-TestAuthorizationFramework.authorizationFrameworkTest-seed#[52D7198F3F73812C]) [ ] o.a.s.c.c.SolrZkClient makePath: /solr
[junit4] 2> 2949582 INFO (TEST-TestAuthorizationFramework.authorizationFrameworkTest-seed#[52D7198F3F73812C]) [ ] o.a.s.c.c.SolrZkClient Using default ZkCredentialsProvider
[junit4] 2> 2949582 INFO (TEST-TestAuthorizationFramework.authorizationFrameworkTest-seed#[52D7198F3F73812C]) [ ] o.a.s.c.c.ConnectionManager Waiting for client to connect to ZooKeeper
[junit4] 2> 2949584 INFO (zkCallback-2583-thread-1) [ ] o.a.s.c.c.ConnectionManager Watcher org.apache.solr.common.cloud.ConnectionManager@642c5915 name:ZooKeeperConnection Watcher:127.0.0.1:41361/solr got event WatchedEvent state:SyncConnected type:None path:null path:null type:None
[junit4] 2> 2949584 INFO (TEST-TestAuthorizationFramework.authorizationFrameworkTest-seed#[52D7198F3F73812C]) [ ] o.a.s.c.c.ConnectionManager Client is connected to ZooKeeper
[junit4] 2> 2949585 INFO (TEST-TestAuthorizationFramework.authorizationFrameworkTest-seed#[52D7198F3F73812C]) [ ] o.a.s.c.c.SolrZkClient Using default ZkACLProvider
[junit4] 2> 2949585 INFO (TEST-TestAuthorizationFramework.authorizationFrameworkTest-seed#[52D7198F3F73812C]) [ ] o.a.s.c.c.SolrZkClient makePath: /collections/collection1
[junit4] 2> 2949587 INFO (TEST-TestAuthorizationFramework.authorizationFrameworkTest-seed#[52D7198F3F73812C]) [ ] o.a.s.c.c.SolrZkClient makePath: /collections/collection1/shards
[junit4] 2> 2949590 INFO (TEST-TestAuthorizationFramework.authorizationFrameworkTest-seed#[52D7198F3F73812C]) [ ] o.a.s.c.c.SolrZkClient makePath: /collections/control_collection
[junit4] 2> 2949592 INFO (TEST-TestAuthorizationFramework.authorizationFrameworkTest-seed#[52D7198F3F73812C]) [ ] o.a.s.c.c.SolrZkClient makePath: /collections/control_collection/shards
[junit4] 2> 2949595 INFO (TEST-TestAuthorizationFramework.authorizationFrameworkTest-seed#[52D7198F3F73812C]) [ ] o.a.s.c.AbstractZkTestCase put /export/home/jenkins/workspace/Lucene-Solr-trunk-Solaris/solr/core/src/test-files/solr/collection1/conf/solrconfig-tlog.xml to /configs/conf1/solrconfig.xml
[junit4] 2> 2949595 INFO (TEST-TestAuthorizationFramework.authorizationFrameworkTest-seed#[52D7198F3F73812C]) [ ] o.a.s.c.c.SolrZkClient makePath: /configs/conf1/solrconfig.xml
[junit4] 2> 2949599 INFO (TEST-TestAuthorizationFramework.authorizationFrameworkTest-seed#[52D7198F3F73812C]) [ ] o.a.s.c.AbstractZkTestCase put /export/home/jenkins/workspace/Lucene-Solr-trunk-Solaris/solr/core/src/test-files/solr/collection1/conf/schema.xml to /configs/conf1/schema.xml
[junit4] 2> 2949599 INFO (TEST-TestAuthorizationFramework.authorizationFrameworkTest-seed#[52D7198F3F73812C]) [ ] o.a.s.c.c.SolrZkClient makePath: /configs/conf1/schema.xml
[junit4] 2> 2949602 INFO (TEST-TestAuthorizationFramework.authorizationFrameworkTest-seed#[52D7198F3F73812C]) [ ] o.a.s.c.AbstractZkTestCase put /export/home/jenkins/workspace/Lucene-Solr-trunk-Solaris/solr/core/src/test-files/solr/collection1/conf/solrconfig.snippet.randomindexconfig.xml to /configs/conf1/solrconfig.snippet.randomindexconfig.xml
[junit4] 2> 2949602 INFO (TEST-TestAuthorizationFramework.authorizationFrameworkTest-seed#[52D7198F3F73812C]) [ ] o.a.s.c.c.SolrZkClient makePath: /configs/conf1/solrconfig.snippet.randomindexconfig.xml
[junit4] 2> 2949605 INFO (TEST-TestAuthorizationFramework.authorizationFrameworkTest-seed#[52D7198F3F73812C]) [ ] o.a.s.c.AbstractZkTestCase put /export/home/jenkins/workspace/Lucene-Solr-trunk-Solaris/solr/core/src/test-files/solr/collection1/conf/stopwords.txt to /configs/conf1/stopwords.txt
[junit4] 2> 2949605 INFO (TEST-TestAuthorizationFramework.authorizationFrameworkTest-seed#[52D7198F3F73812C]) [ ] o.a.s.c.c.SolrZkClient makePath: /configs/conf1/stopwords.txt
[junit4] 2> 2949608 INFO (TEST-TestAuthorizationFramework.authorizationFrameworkTest-seed#[52D7198F3F73812C]) [ ] o.a.s.c.AbstractZkTestCase put /export/home/jenkins/workspace/Lucene-Solr-trunk-Solaris/solr/core/src/test-files/solr/collection1/conf/protwords.txt to /configs/conf1/protwords.txt
[junit4] 2> 2949608 INFO (TEST-TestAuthorizationFramework.authorizationFrameworkTest-seed#[52D7198F3F73812C]) [ ] o.a.s.c.c.SolrZkClient makePath: /configs/conf1/protwords.txt
[junit4] 2> 2949611 INFO (TEST-TestAuthorizationFramework.authorizationFrameworkTest-seed#[52D7198F3F73812C]) [ ] o.a.s.c.AbstractZkTestCase put /export/home/jenkins/workspace/Lucene-Solr-trunk-Solaris/solr/core/src/test-files/solr/collection1/conf/currency.xml to /configs/conf1/currency.xml
[junit4] 2> 2949611 INFO (TEST-TestAuthorizationFramework.authorizationFrameworkTest-seed#[52D7198F3F73812C]) [ ] o.a.s.c.c.SolrZkClient makePath: /configs/conf1/currency.xml
[junit4] 2> 2949614 INFO (TEST-TestAuthorizationFramework.authorizationFrameworkTest-seed#[52D7198F3F73812C]) [ ] o.a.s.c.AbstractZkTestCase put /export/home/jenkins/workspace/Lucene-Solr-trunk-Solaris/solr/core/src/test-files/solr/collection1/conf/enumsConfig.xml to /configs/conf1/enumsConfig.xml
[junit4] 2> 2949614 INFO (TEST-TestAuthorizationFramework.authorizationFrameworkTest-seed#[52D7198F3F73812C]) [ ] o.a.s.c.c.SolrZkClient makePath: /configs/conf1/enumsConfig.xml
[junit4] 2> 2949616 INFO (TEST-TestAuthorizationFramework.authorizationFrameworkTest-seed#[52D7198F3F73812C]) [ ] o.a.s.c.AbstractZkTestCase put /export/home/jenkins/workspace/Lucene-Solr-trunk-Solaris/solr/core/src/test-files/solr/collection1/conf/open-exchange-rates.json to /configs/conf1/open-exchange-rates.json
[junit4] 2> 2949617 INFO (TEST-TestAuthorizationFramework.authorizationFrameworkTest-seed#[52D7198F3F73812C]) [ ] o.a.s.c.c.SolrZkClient makePath: /configs/conf1/open-exchange-rates.json
[junit4] 2> 2949619 INFO (TEST-TestAuthorizationFramework.authorizationFrameworkTest-seed#[52D7198F3F73812C]) [ ] o.a.s.c.AbstractZkTestCase put /export/home/jenkins/workspace/Lucene-Solr-trunk-Solaris/solr/core/src/test-files/solr/collection1/conf/mapping-ISOLatin1Accent.txt to /configs/conf1/mapping-ISOLatin1Accent.txt
[junit4] 2> 2949619 INFO (TEST-TestAuthorizationFramework.authorizationFrameworkTest-seed#[52D7198F3F73812C]) [ ] o.a.s.c.c.SolrZkClient makePath: /configs/conf1/mapping-ISOLatin1Accent.txt
[junit4] 2> 2949622 INFO (TEST-TestAuthorizationFramework.authorizationFrameworkTest-seed#[52D7198F3F73812C]) [ ] o.a.s.c.AbstractZkTestCase put /export/home/jenkins/workspace/Lucene-Solr-trunk-Solaris/solr/core/src/test-files/solr/collection1/conf/old_synonyms.txt to /configs/conf1/old_synonyms.txt
[junit4] 2> 2949623 INFO (TEST-TestAuthorizationFramework.authorizationFrameworkTest-seed#[52D7198F3F73812C]) [ ] o.a.s.c.c.SolrZkClient makePath: /configs/conf1/old_synonyms.txt
[junit4] 2> 2949625 INFO (TEST-TestAuthorizationFramework.authorizationFrameworkTest-seed#[52D7198F3F73812C]) [ ] o.a.s.c.AbstractZkTestCase put /export/home/jenkins/workspace/Lucene-Solr-trunk-Solaris/solr/core/src/test-files/solr/collection1/conf/synonyms.txt to /configs/conf1/synonyms.txt
[junit4] 2> 2949625 INFO (TEST-TestAuthorizationFramework.authorizationFrameworkTest-seed#[52D7198F3F73812C]) [ ] o.a.s.c.c.SolrZkClient makePath: /configs/conf1/synonyms.txt
[junit4] 2> 2949629 INFO (TEST-TestAuthorizationFramework.authorizationFrameworkTest-seed#[52D7198F3F73812C]) [ ] o.a.s.c.c.SolrZkClient Using default ZkCredentialsProvider
[junit4] 2> 2949629 INFO (TEST-TestAuthorizationFramework.authorizationFrameworkTest-seed#[52D7198F3F73812C]) [ ] o.a.s.c.c.ConnectionManager Waiting for client to connect to ZooKeeper
[junit4] 2> 2949631 INFO (zkCallback-2584-thread-1) [ ] o.a.s.c.c.ConnectionManager Watcher org.apache.solr.common.cloud.ConnectionManager@66456d5 name:ZooKeeperConnection Watcher:127.0.0.1:41361/solr got event WatchedEvent state:SyncConnected type:None path:null path:null type:None
[junit4] 2> 2949631 INFO (TEST-TestAuthorizationFramework.authorizationFrameworkTest-seed#[52D7198F3F73812C]) [ ] o.a.s.c.c.ConnectionManager Client is connected to ZooKeeper
[junit4] 2> 2949631 INFO (TEST-TestAuthorizationFramework.authorizationFrameworkTest-seed#[52D7198F3F73812C]) [ ] o.a.s.c.c.SolrZkClient Using default ZkACLProvider
[junit4] 2> 2949849 INFO (TEST-TestAuthorizationFramework.authorizationFrameworkTest-seed#[52D7198F3F73812C]) [ ] o.a.s.SolrTestCaseJ4 Writing core.properties file to /export/home/jenkins/workspace/Lucene-Solr-trunk-Solaris/solr/build/solr-core/test/J1/temp/solr.security.TestAuthorizationFramework_52D7198F3F73812C-001/control-001/cores/collection1
[junit4] 2> 2949850 INFO (TEST-TestAuthorizationFramework.authorizationFrameworkTest-seed#[52D7198F3F73812C]) [ ] o.e.j.s.Server jetty-9.2.13.v20150730
[junit4] 2> 2949852 INFO (TEST-TestAuthorizationFramework.authorizationFrameworkTest-seed#[52D7198F3F73812C]) [ ] o.e.j.s.h.ContextHandler Started o.e.j.s.ServletContextHandler@bfc383e{/,null,AVAILABLE}
[junit4] 2> 2949852 INFO (TEST-TestAuthorizationFramework.authorizationFrameworkTest-seed#[52D7198F3F73812C]) [ ] o.e.j.s.ServerConnector Started ServerConnector@2da31460{HTTP/1.1}{127.0.0.1:55252}
[junit4] 2> 2949852 INFO (TEST-TestAuthorizationFramework.authorizationFrameworkTest-seed#[52D7198F3F73812C]) [ ] o.e.j.s.Server Started @2998441ms
[junit4] 2> 2949852 INFO (TEST-TestAuthorizationFramework.authorizationFrameworkTest-seed#[52D7198F3F73812C]) [ ] o.a.s.c.s.e.JettySolrRunner Jetty properties: {solr.data.dir=/export/home/jenkins/workspace/Lucene-Solr-trunk-Solaris/solr/build/solr-core/test/J1/temp/solr.security.TestAuthorizationFramework_52D7198F3F73812C-001/tempDir-001/control/data, hostContext=/, hostPort=55252, coreRootDirectory=/export/home/jenkins/workspace/Lucene-Solr-trunk-Solaris/solr/build/solr-core/test/J1/../../../../../../../../../../export/home/jenkins/workspace/Lucene-Solr-trunk-Solaris/solr/build/solr-core/test/J1/temp/solr.security.TestAuthorizationFramework_52D7198F3F73812C-001/control-001/cores}
[junit4] 2> 2949853 INFO (TEST-TestAuthorizationFramework.authorizationFrameworkTest-seed#[52D7198F3F73812C]) [ ] o.a.s.s.SolrDispatchFilter SolrDispatchFilter.init(): sun.misc.Launcher$AppClassLoader@659e0bfd
[junit4] 2> 2949853 INFO (TEST-TestAuthorizationFramework.authorizationFrameworkTest-seed#[52D7198F3F73812C]) [ ] o.a.s.c.SolrResourceLoader new SolrResourceLoader for directory: '/export/home/jenkins/workspace/Lucene-Solr-trunk-Solaris/solr/build/solr-core/test/J1/../../../../../../../../../../export/home/jenkins/workspace/Lucene-Solr-trunk-Solaris/solr/build/solr-core/test/J1/temp/solr.security.TestAuthorizationFramework_52D7198F3F73812C-001/control-001/'
[junit4] 2> 2949868 INFO (TEST-TestAuthorizationFramework.authorizationFrameworkTest-seed#[52D7198F3F73812C]) [ ] o.a.s.c.c.SolrZkClient Using default ZkCredentialsProvider
[junit4] 2> 2949868 INFO (TEST-TestAuthorizationFramework.authorizationFrameworkTest-seed#[52D7198F3F73812C]) [ ] o.a.s.c.c.ConnectionManager Waiting for client to connect to ZooKeeper
[junit4] 2> 2949870 INFO (zkCallback-2585-thread-1) [ ] o.a.s.c.c.ConnectionManager Watcher org.apache.solr.common.cloud.ConnectionManager@7ffe2960 name:ZooKeeperConnection Watcher:127.0.0.1:41361/solr got event WatchedEvent state:SyncConnected type:None path:null path:null type:None
[junit4] 2> 2949870 INFO (TEST-TestAuthorizationFramework.authorizationFrameworkTest-seed#[52D7198F3F73812C]) [ ] o.a.s.c.c.ConnectionManager Client is connected to ZooKeeper
[junit4] 2> 2949871 INFO (TEST-TestAuthorizationFramework.authorizationFrameworkTest-seed#[52D7198F3F73812C]) [ ] o.a.s.c.c.SolrZkClient Using default ZkACLProvider
[junit4] 2> 2949872 INFO (TEST-TestAuthorizationFramework.authorizationFrameworkTest-seed#[52D7198F3F73812C]) [ ] o.a.s.s.SolrDispatchFilter Loading solr.xml from SolrHome (not found in ZooKeeper)
[junit4] 2> 2949872 INFO (TEST-TestAuthorizationFramework.authorizationFrameworkTest-seed#[52D7198F3F73812C]) [ ] o.a.s.c.SolrXmlConfig Loading container configuration from /export/home/jenkins/workspace/Lucene-Solr-trunk-Solaris/solr/build/solr-core/test/J1/../../../../../../../../../../export/home/jenkins/workspace/Lucene-Solr-trunk-Solaris/solr/build/solr-core/test/J1/temp/solr.security.TestAuthorizationFramework_52D7198F3F73812C-001/control-001/solr.xml
[junit4] 2> 2949876 INFO (TEST-TestAuthorizationFramework.authorizationFrameworkTest-seed#[52D7198F3F73812C]) [ ] o.a.s.c.CoresLocator Config-defined core root directory: /export/home/jenkins/workspace/Lucene-Solr-trunk-Solaris/solr/build/solr-core/test/J1/../../../../../../../../../../export/home/jenkins/workspace/Lucene-Solr-trunk-Solaris/solr/build/solr-core/test/J1/temp/solr.security.TestAuthorizationFramework_52D7198F3F73812C-001/control-001/cores
[junit4] 2> 2949876 INFO (TEST-TestAuthorizationFramework.authorizationFrameworkTest-seed#[52D7198F3F73812C]) [ ] o.a.s.c.CoreContainer New CoreContainer 242157516
[junit4] 2> 2949876 INFO (TEST-TestAuthorizationFramework.authorizationFrameworkTest-seed#[52D7198F3F73812C]) [ ] o.a.s.c.CoreContainer Loading cores into CoreContainer [instanceDir=/export/home/jenkins/workspace/Lucene-Solr-trunk-Solaris/solr/build/solr-core/test/J1/../../../../../../../../../../export/home/jenkins/workspace/Lucene-Solr-trunk-Solaris/solr/build/solr-core/test/J1/temp/solr.security.TestAuthorizationFramework_52D7198F3F73812C-001/control-001/]
[junit4] 2> 2949876 INFO (TEST-TestAuthorizationFramework.authorizationFrameworkTest-seed#[52D7198F3F73812C]) [ ] o.a.s.c.CoreContainer loading shared library: /export/home/jenkins/workspace/Lucene-Solr-trunk-Solaris/solr/build/solr-core/test/J1/../../../../../../../../../../export/home/jenkins/workspace/Lucene-Solr-trunk-Solaris/solr/build/solr-core/test/J1/temp/solr.security.TestAuthorizationFramework_52D7198F3F73812C-001/control-001/lib
[junit4] 2> 2949876 WARN (TEST-TestAuthorizationFramework.authorizationFrameworkTest-seed#[52D7198F3F73812C]) [ ] o.a.s.c.SolrResourceLoader Can't find (or read) directory to add to classloader: lib (resolved as: /export/home/jenkins/workspace/Lucene-Solr-trunk-Solaris/solr/build/solr-core/test/J1/../../../../../../../../../../export/home/jenkins/workspace/Lucene-Solr-trunk-Solaris/solr/build/solr-core/test/J1/temp/solr.security.TestAuthorizationFramework_52D7198F3F73812C-001/control-001/lib).
[junit4] 2> 2949884 INFO (TEST-TestAuthorizationFramework.authorizationFrameworkTest-seed#[52D7198F3F73812C]) [ ] o.a.s.h.c.HttpShardHandlerFactory created with socketTimeout : 90000,urlScheme : ,connTimeout : 15000,maxConnectionsPerHost : 20,maxConnections : 10000,corePoolSize : 0,maximumPoolSize : 2147483647,maxThreadIdleTime : 5,sizeOfQueue : -1,fairnessPolicy : false,useRetries : false,
[junit4] 2> 2949884 INFO (TEST-TestAuthorizationFramework.authorizationFrameworkTest-seed#[52D7198F3F73812C]) [ ] o.a.s.u.UpdateShardHandler Creating UpdateShardHandler HTTP client with params: socketTimeout=340000&connTimeout=45000&retry=true
[junit4] 2> 2949885 INFO (TEST-TestAuthorizationFramework.authorizationFrameworkTest-seed#[52D7198F3F73812C]) [ ] o.a.s.l.LogWatcher SLF4J impl is org.slf4j.impl.Log4jLoggerFactory
[junit4] 2> 2949885 INFO (TEST-TestAuthorizationFramework.authorizationFrameworkTest-seed#[52D7198F3F73812C]) [ ] o.a.s.l.LogWatcher Registering Log Listener [Log4j (org.slf4j.impl.Log4jLoggerFactory)]
[junit4] 2> 2949885 INFO (TEST-TestAuthorizationFramework.authorizationFrameworkTest-seed#[52D7198F3F73812C]) [ ] o.a.s.c.ZkContainer Zookeeper client=127.0.0.1:41361/solr
[junit4] 2> 2949885 INFO (TEST-TestAuthorizationFramework.authorizationFrameworkTest-seed#[52D7198F3F73812C]) [ ] o.a.s.c.ZkController zkHost includes chroot
[junit4] 2> 2949885 INFO (TEST-TestAuthorizationFramework.authorizationFrameworkTest-seed#[52D7198F3F73812C]) [ ] o.a.s.c.c.SolrZkClient Using default ZkCredentialsProvider
[junit4] 2> 2949886 INFO (TEST-TestAuthorizationFramework.authorizationFrameworkTest-seed#[52D7198F3F73812C]) [ ] o.a.s.c.c.ConnectionManager Waiting for client to connect to ZooKeeper
[junit4] 2> 2949887 INFO (zkCallback-2587-thread-1) [ ] o.a.s.c.c.ConnectionManager Watcher org.apache.solr.common.cloud.ConnectionManager@19b879e5 name:ZooKeeperConnection Watcher:127.0.0.1:41361 got event WatchedEvent state:SyncConnected type:None path:null path:null type:None
[junit4] 2> 2949887 INFO (TEST-TestAuthorizationFramework.authorizationFrameworkTest-seed#[52D7198F3F73812C]) [ ] o.a.s.c.c.ConnectionManager Client is connected to ZooKeeper
[junit4] 2> 2949888 INFO (TEST-TestAuthorizationFramework.authorizationFrameworkTest-seed#[52D7198F3F73812C]) [ ] o.a.s.c.c.SolrZkClient Using default ZkACLProvider
[junit4] 2> 2949890 INFO (TEST-TestAuthorizationFramework.authorizationFrameworkTest-seed#[52D7198F3F73812C]) [n:127.0.0.1:55252_ ] o.a.s.c.c.ConnectionManager Waiting for client to connect to ZooKeeper
[junit4] 2> 2949891 INFO (zkCallback-2588-thread-1-processing-n:127.0.0.1:55252_) [n:127.0.0.1:55252_ ] o.a.s.c.c.ConnectionManager Watcher org.apache.solr.common.cloud.ConnectionManager@4317ae28 name:ZooKeeperConnection Watcher:127.0.0.1:41361/solr got event WatchedEvent state:SyncConnected type:None path:null path:null type:None
[junit4] 2> 2949892 INFO (TEST-TestAuthorizationFramework.authorizationFrameworkTest-seed#[52D7198F3F73812C]) [n:127.0.0.1:55252_ ] o.a.s.c.c.ConnectionManager Client is connected to ZooKeeper
[junit4] 2> 2949893 INFO (TEST-TestAuthorizationFramework.authorizationFrameworkTest-seed#[52D7198F3F73812C]) [n:127.0.0.1:55252_ ] o.a.s.c.c.SolrZkClient makePath: /overseer/queue
[junit4] 2> 2949896 INFO (TEST-TestAuthorizationFramework.authorizationFrameworkTest-seed#[52D7198F3F73812C]) [n:127.0.0.1:55252_ ] o.a.s.c.c.SolrZkClient makePath: /overseer/collection-queue-work
[junit4] 2> 2949900 INFO (TEST-TestAuthorizationFramework.authorizationFrameworkTest-seed#[52D7198F3F73812C]) [n:127.0.0.1:55252_ ] o.a.s.c.c.SolrZkClient makePath: /overseer/collection-map-running
[junit4] 2> 2949904 INFO (TEST-TestAuthorizationFramework.authorizationFrameworkTest-seed#[52D7198F3F73812C]) [n:127.0.0.1:55252_ ] o.a.s.c.c.SolrZkClient makePath: /overseer/collection-map-completed
[junit4] 2> 2949907 INFO (TEST-TestAuthorizationFramework.authorizationFrameworkTest-seed#[52D7198F3F73812C]) [n:127.0.0.1:55252_ ] o.a.s.c.c.SolrZkClient makePath: /overseer/collection-map-failure
[junit4] 2> 2949911 INFO (TEST-TestAuthorizationFramework.authorizationFrameworkTest-seed#[52D7198F3F73812C]) [n:127.0.0.1:55252_ ] o.a.s.c.c.SolrZkClient makePath: /live_nodes
[junit4] 2> 2949913 INFO (TEST-TestAuthorizationFramework.authorizationFrameworkTest-seed#[52D7198F3F73812C]) [n:127.0.0.1:55252_ ] o.a.s.c.c.SolrZkClient makePath: /aliases.json
[junit4] 2> 2949915 INFO (TEST-TestAuthorizationFramework.authorizationFrameworkTest-seed#[52D7198F3F73812C]) [n:127.0.0.1:55252_ ] o.a.s.c.c.SolrZkClient makePath: /clusterstate.json
[junit4] 2> 2949917 INFO (TEST-TestAuthorizationFramework.authorizationFrameworkTest-seed#[52D7198F3F73812C]) [n:127.0.0.1:55252_ ] o.a.s.c.ZkController Register node as live in ZooKeeper:/live_nodes/127.0.0.1:55252_
[junit4] 2> 2949918 INFO (TEST-TestAuthorizationFramework.authorizationFrameworkTest-seed#[52D7198F3F73812C]) [n:127.0.0.1:55252_ ] o.a.s.c.c.SolrZkClient makePath: /live_nodes/127.0.0.1:55252_
[junit4] 2> 2949920 INFO (TEST-TestAuthorizationFramework.authorizationFrameworkTest-seed#[52D7198F3F73812C]) [n:127.0.0.1:55252_ ] o.a.s.c.c.SolrZkClient makePath: /overseer_elect
[junit4] 2> 2949922 INFO (TEST-TestAuthorizationFramework.authorizationFrameworkTest-seed#[52D7198F3F73812C]) [n:127.0.0.1:55252_ ] o.a.s.c.c.SolrZkClient makePath: /overseer_elect/election
[junit4] 2> 2949924 INFO (TEST-TestAuthorizationFramework.authorizationFrameworkTest-seed#[52D7198F3F73812C]) [n:127.0.0.1:55252_ ] o.a.s.c.Overseer Overseer (id=null) closing
[junit4] 2> 2949925 INFO (TEST-TestAuthorizationFramework.authorizationFrameworkTest-seed#[52D7198F3F73812C]) [n:127.0.0.1:55252_ ] o.a.s.c.LeaderElector Joined leadership election with path: /overseer_elect/election/94599777381449733-127.0.0.1:55252_-n_0000000000
[junit4] 2> 2949925 INFO (TEST-TestAuthorizationFramework.authorizationFrameworkTest-seed#[52D7198F3F73812C]) [n:127.0.0.1:55252_ ] o.a.s.c.OverseerElectionContext I am going to be the leader 127.0.0.1:55252_
[junit4] 2> 2949925 INFO (TEST-TestAuthorizationFramework.authorizationFrameworkTest-seed#[52D7198F3F73812C]) [n:127.0.0.1:55252_ ] o.a.s.c.c.SolrZkClient makePath: /overseer_elect/leader
[junit4] 2> 2949927 INFO (TEST-TestAuthorizationFramework.authorizationFrameworkTest-seed#[52D7198F3F73812C]) [n:127.0.0.1:55252_ ] o.a.s.c.Overseer Overseer (id=94599777381449733-127.0.0.1:55252_-n_0000000000) starting
[junit4] 2> 2949930 INFO (TEST-TestAuthorizationFramework.authorizationFrameworkTest-seed#[52D7198F3F73812C]) [n:127.0.0.1:55252_ ] o.a.s.c.c.SolrZkClient makePath: /overseer/queue-work
[junit4] 2> 2949939 INFO (TEST-TestAuthorizationFramework.authorizationFrameworkTest-seed#[52D7198F3F73812C]) [n:127.0.0.1:55252_ ] o.a.s.c.OverseerAutoReplicaFailoverThread Starting OverseerAutoReplicaFailoverThread autoReplicaFailoverWorkLoopDelay=10000 autoReplicaFailoverWaitAfterExpiration=30000 autoReplicaFailoverBadNodeExpiration=60000
[junit4] 2> 2949939 INFO (TEST-TestAuthorizationFramework.authorizationFrameworkTest-seed#[52D7198F3F73812C]) [n:127.0.0.1:55252_ ] o.a.s.c.c.ZkStateReader Updating cluster state from ZooKeeper...
[junit4] 2> 2949939 INFO (OverseerCollectionConfigSetProcessor-94599777381449733-127.0.0.1:55252_-n_0000000000) [n:127.0.0.1:55252_ ] o.a.s.c.OverseerTaskProcessor Process current queue of overseer operations
[junit4] 2> 2949940 INFO (OverseerStateUpdate-94599777381449733-127.0.0.1:55252_-n_0000000000) [n:127.0.0.1:55252_ ] o.a.s.c.Overseer Starting to work on the main queue
[junit4] 2> 2949963 INFO (TEST-TestAuthorizationFramework.authorizationFrameworkTest-seed#[52D7198F3F73812C]) [n:127.0.0.1:55252_ ] o.a.s.c.CoreContainer Initializing authorization plugin: org.apache.solr.security.MockAuthorizationPlugin
[junit4] 2> 2949963 INFO (TEST-TestAuthorizationFramework.authorizationFrameworkTest-seed#[52D7198F3F73812C]) [n:127.0.0.1:55252_ ] o.a.s.c.CoreContainer No authentication plugin used.
[junit4] 2> 2949964 INFO (TEST-TestAuthorizationFramework.authorizationFrameworkTest-seed#[52D7198F3F73812C]) [n:127.0.0.1:55252_ ] o.a.s.c.CoresLocator Looking for core definitions underneath /export/home/jenkins/workspace/Lucene-Solr-trunk-Solaris/solr/build/solr-core/test/J1/../../../../../../../../../../export/home/jenkins/workspace/Lucene-Solr-trunk-Solaris/solr/build/solr-core/test/J1/temp/solr.security.TestAuthorizationFramework_52D7198F3F73812C-001/control-001/cores
[junit4] 2> 2949966 INFO (TEST-TestAuthorizationFramework.authorizationFrameworkTest-seed#[52D7198F3F73812C]) [n:127.0.0.1:55252_ ] o.a.s.c.SolrCore Created CoreDescriptor: {name=collection1, config=solrconfig.xml, transient=false, schema=schema.xml, loadOnStartup=true, configSetProperties=configsetprops.json, instanceDir=/export/home/jenkins/workspace/Lucene-Solr-trunk-Solaris/solr/build/solr-core/test/J1/../../../../../../../../../../export/home/jenkins/workspace/Lucene-Solr-trunk-Solaris/solr/build/solr-core/test/J1/temp/solr.security.TestAuthorizationFramework_52D7198F3F73812C-001/control-001/cores/collection1, collection=control_collection, absoluteInstDir=/export/home/jenkins/workspace/Lucene-Solr-trunk-Solaris/solr/build/solr-core/test/J1/../../../../../../../../../../export/home/jenkins/workspace/Lucene-Solr-trunk-Solaris/solr/build/solr-core/test/J1/temp/solr.security.TestAuthorizationFramework_52D7198F3F73812C-001/control-001/cores/collection1/, coreNodeName=, dataDir=data/, shard=}
[junit4] 2> 2949966 INFO (TEST-TestAuthorizationFramework.authorizationFrameworkTest-seed#[52D7198F3F73812C]) [n:127.0.0.1:55252_ ] o.a.s.c.CoresLocator Found core collection1 in /export/home/jenkins/workspace/Lucene-Solr-trunk-Solaris/solr/build/solr-core/test/J1/../../../../../../../../../../export/home/jenkins/workspace/Lucene-Solr-trunk-Solaris/solr/build/solr-core/test/J1/temp/solr.security.TestAuthorizationFramework_52D7198F3F73812C-001/control-001/cores/collection1/
[junit4] 2> 2949966 INFO (TEST-TestAuthorizationFramework.authorizationFrameworkTest-seed#[52D7198F3F73812C]) [n:127.0.0.1:55252_ ] o.a.s.c.CoresLocator Found 1 core definitions
[junit4] 2> 2949967 INFO (TEST-TestAuthorizationFramework.authorizationFrameworkTest-seed#[52D7198F3F73812C]) [n:127.0.0.1:55252_ ] o.a.s.s.SolrDispatchFilter user.dir=/export/home/jenkins/workspace/Lucene-Solr-trunk-Solaris/solr/build/solr-core/test/J1
[junit4] 2> 2949967 INFO (TEST-TestAuthorizationFramework.authorizationFrameworkTest-seed#[52D7198F3F73812C]) [n:127.0.0.1:55252_ ] o.a.s.s.SolrDispatchFilter SolrDispatchFilter.init() done
[junit4] 2> 2949968 INFO (coreLoadExecutor-9717-thread-1-processing-n:127.0.0.1:55252_) [n:127.0.0.1:55252_ c:control_collection x:collection1] o.a.s.c.ZkController publishing state=down
[junit4] 2> 2949968 INFO (coreLoadExecutor-9717-thread-1-processing-n:127.0.0.1:55252_) [n:127.0.0.1:55252_ c:control_collection x:collection1] o.a.s.c.ZkController numShards not found on descriptor - reading it from system property
[junit4] 2> 2949971 INFO (OverseerStateUpdate-94599777381449733-127.0.0.1:55252_-n_0000000000) [n:127.0.0.1:55252_ ] o.a.s.c.Overseer processMessage: queueSize: 1, message = {
[junit4] 2> "core":"collection1",
[junit4] 2> "roles":null,
[junit4] 2> "base_url":"http://127.0.0.1:55252",
[junit4] 2> "node_name":"127.0.0.1:55252_",
[junit4] 2> "numShards":"1",
[junit4] 2> "state":"down",
[junit4] 2> "shard":null,
[junit4] 2> "collection":"control_collection",
[junit4] 2> "operation":"state"} current state version: 0
[junit4] 2> 2949971 INFO (coreLoadExecutor-9717-thread-1-processing-n:127.0.0.1:55252_) [n:127.0.0.1:55252_ c:control_collection x:collection1] o.a.s.c.ZkController look for our core node name
[junit4] 2> 2949971 INFO (OverseerStateUpdate-94599777381449733-127.0.0.1:55252_-n_0000000000) [n:127.0.0.1:55252_ ] o.a.s.c.o.ReplicaMutator Update state numShards=1 message={
[junit4] 2> "core":"collection1",
[junit4] 2> "roles":null,
[junit4] 2> "base_url":"http://127.0.0.1:55252",
[junit4] 2> "node_name":"127.0.0.1:55252_",
[junit4] 2> "numShards":"1",
[junit4] 2> "state":"down",
[junit4] 2> "shard":null,
[junit4] 2> "collection":"control_collection",
[junit4] 2> "operation":"state"}
[junit4] 2> 2949972 INFO (OverseerStateUpdate-94599777381449733-127.0.0.1:55252_-n_0000000000) [n:127.0.0.1:55252_ ] o.a.s.c.o.ClusterStateMutator building a new cName: control_collection
[junit4] 2> 2949973 INFO (OverseerStateUpdate-94599777381449733-127.0.0.1:55252_-n_0000000000) [n:127.0.0.1:55252_ ] o.a.s.c.o.ReplicaMutator Assigning new node to shard shard=shard1
[junit4] 2> 2949975 INFO (zkCallback-2588-thread-1-processing-n:127.0.0.1:55252_) [n:127.0.0.1:55252_ ] o.a.s.c.c.ZkStateReader A cluster state change: WatchedEvent state:SyncConnected type:NodeDataChanged path:/clusterstate.json, has occurred - updating... (live nodes size: 1)
[junit4] 2> 2950973 INFO (coreLoadExecutor-9717-thread-1-processing-n:127.0.0.1:55252_) [n:127.0.0.1:55252_ c:control_collection x:collection1] o.a.s.c.ZkController waiting to find shard id in clusterstate for collection1
[junit4] 2> 2950974 INFO (coreLoadExecutor-9717-thread-1-processing-n:127.0.0.1:55252_) [n:127.0.0.1:55252_ c:control_collection x:collection1] o.a.s.c.ZkController Check for collection zkNode:control_collection
[junit4] 2> 2950974 INFO (coreLoadExecutor-9717-thread-1-processing-n:127.0.0.1:55252_) [n:127.0.0.1:55252_ c:control_collection x:collection1] o.a.s.c.ZkController Collection zkNode exists
[junit4] 2> 2950974 INFO (coreLoadExecutor-9717-thread-1-processing-n:127.0.0.1:55252_) [n:127.0.0.1:55252_ c:control_collection x:collection1] o.a.s.c.c.ZkStateReader Load collection config from:/collections/control_collection
[junit4] 2> 2950975 INFO (coreLoadExecutor-9717-thread-1-processing-n:127.0.0.1:55252_) [n:127.0.0.1:55252_ c:control_collection x:collection1] o.a.s.c.c.ZkStateReader path=/collections/control_collection configName=conf1 specified config exists in ZooKeeper
[junit4] 2> 2950975 INFO (coreLoadExecutor-9717-thread-1-processing-n:127.0.0.1:55252_) [n:127.0.0.1:55252_ c:control_collection x:collection1] o.a.s.c.SolrResourceLoader new SolrResourceLoader for directory: '/export/home/jenkins/workspace/Lucene-Solr-trunk-Solaris/solr/build/solr-core/test/J1/../../../../../../../../../../export/home/jenkins/workspace/Lucene-Solr-trunk-Solaris/solr/build/solr-core/test/J1/temp/solr.security.TestAuthorizationFramework_52D7198F3F73812C-001/control-001/cores/collection1/'
[junit4] 2> 2950989 INFO (coreLoadExecutor-9717-thread-1-processing-n:127.0.0.1:55252_) [n:127.0.0.1:55252_ c:control_collection x:collection1] o.a.s.c.Config loaded config solrconfig.xml with version 0
[junit4] 2> 2950993 INFO (coreLoadExecutor-9717-thread-1-processing-n:127.0.0.1:55252_) [n:127.0.0.1:55252_ c:control_collection x:collection1] o.a.s.c.SolrConfig current version of requestparams : -1
[junit4] 2> 2950995 INFO (coreLoadExecutor-9717-thread-1-processing-n:127.0.0.1:55252_) [n:127.0.0.1:55252_ c:control_collection x:collection1] o.a.s.c.SolrConfig Using Lucene MatchVersion: 6.0.0
[junit4] 2> 2951017 INFO (coreLoadExecutor-9717-thread-1-processing-n:127.0.0.1:55252_) [n:127.0.0.1:55252_ c:control_collection x:collection1] o.a.s.c.Config Loaded SolrConfig: solrconfig.xml
[junit4] 2> 2951018 INFO (coreLoadExecutor-9717-thread-1-processing-n:127.0.0.1:55252_) [n:127.0.0.1:55252_ c:control_collection x:collection1] o.a.s.s.IndexSchema Reading Solr Schema from /configs/conf1/schema.xml
[junit4] 2> 2951023 INFO (coreLoadExecutor-9717-thread-1-processing-n:127.0.0.1:55252_) [n:127.0.0.1:55252_ c:control_collection x:collection1] o.a.s.s.IndexSchema [collection1] Schema name=test
[junit4] 2> 2951072 INFO (coreLoadExecutor-9717-thread-1-processing-n:127.0.0.1:55252_) [n:127.0.0.1:55252_ c:control_collection x:collection1] o.a.s.s.OpenExchangeRatesOrgProvider Initialized with rates=open-exchange-rates.json, refreshInterval=1440.
[junit4] 2> 2951076 INFO (coreLoadExecutor-9717-thread-1-processing-n:127.0.0.1:55252_) [n:127.0.0.1:55252_ c:control_collection x:collection1] o.a.s.s.IndexSchema default search field in schema is text
[junit4] 2> 2951077 INFO (coreLoadExecutor-9717-thread-1-processing-n:127.0.0.1:55252_) [n:127.0.0.1:55252_ c:control_collection x:collection1] o.a.s.s.IndexSchema unique key field: id
[junit4] 2> 2951088 INFO (coreLoadExecutor-9717-thread-1-processing-n:127.0.0.1:55252_) [n:127.0.0.1:55252_ c:control_collection x:collection1] o.a.s.s.FileExchangeRateProvider Reloading exchange rates from file currency.xml
[junit4] 2> 2951101 INFO (coreLoadExecutor-9717-thread-1-processing-n:127.0.0.1:55252_) [n:127.0.0.1:55252_ c:control_collection x:collection1] o.a.s.s.FileExchangeRateProvider Reloading exchange rates from file currency.xml
[junit4] 2> 2951103 INFO (coreLoadExecutor-9717-thread-1-processing-n:127.0.0.1:55252_) [n:127.0.0.1:55252_ c:control_collection x:collection1] o.a.s.s.OpenExchangeRatesOrgProvider Reloading exchange rates from open-exchange-rates.json
[junit4] 2> 2951104 WARN (coreLoadExecutor-9717-thread-1-processing-n:127.0.0.1:55252_) [n:127.0.0.1:55252_ c:control_collection x:collection1] o.a.s.s.OpenExchangeRatesOrgProvider Unknown key IMPORTANT NOTE
[junit4] 2> 2951104 WARN (coreLoadExecutor-9717-thread-1-processing-n:127.0.0.1:55252_) [n:127.0.0.1:55252_ c:control_collection x:collection1] o.a.s.s.OpenExchangeRatesOrgProvider Expected key, got STRING
[junit4] 2> 2951105 INFO (coreLoadExecutor-9717-thread-1-processing-n:127.0.0.1:55252_) [n:127.0.0.1:55252_ c:control_collection x:collection1] o.a.s.s.OpenExchangeRatesOrgProvider Reloading exchange rates from open-exchange-rates.json
[junit4] 2> 2951106 WARN (coreLoadExecutor-9717-thread-1-processing-n:127.0.0.1:55252_) [n:127.0.0.1:55252_ c:control_collection x:collection1] o.a.s.s.OpenExchangeRatesOrgProvider Unknown key IMPORTANT NOTE
[junit4] 2> 2951106 WARN (coreLoadExecutor-9717-thread-1-processing-n:127.0.0.1:55252_) [n:127.0.0.1:55252_ c:control_collection x:collection1] o.a.s.s.OpenExchangeRatesOrgProvider Expected key, got STRING
[junit4] 2> 2951107 INFO (coreLoadExecutor-9717-thread-1-processing-n:127.0.0.1:55252_) [n:127.0.0.1:55252_ c:control_collection x:collection1] o.a.s.c.ConfigSetProperties Did not find ConfigSet properties, assuming default properties: Can't find resource 'configsetprops.json' in classpath or '/configs/conf1', cwd=/export/home/jenkins/workspace/Lucene-Solr-trunk-Solaris/solr/build/solr-core/test/J1
[junit4] 2> 2951107 INFO (coreLoadExecutor-9717-thread-1-processing-n:127.0.0.1:55252_) [n:127.0.0.1:55252_ c:control_collection x:collection1] o.a.s.c.CoreContainer Creating SolrCore 'collection1' using configuration from collection control_collection
[junit4] 2> 2951108 INFO (coreLoadExecutor-9717-thread-1-processing-n:127.0.0.1:55252_) [n:127.0.0.1:55252_ c:control_collection s:shard1 r:core_node1 x:collection1] o.a.s.c.SolrCore org.apache.solr.core.MockDirectoryFactory
[junit4] 2> 2951108 INFO (coreLoadExecutor-9717-thread-1-processing-n:127.0.0.1:55252_) [n:127.0.0.1:55252_ c:control_collection s:shard1 r:core_node1 x:collection1] o.a.s.c.SolrCore [[collection1] ] Opening new SolrCore at [/export/home/jenkins/workspace/Lucene-Solr-trunk-Solaris/solr/build/solr-core/test/J1/../../../../../../../../../../export/home/jenkins/workspace/Lucene-Solr-trunk-Solaris/solr/build/solr-core/test/J1/temp/solr.security.TestAuthorizationFramework_52D7198F3F73812C-001/control-001/cores/collection1/], dataDir=[null]
[junit4] 2> 2951108 INFO (coreLoadExecutor-9717-thread-1-processing-n:127.0.0.1:55252_) [n:127.0.0.1:55252_ c:control_collection s:shard1 r:core_node1 x:collection1] o.a.s.c.JmxMonitoredMap JMX monitoring is enabled. Adding Solr mbeans to JMX Server: com.sun.jmx.mbeanserver.JmxMBeanServer@21ee9efa
[junit4] 2> 2951108 INFO (coreLoadExecutor-9717-thread-1-processing-n:127.0.0.1:55252_) [n:127.0.0.1:55252_ c:control_collection s:shard1 r:core_node1 x:collection1] o.a.s.c.CachingDirectoryFactory return new directory for /export/home/jenkins/workspace/Lucene-Solr-trunk-Solaris/solr/build/solr-core/test/J1/../../../../../../../../../../export/home/jenkins/workspace/Lucene-Solr-trunk-Solaris/solr/build/solr-core/test/J1/temp/solr.security.TestAuthorizationFramework_52D7198F3F73812C-001/control-001/cores/collection1/data
[junit4] 2> 2951108 INFO (coreLoadExecutor-9717-thread-1-processing-n:127.0.0.1:55252_) [n:127.0.0.1:55252_ c:control_collection s:shard1 r:core_node1 x:collection1] o.a.s.c.SolrCore New index directory detected: old=null new=/export/home/jenkins/workspace/Lucene-Solr-trunk-Solaris/solr/build/solr-core/test/J1/../../../../../../../../../../export/home/jenkins/workspace/Lucene-Solr-trunk-Solaris/solr/build/solr-core/test/J1/temp/solr.security.TestAuthorizationFramework_52D7198F3F73812C-001/control-001/cores/collection1/data/index/
[junit4] 2> 2951108 WARN (coreLoadExecutor-9717-thread-1-processing-n:127.0.0.1:55252_) [n:127.0.0.1:55252_ c:control_collection s:shard1 r:core_node1 x:collection1] o.a.s.c.SolrCore [collection1] Solr index directory '/export/home/jenkins/workspace/Lucene-Solr-trunk-Solaris/solr/build/solr-core/test/J1/../../../../../../../../../../export/home/jenkins/workspace/Lucene-Solr-trunk-Solaris/solr/build/solr-core/test/J1/temp/solr.security.TestAuthorizationFramework_52D7198F3F73812C-001/control-001/cores/collection1/data/index' doesn't exist. Creating new index...
[junit4] 2> 2951109 INFO (coreLoadExecutor-9717-thread-1-processing-n:127.0.0.1:55252_) [n:127.0.0.1:55252_ c:control_collection s:shard1 r:core_node1 x:collection1] o.a.s.c.CachingDirectoryFactory return new directory for /export/home/jenkins/workspace/Lucene-Solr-trunk-Solaris/solr/build/solr-core/test/J1/../../../../../../../../../../export/home/jenkins/workspace/Lucene-Solr-trunk-Solaris/solr/build/solr-core/test/J1/temp/solr.security.TestAuthorizationFramework_52D7198F3F73812C-001/control-001/cores/collection1/data/index
[junit4] 2> 2951109 INFO (coreLoadExecutor-9717-thread-1-processing-n:127.0.0.1:55252_) [n:127.0.0.1:55252_ c:control_collection s:shard1 r:core_node1 x:collection1] o.a.s.u.RandomMergePolicy RandomMergePolicy wrapping class org.apache.lucene.index.AlcoholicMergePolicy: [AlcoholicMergePolicy: minMergeSize=0, mergeFactor=10, maxMergeSize=1455763964, maxMergeSizeForForcedMerge=9223372036854775807, calibrateSizeByDeletes=true, maxMergeDocs=2147483647, maxCFSSegmentSizeMB=8.796093022207999E12, noCFSRatio=0.1]
[junit4] 2> 2951109 INFO (coreLoadExecutor-9717-thread-1-processing-n:127.0.0.1:55252_) [n:127.0.0.1:55252_ c:control_collection s:shard1 r:core_node1 x:collection1] o.a.s.c.SolrCore SolrDeletionPolicy.onCommit: commits: num=1
[junit4] 2> commit{dir=MockDirectoryWrapper(RAMDirectory@12c157ae lockFactory=org.apache.lucene.store.SingleInstanceLockFactory@11ec865d),segFN=segments_1,generation=1}
[junit4] 2> 2951109 INFO (coreLoadExecutor-9717-thread-1-processing-n:127.0.0.1:55252_) [n:127.0.0.1:55252_ c:control_collection s:shard1 r:core_node1 x:collection1] o.a.s.c.SolrCore newest commit generation = 1
[junit4] 2> 2951110 INFO (OldIndexDirectoryCleanupThreadForCore-collection1) [n:127.0.0.1:55252_ c:control_collection s:shard1 r:core_node1 x:collection1] o.a.s.c.SolrCore Looking for old index directories to cleanup for core collection1 in /export/home/jenkins/workspace/Lucene-Solr-trunk-Solaris/solr/build/solr-core/test/J1/../../../../../../../../../../export/home/jenkins/workspace/Lucene-Solr-trunk-Solaris/solr/build/solr-core/test/J1/temp/solr.security.TestAuthorizationFramework_52D7198F3F73812C-001/control-001/cores/collection1/data/
[junit4] 2> 2951110 WARN (OldIndexDirectoryCleanupThreadForCore-collection1) [n:127.0.0.1:55252_ c:control_collection s:shard1 r:core_node1 x:collection1] o.a.s.c.DirectoryFactory /export/home/jenkins/workspace/Lucene-Solr-trunk-Solaris/solr/build/solr-core/test/J1/../../../../../../../../../../export/home/jenkins/workspace/Lucene-Solr-trunk-Solaris/solr/build/solr-core/test/J1/temp/solr.security.TestAuthorizationFramework_52D7198F3F73812C-001/control-001/cores/collection1/data/ does not point to a valid data directory; skipping clean-up of old index directories.
[junit4] 2> 2951112 INFO (coreLoadExecutor-9717-thread-1-processing-n:127.0.0.1:55252_) [n:127.0.0.1:55252_ c:control_collection s:shard1 r:core_node1 x:collection1] o.a.s.u.p.UpdateRequestProcessorChain creating updateRequestProcessorChain "nodistrib"
[junit4] 2> 2951112 INFO (coreLoadExecutor-9717-thread-1-processing-n:127.0.0.1:55252_) [n:127.0.0.1:55252_ c:control_collection s:shard1 r:core_node1 x:collection1] o.a.s.u.p.UpdateRequestProcessorChain creating updateRequestProcessorChain "dedupe"
[junit4] 2> 2951112 INFO (coreLoadExecutor-9717-thread-1-processing-n:127.0.0.1:55252_) [n:127.0.0.1:55252_ c:control_collection s:shard1 r:core_node1 x:collection1] o.a.s.u.p.UpdateRequestProcessorChain inserting DistributedUpdateProcessorFactory into updateRequestProcessorChain "dedupe"
[junit4] 2> 2951113 INFO (coreLoadExecutor-9717-thread-1-processing-n:127.0.0.1:55252_) [n:127.0.0.1:55252_ c:control_collection s:shard1 r:core_node1 x:collection1] o.a.s.u.p.UpdateRequestProcessorChain creating updateRequestProcessorChain "stored_sig"
[junit4] 2> 2951113 INFO (coreLoadExecutor-9717-thread-1-processing-n:127.0.0.1:55252_) [n:127.0.0.1:55252_ c:control_collection s:shard1 r:core_node1 x:collection1] o.a.s.u.p.UpdateRequestProcessorChain inserting DistributedUpdateProcessorFactory into updateRequestProcessorChain "stored_sig"
[junit4] 2> 2951113 INFO (coreLoadExecutor-9717-thread-1-processing-n:127.0.0.1:55252_) [n:127.0.0.1:55252_ c:control_collection s:shard1 r:core_node1 x:collection1] o.a.s.u.p.UpdateRequestProcessorChain creating updateRequestProcessorChain "distrib-dup-test-chain-explicit"
[junit4] 2> 2951113 INFO (coreLoadExecutor-9717-thread-1-processing-n:127.0.0.1:55252_) [n:127.0.0.1:55252_ c:control_collection s:shard1 r:core_node1 x:collection1] o.a.s.u.p.UpdateRequestProcessorChain creating updateRequestProcessorChain "distrib-dup-test-chain-implicit"
[junit4] 2> 2951113 INFO (coreLoadExecutor-9717-thread-1-processing-n:127.0.0.1:55252_) [n:127.0.0.1:55252_ c:control_collection s:shard1 r:core_node1 x:collection1] o.a.s.u.p.UpdateRequestProcessorChain inserting DistributedUpdateProcessorFactory into updateRequestProcessorChain "distrib-dup-test-chain-implicit"
[junit4] 2> 2951113 INFO (coreLoadExecutor-9717-thread-1-processing-n:127.0.0.1:55252_) [n:127.0.0.1:55252_ c:control_collection s:shard1 r:core_node1 x:collection1] o.a.s.c.SolrCore no updateRequestProcessorChain defined as default, creating implicit default
[junit4] 2> 2951115 INFO (coreLoadExecutor-9717-thread-1-processing-n:127.0.0.1:55252_) [n:127.0.0.1:55252_ c:control_collection s:shard1 r:core_node1 x:collection1] o.a.s.h.l.XMLLoader xsltCacheLifetimeSeconds=60
[junit4] 2> 2951115 INFO (coreLoadExecutor-9717-thread-1-processing-n:127.0.0.1:55252_) [n:127.0.0.1:55252_ c:control_collection s:shard1 r:core_node1 x:collection1] o.a.s.h.l.XMLLoader xsltCacheLifetimeSeconds=60
[junit4] 2> 2951116 INFO (coreLoadExecutor-9717-thread-1-processing-n:127.0.0.1:55252_) [n:127.0.0.1:55252_ c:control_collection s:shard1 r:core_node1 x:collection1] o.a.s.h.l.XMLLoader xsltCacheLifetimeSeconds=60
[junit4] 2> 2951118 INFO (coreLoadExecutor-9717-thread-1-processing-n:127.0.0.1:55252_) [n:127.0.0.1:55252_ c:control_collection s:shard1 r:core_node1 x:collection1] o.a.s.h.l.XMLLoader xsltCacheLifetimeSeconds=60
[junit4] 2> 2951121 INFO (coreLoadExecutor-9717-thread-1-processing-n:127.0.0.1:55252_) [n:127.0.0.1:55252_ c:control_collection s:shard1 r:core_node1 x:collection1] o.a.s.c.RequestHandlers Registered paths: /admin/mbeans,standard,/update/csv,/update/json/docs,/admin/luke,/admin/segments,/get,/admin/system,/replication,/admin/properties,/config,/schema,/admin/plugins,/admin/logging,/update/json,/admin/threads,/admin/ping,/update,/admin/file
[junit4] 2> 2951121 INFO (coreLoadExecutor-9717-thread-1-processing-n:127.0.0.1:55252_) [n:127.0.0.1:55252_ c:control_collection s:shard1 r:core_node1 x:collection1] o.a.s.c.SolrCore Using default statsCache cache: org.apache.solr.search.stats.LocalStatsCache
[junit4] 2> 2951122 INFO (coreLoadExecutor-9717-thread-1-processing-n:127.0.0.1:55252_) [n:127.0.0.1:55252_ c:control_collection s:shard1 r:core_node1 x:collection1] o.a.s.u.UpdateHandler Using UpdateLog implementation: org.apache.solr.update.UpdateLog
[junit4] 2> 2951122 INFO (coreLoadExecutor-9717-thread-1-processing-n:127.0.0.1:55252_) [n:127.0.0.1:55252_ c:control_collection s:shard1 r:core_node1 x:collection1] o.a.s.u.UpdateLog Initializing UpdateLog: dataDir= defaultSyncLevel=FLUSH numRecordsToKeep=100 maxNumLogsToKeep=10 numVersionBuckets=65536
[junit4] 2> 2951123 INFO (coreLoadExecutor-9717-thread-1-processing-n:127.0.0.1:55252_) [n:127.0.0.1:55252_ c:control_collection s:shard1 r:core_node1 x:collection1] o.a.s.c.SolrCore Hard AutoCommit: disabled
[junit4] 2> 2951123 INFO (coreLoadExecutor-9717-thread-1-processing-n:127.0.0.1:55252_) [n:127.0.0.1:55252_ c:control_collection s:shard1 r:core_node1 x:collection1] o.a.s.c.SolrCore Soft AutoCommit: disabled
[junit4] 2> 2951123 INFO (coreLoadExecutor-9717-thread-1-processing-n:127.0.0.1:55252_) [n:127.0.0.1:55252_ c:control_collection s:shard1 r:core_node1 x:collection1] o.a.s.u.RandomMergePolicy RandomMergePolicy wrapping class org.apache.lucene.index.LogDocMergePolicy: [LogDocMergePolicy: minMergeSize=1000, mergeFactor=48, maxMergeSize=9223372036854775807, maxMergeSizeForForcedMerge=9223372036854775807, calibrateSizeByDeletes=false, maxMergeDocs=2147483647, maxCFSSegmentSizeMB=8.796093022207999E12, noCFSRatio=0.811018023906881]
[junit4] 2> 2951123 INFO (coreLoadExecutor-9717-thread-1-processing-n:127.0.0.1:55252_) [n:127.0.0.1:55252_ c:control_collection s:shard1 r:core_node1 x:collection1] o.a.s.c.SolrCore SolrDeletionPolicy.onInit: commits: num=1
[junit4] 2> commit{dir=MockDirectoryWrapper(RAMDirectory@12c157ae lockFactory=org.apache.lucene.store.SingleInstanceLockFactory@11ec865d),segFN=segments_1,generation=1}
[junit4] 2> 2951123 INFO (coreLoadExecutor-9717-thread-1-processing-n:127.0.0.1:55252_) [n:127.0.0.1:55252_ c:control_collection s:shard1 r:core_node1 x:collection1] o.a.s.c.SolrCore newest commit generation = 1
[junit4] 2> 2951123 INFO (coreLoadExecutor-9717-thread-1-processing-n:127.0.0.1:55252_) [n:127.0.0.1:55252_ c:control_collection s:shard1 r:core_node1 x:collection1] o.a.s.s.SolrIndexSearcher Opening Searcher@28e521ae[collection1] main
[junit4] 2> 2951123 INFO (coreLoadExecutor-9717-thread-1-processing-n:127.0.0.1:55252_) [n:127.0.0.1:55252_ c:control_collection s:shard1 r:core_node1 x:collection1] o.a.s.c.c.ZkStateReader Load collection config from:/collections/control_collection
[junit4] 2> 2951125 INFO (coreLoadExecutor-9717-thread-1-processing-n:127.0.0.1:55252_) [n:127.0.0.1:55252_ c:control_collection s:shard1 r:core_node1 x:collection1] o.a.s.c.c.ZkStateReader path=/collections/control_collection configName=conf1 specified config exists in ZooKeeper
[junit4] 2> 2951125 INFO (coreLoadExecutor-9717-thread-1-processing-n:127.0.0.1:55252_) [n:127.0.0.1:55252_ c:control_collection s:shard1 r:core_node1 x:collection1] o.a.s.r.ManagedResourceStorage Setting up ZooKeeper-based storage for the RestManager with znodeBase: /configs/conf1
[junit4] 2> 2951125 INFO (coreLoadExecutor-9717-thread-1-processing-n:127.0.0.1:55252_) [n:127.0.0.1:55252_ c:control_collection s:shard1 r:core_node1 x:collection1] o.a.s.r.ManagedResourceStorage Configured ZooKeeperStorageIO with znodeBase: /configs/conf1
[junit4] 2> 2951125 INFO (coreLoadExecutor-9717-thread-1-processing-n:127.0.0.1:55252_) [n:127.0.0.1:55252_ c:control_collection s:shard1 r:core_node1 x:collection1] o.a.s.r.RestManager Initializing RestManager with initArgs: {}
[junit4] 2> 2951125 INFO (coreLoadExecutor-9717-thread-1-processing-n:127.0.0.1:55252_) [n:127.0.0.1:55252_ c:control_collection s:shard1 r:core_node1 x:collection1] o.a.s.r.ManagedResourceStorage Reading _rest_managed.json using ZooKeeperStorageIO:path=/configs/conf1
[junit4] 2> 2951126 INFO (coreLoadExecutor-9717-thread-1-processing-n:127.0.0.1:55252_) [n:127.0.0.1:55252_ c:control_collection s:shard1 r:core_node1 x:collection1] o.a.s.r.ManagedResourceStorage No data found for znode /configs/conf1/_rest_managed.json
[junit4] 2> 2951126 INFO (coreLoadExecutor-9717-thread-1-processing-n:127.0.0.1:55252_) [n:127.0.0.1:55252_ c:control_collection s:shard1 r:core_node1 x:collection1] o.a.s.r.ManagedResourceStorage Loaded null at path _rest_managed.json using ZooKeeperStorageIO:path=/configs/conf1
[junit4] 2> 2951126 INFO (coreLoadExecutor-9717-thread-1-processing-n:127.0.0.1:55252_) [n:127.0.0.1:55252_ c:control_collection s:shard1 r:core_node1 x:collection1] o.a.s.r.RestManager Initializing 0 registered ManagedResources
[junit4] 2> 2951126 INFO (coreLoadExecutor-9717-thread-1-processing-n:127.0.0.1:55252_) [n:127.0.0.1:55252_ c:control_collection s:shard1 r:core_node1 x:collection1] o.a.s.h.ReplicationHandler Commits will be reserved for 10000
[junit4] 2> 2951127 INFO (searcherExecutor-9718-thread-1-processing-n:127.0.0.1:55252_ x:collection1 s:shard1 c:control_collection r:core_node1) [n:127.0.0.1:55252_ c:control_collection s:shard1 r:core_node1 x:collection1] o.a.s.c.SolrCore [collection1] Registered new searcher Searcher@28e521ae[collection1] main{ExitableDirectoryReader(UninvertingDirectoryReader())}
[junit4] 2> 2951127 INFO (coreLoadExecutor-9717-thread-1-processing-n:127.0.0.1:55252_) [n:127.0.0.1:55252_ c:control_collection s:shard1 r:core_node1 x:collection1] o.a.s.u.UpdateLog Looking up max value of version field to seed version buckets
[junit4] 2> 2951127 INFO (coreLoadExecutor-9717-thread-1-processing-n:127.0.0.1:55252_) [n:127.0.0.1:55252_ c:control_collection s:shard1 r:core_node1 x:collection1] o.a.s.u.VersionInfo Refreshing highest value of _version_ for 65536 version buckets from index
[junit4] 2> 2951127 INFO (coreLoadExecutor-9717-thread-1-processing-n:127.0.0.1:55252_) [n:127.0.0.1:55252_ c:control_collection s:shard1 r:core_node1 x:collection1] o.a.s.u.VersionInfo No terms found for _version_, cannot seed version bucket highest value from index
[junit4] 2> 2951127 INFO (coreLoadExecutor-9717-thread-1-processing-n:127.0.0.1:55252_) [n:127.0.0.1:55252_ c:control_collection s:shard1 r:core_node1 x:collection1] o.a.s.u.UpdateLog Could not find max version in index or recent updates, using new clock 1513596439830200320
[junit4] 2> 2951129 INFO (coreLoadExecutor-9717-thread-1-processing-n:127.0.0.1:55252_) [n:127.0.0.1:55252_ c:control_collection s:shard1 r:core_node1 x:collection1] o.a.s.u.UpdateLog Took 1.0ms to seed version buckets with highest version 1513596439830200320
[junit4] 2> 2951129 INFO (coreLoadExecutor-9717-thread-1-processing-n:127.0.0.1:55252_) [n:127.0.0.1:55252_ c:control_collection s:shard1 r:core_node1 x:collection1] o.a.s.c.ZkController watch zkdir /configs/conf1
[junit4] 2> 2951129 INFO (coreLoadExecutor-9717-thread-1-processing-n:127.0.0.1:55252_) [n:127.0.0.1:55252_ c:control_collection s:shard1 r:core_node1 x:collection1] o.a.s.c.CoreContainer registering core: collection1
[junit4] 2> 2951130 INFO (coreZkRegister-9711-thread-1-processing-n:127.0.0.1:55252_ x:collection1 s:shard1 c:control_collection r:core_node1) [n:127.0.0.1:55252_ c:control_collection s:shard1 r:core_node1 x:collection1] o.a.s.c.ZkController Register replica - core:collection1 address:http://127.0.0.1:55252 collection:control_collection shard:shard1
[junit4] 2> 2951131 INFO (coreZkRegister-9711-thread-1-processing-n:127.0.0.1:55252_ x:collection1 s:shard1 c:control_collection r:core_node1) [n:127.0.0.1:55252_ c:control_collection s:shard1 r:core_node1 x:collection1] o.a.s.c.c.SolrZkClient makePath: /collections/control_collection/leader_elect/shard1/election
[junit4] 2> 2951136 INFO (coreZkRegister-9711-thread-1-processing-n:127.0.0.1:55252_ x:collection1 s:shard1 c:control_collection r:core_node1) [n:127.0.0.1:55252_ c:control_collection s:shard1 r:core_node1 x:collection1] o.a.s.c.LeaderElector Joined leadership election with path: /collections/control_collection/leader_elect/shard1/election/94599777381449733-core_node1-n_0000000000
[junit4] 2> 2951137 INFO (coreZkRegister-9711-thread-1-processing-n:127.0.0.1:55252_ x:collection1 s:shard1 c:control_collection r:core_node1) [n:127.0.0.1:55252_ c:control_collection s:shard1 r:core_node1 x:collection1] o.a.s.c.ShardLeaderElectionContext Running the leader process for shard shard1
[junit4] 2> 2951139 INFO (coreZkRegister-9711-thread-1-processing-n:127.0.0.1:55252_ x:collection1 s:shard1 c:control_collection r:core_node1) [n:127.0.0.1:55252_ c:control_collection s:shard1 r:core_node1 x:collection1] o.a.s.c.ShardLeaderElectionContext Enough replicas found to continue.
[junit4] 2> 2951139 INFO (coreZkRegister-9711-thread-1-processing-n:127.0.0.1:55252_ x:collection1 s:shard1 c:control_collection r:core_node1) [n:127.0.0.1:55252_ c:control_collection s:shard1 r:core_node1 x:collection1] o.a.s.c.ShardLeaderElectionContext I may be the new leader - try and sync
[junit4] 2> 2951139 INFO (coreZkRegister-9711-thread-1-processing-n:127.0.0.1:55252_ x:collection1 s:shard1 c:control_collection r:core_node1) [n:127.0.0.1:55252_ c:control_collection s:shard1 r:core_node1 x:collection1] o.a.s.c.SyncStrategy Sync replicas to http://127.0.0.1:55252/collection1/
[junit4] 2> 2951140 INFO (coreZkRegister-9711-thread-1-processing-n:127.0.0.1:55252_ x:collection1 s:shard1 c:control_collection r:core_node1) [n:127.0.0.1:55252_ c:control_collection s:shard1 r:core_node1 x:collection1] o.a.s.c.SyncStrategy Sync Success - now sync replicas to me
[junit4] 2> 2951140 INFO (coreZkRegister-9711-thread-1-processing-n:127.0.0.1:55252_ x:collection1 s:shard1 c:control_collection r:core_node1) [n:127.0.0.1:55252_ c:control_collection s:shard1 r:core_node1 x:collection1] o.a.s.c.SyncStrategy http://127.0.0.1:55252/collection1/ has no replicas
[junit4] 2> 2951140 INFO (coreZkRegister-9711-thread-1-processing-n:127.0.0.1:55252_ x:collection1 s:shard1 c:control_collection r:core_node1) [n:127.0.0.1:55252_ c:control_collection s:shard1 r:core_node1 x:collection1] o.a.s.c.ShardLeaderElectionContext I am the new leader: http://127.0.0.1:55252/collection1/ shard1
[junit4] 2> 2951140 INFO (OverseerStateUpdate-94599777381449733-127.0.0.1:55252_-n_0000000000) [n:127.0.0.1:55252_ ] o.a.s.c.Overseer processMessage: queueSize: 1, message = {
[junit4] 2> "operation":"leader",
[junit4] 2> "shard":"shard1",
[junit4] 2> "collection":"control_collection"} current state version: 1
[junit4] 2> 2951141 INFO (coreZkRegister-9711-thread-1-processing-n:127.0.0.1:55252_ x:collection1 s:shard1 c:control_collection r:core_node1) [n:127.0.0.1:55252_ c:control_collection s:shard1 r:core_node1 x:collection1] o.a.s.c.c.SolrZkClient makePath: /collections/control_collection/leaders/shard1
[junit4] 2> 2951145 INFO (coreZkRegister-9711-thread-1-processing-n:127.0.0.1:55252_ x:collection1 s:shard1 c:control_collection r:core_node1) [n:127.0.0.1:55252_ c:control_collection s:shard1 r:core_node1 x:collection1] o.a.s.c.ShardLeaderElectionContextBase Creating leader registration node
[junit4] 2> 2951148 INFO (OverseerStateUpdate-94599777381449733-127.0.0.1:55252_-n_0000000000) [n:127.0.0.1:55252_ ] o.a.s.c.Overseer processMessage: queueSize: 1, message = {
[junit4] 2> "operation":"leader",
[junit4] 2> "shard":"shard1",
[junit4] 2> "collection":"control_collection",
[junit4] 2> "base_url":"http://127.0.0.1:55252",
[junit4] 2> "core":"collection1",
[junit4] 2> "state":"active"} current state version: 1
[junit4] 2> 2951253 INFO (zkCallback-2588-thread-1-processing-n:127.0.0.1:55252_) [n:127.0.0.1:55252_ ] o.a.s.c.c.ZkStateReader A cluster state change: WatchedEvent state:SyncConnected type:NodeDataChanged path:/clusterstate.json, has occurred - updating... (live nodes size: 1)
[junit4] 2> 2951302 INFO (coreZkRegister-9711-thread-1-processing-n:127.0.0.1:55252_ x:collection1 s:shard1 c:control_collection r:core_node1) [n:127.0.0.1:55252_ c:control_collection s:shard1 r:core_node1 x:collection1] o.a.s.c.ZkController We are http://127.0.0.1:55252/collection1/ and leader is http://127.0.0.1:55252/collection1/
[junit4] 2> 2951302 INFO (coreZkRegister-9711-thread-1-processing-n:127.0.0.1:55252_ x:collection1 s:shard1 c:control_collection r:core_node1) [n:127.0.0.1:55252_ c:control_collection s:shard1 r:core_node1 x:collection1] o.a.s.c.ZkController No LogReplay needed for core=collection1 baseURL=http://127.0.0.1:55252
[junit4] 2> 2951302 INFO (coreZkRegister-9711-thread-1-processing-n:127.0.0.1:55252_ x:collection1 s:shard1 c:control_collection r:core_node1) [n:127.0.0.1:55252_ c:control_collection s:shard1 r:core_node1 x:collection1] o.a.s.c.ZkController I am the leader, no recovery necessary
[junit4] 2> 2951302 INFO (coreZkRegister-9711-thread-1-processing-n:127.0.0.1:55252_ x:collection1 s:shard1 c:control_collection r:core_node1) [n:127.0.0.1:55252_ c:control_collection s:shard1 r:core_node1 x:collection1] o.a.s.c.ZkController publishing state=active
[junit4] 2> 2951302 INFO (coreZkRegister-9711-thread-1-processing-n:127.0.0.1:55252_ x:collection1 s:shard1 c:control_collection r:core_node1) [n:127.0.0.1:55252_ c:control_collection s:shard1 r:core_node1 x:collection1] o.a.s.c.ZkController numShards not found on descriptor - reading it from system property
[junit4] 2> 2951305 INFO (OverseerStateUpdate-94599777381449733-127.0.0.1:55252_-n_0000000000) [n:127.0.0.1:55252_ ] o.a.s.c.Overseer processMessage: queueSize: 1, message = {
[junit4] 2> "core":"collection1",
[junit4] 2> "core_node_name":"core_node1",
[junit4] 2> "roles":null,
[junit4] 2> "base_url":"http://127.0.0.1:55252",
[junit4] 2> "node_name":"127.0.0.1:55252_",
[junit4] 2> "numShards":"1",
[junit4] 2> "state":"active",
[junit4] 2> "shard":"shard1",
[junit4] 2> "collection":"control_collection",
[junit4] 2> "operation":"state"} current state version: 2
[junit4] 2> 2951306 INFO (OverseerStateUpdate-94599777381449733-127.0.0.1:55252_-n_0000000000) [n:127.0.0.1:55252_ ] o.a.s.c.o.ReplicaMutator Update state numShards=1 message={
[junit4] 2> "core":"collection1",
[junit4] 2> "core_node_name":"core_node1",
[junit4] 2> "roles":null,
[junit4] 2> "base_url":"http://127.0.0.1:55252",
[junit4] 2> "node_name":"127.0.0.1:55252_",
[junit4] 2> "numShards":"1",
[junit4] 2> "state":"active",
[junit4] 2> "shard":"shard1",
[junit4] 2> "collection":"control_collection",
[junit4] 2> "operation":"state"}
[junit4] 2> 2951410 INFO (zkCallback-2588-thread-1-processing-n:127.0.0.1:55252_) [n:127.0.0.1:55252_ ] o.a.s.c.c.ZkStateReader A cluster state change: WatchedEvent state:SyncConnected type:NodeDataChanged path:/clusterstate.json, has occurred - updating... (live nodes size: 1)
[junit4] 2> 2951475 INFO (TEST-TestAuthorizationFramework.authorizationFrameworkTest-seed#[52D7198F3F73812C]) [ ] o.a.s.c.c.SolrZkClient Using default ZkCredentialsProvider
[junit4] 2> 2951475 INFO (TEST-TestAuthorizationFramework.authorizationFrameworkTest-seed#[52D7198F3F73812C]) [ ] o.a.s.c.c.ConnectionManager Waiting for client to connect to ZooKeeper
[junit4] 2> 2951476 INFO (zkCallback-2590-thread-1) [ ] o.a.s.c.c.ConnectionManager Watcher org.apache.solr.common.cloud.ConnectionManager@7d5f4d37 name:ZooKeeperConnection Watcher:127.0.0.1:41361/solr got event WatchedEvent state:SyncConnected type:None path:null path:null type:None
[junit4] 2> 2951477 INFO (TEST-TestAuthorizationFramework.authorizationFrameworkTest-seed#[52D7198F3F73812C]) [ ] o.a.s.c.c.ConnectionManager Client is connected to ZooKeeper
[junit4] 2> 2951477 INFO (TEST-TestAuthorizationFramework.authorizationFrameworkTest-seed#[52D7198F3F73812C]) [ ] o.a.s.c.c.SolrZkClient Using default ZkACLProvider
[junit4] 2> 2951477 INFO (TEST-TestAuthorizationFramework.authorizationFrameworkTest-seed#[52D7198F3F73812C]) [ ] o.a.s.c.c.ZkStateReader Updating cluster state from ZooKeeper...
[junit4] 2> 2951481 INFO (TEST-TestAuthorizationFramework.authorizationFrameworkTest-seed#[52D7198F3F73812C]) [ ] o.a.s.c.ChaosMonkey monkey: init - expire sessions:false cause connection loss:false
[junit4] 2> 2951743 INFO (TEST-TestAuthorizationFramework.authorizationFrameworkTest-seed#[52D7198F3F73812C]) [ ] o.a.s.SolrTestCaseJ4 Writing core.properties file to /export/home/jenkins/workspace/Lucene-Solr-trunk-Solaris/solr/build/solr-core/test/J1/temp/solr.security.TestAuthorizationFramework_52D7198F3F73812C-001/shard-1-001/cores/collection1
[junit4] 2> 2951744 INFO (TEST-TestAuthorizationFramework.authorizationFrameworkTest-seed#[52D7198F3F73812C]) [ ] o.a.s.c.AbstractFullDistribZkTestBase create jetty 1 in directory /export/home/jenkins/workspace/Lucene-Solr-trunk-Solaris/solr/build/solr-core/test/J1/temp/solr.security.TestAuthorizationFramework_52D7198F3F73812C-001/shard-1-001
[junit4] 2> 2951744 INFO (TEST-TestAuthorizationFramework.authorizationFrameworkTest-seed#[52D7198F3F73812C]) [ ] o.e.j.s.Server jetty-9.2.13.v20150730
[junit4] 2> 2951746 INFO (TEST-TestAuthorizationFramework.authorizationFrameworkTest-seed#[52D7198F3F73812C]) [ ] o.e.j.s.h.ContextHandler Started o.e.j.s.ServletContextHandler@63a212f1{/,null,AVAILABLE}
[junit4] 2> 2951747 INFO (TEST-TestAuthorizationFramework.authorizationFrameworkTest-seed#[52D7198F3F73812C]) [ ] o.e.j.s.ServerConnector Started ServerConnector@2bfe0910{HTTP/1.1}{127.0.0.1:62737}
[junit4] 2> 2951747 INFO (TEST-TestAuthorizationFramework.authorizationFrameworkTest-seed#[52D7198F3F73812C]) [ ] o.e.j.s.Server Started @3000342ms
[junit4] 2> 2951747 INFO (TEST-TestAuthorizationFramework.authorizationFrameworkTest-seed#[52D7198F3F73812C]) [ ] o.a.s.c.s.e.JettySolrRunner Jetty properties: {solr.data.dir=/export/home/jenkins/workspace/Lucene-Solr-trunk-Solaris/solr/build/solr-core/test/J1/temp/solr.security.TestAuthorizationFramework_52D7198F3F73812C-001/tempDir-001/jetty1, solrconfig=solrconfig.xml, hostContext=/, hostPort=62737, coreRootDirectory=/export/home/jenkins/workspace/Lucene-Solr-trunk-Solaris/solr/build/solr-core/test/J1/../../../../../../../../../../export/home/jenkins/workspace/Lucene-Solr-trunk-Solaris/solr/build/solr-core/test/J1/temp/solr.security.TestAuthorizationFramework_52D7198F3F73812C-001/shard-1-001/cores}
[junit4] 2> 2951747 INFO (TEST-TestAuthorizationFramework.authorizationFrameworkTest-seed#[52D7198F3F73812C]) [ ] o.a.s.s.SolrDispatchFilter SolrDispatchFilter.init(): sun.misc.Launcher$AppClassLoader@659e0bfd
[junit4] 2> 2951747 INFO (TEST-TestAuthorizationFramework.authorizationFrameworkTest-seed#[52D7198F3F73812C]) [ ] o.a.s.c.SolrResourceLoader new SolrResourceLoader for directory: '/export/home/jenkins/workspace/Lucene-Solr-trunk-Solaris/solr/build/solr-core/test/J1/../../../../../../../../../../export/home/jenkins/workspace/Lucene-Solr-trunk-Solaris/solr/build/solr-core/test/J1/temp/solr.security.TestAuthorizationFramework_52D7198F3F73812C-001/shard-1-001/'
[junit4] 2> 2951765 INFO (TEST-TestAuthorizationFramework.authorizationFrameworkTest-seed#[52D7198F3F73812C]) [ ] o.a.s.c.c.SolrZkClient Using default ZkCredentialsProvider
[junit4] 2> 2951765 INFO (TEST-TestAuthorizationFramework.authorizationFrameworkTest-seed#[52D7198F3F73812C]) [ ] o.a.s.c.c.ConnectionManager Waiting for client to connect to ZooKeeper
[junit4] 2> 2951771 INFO (zkCallback-2591-thread-1) [ ] o.a.s.c.c.ConnectionManager Watcher org.apache.solr.common.cloud.ConnectionManager@54f47fde name:ZooKeeperConnection Watcher:127.0.0.1:41361/solr got event WatchedEvent state:SyncConnected type:None path:null path:null type:None
[junit4] 2> 2951771 INFO (TEST-TestAuthorizationFramework.authorizationFrameworkTest-seed#[52D7198F3F73812C]) [ ] o.a.s.c.c.ConnectionManager Client is connected to ZooKeeper
[junit4] 2> 2951772 INFO (TEST-TestAuthorizationFramework.authorizationFrameworkTest-seed#[52D7198F3F73812C]) [ ] o.a.s.c.c.SolrZkClient Using default ZkACLProvider
[junit4] 2> 2951775 INFO (TEST-TestAuthorizationFramework.authorizationFrameworkTest-seed#[52D7198F3F73812C]) [ ] o.a.s.s.SolrDispatchFilter Loading solr.xml from SolrHome (not found in ZooKeeper)
[junit4] 2> 2951775 INFO (TEST-TestAuthorizationFramework.authorizationFrameworkTest-seed#[52D7198F3F73812C]) [ ] o.a.s.c.SolrXmlConfig Loading container configuration from /export/home/jenkins/workspace/Lucene-Solr-trunk-Solaris/solr/build/solr-core/test/J1/../../../../../../../../../../export/home/jenkins/workspace/Lucene-Solr-trunk-Solaris/solr/build/solr-core/test/J1/temp/solr.security.TestAuthorizationFramework_52D7198F3F73812C-001/shard-1-001/solr.xml
[junit4] 2> 2951781 INFO (TEST-TestAuthorizationFramework.authorizationFrameworkTest-seed#[52D7198F3F73812C]) [ ] o.a.s.c.CoresLocator Config-defined core root directory: /export/home/jenkins/workspace/Lucene-Solr-trunk-Solaris/solr/build/solr-core/test/J1/../../../../../../../../../../export/home/jenkins/workspace/Lucene-Solr-trunk-Solaris/solr/build/solr-core/test/J1/temp/solr.security.TestAuthorizationFramework_52D7198F3F73812C-001/shard-1-001/cores
[junit4] 2> 2951781 INFO (TEST-TestAuthorizationFramework.authorizationFrameworkTest-seed#[52D7198F3F73812C]) [ ] o.a.s.c.CoreContainer New CoreContainer 1287950558
[junit4] 2> 2951781 INFO (TEST-TestAuthorizationFramework.authorizationFrameworkTest-seed#[52D7198F3F73812C]) [ ] o.a.s.c.CoreContainer Loading cores into CoreContainer [instanceDir=/export/home/jenkins/workspace/Lucene-Solr-trunk-Solaris/solr/build/solr-core/test/J1/../../../../../../../../../../export/home/jenkins/workspace/Lucene-Solr-trunk-Solaris/solr/build/solr-core/test/J1/temp/solr.security.TestAuthorizationFramework_52D7198F3F73812C-001/shard-1-001/]
[junit4] 2> 2951781 INFO (TEST-TestAuthorizationFramework.authorizationFrameworkTest-seed#[52D7198F3F73812C]) [ ] o.a.s.c.CoreContainer loading shared library: /export/home/jenkins/workspace/Lucene-Solr-trunk-Solaris/solr/build/solr-core/test/J1/../../../../../../../../../../export/home/jenkins/workspace/Lucene-Solr-trunk-Solaris/solr/build/solr-core/test/J1/temp/solr.security.TestAuthorizationFramework_52D7198F3F73812C-001/shard-1-001/lib
[junit4] 2> 2951781 WARN (TEST-TestAuthorizationFramework.authorizationFrameworkTest-seed#[52D7198F3F73812C]) [ ] o.a.s.c.SolrResourceLoader Can't find (or read) directory to add to classloader: lib (resolved as: /export/home/jenkins/workspace/Lucene-Solr-trunk-Solaris/solr/build/solr-core/test/J1/../../../../../../../../../../export/home/jenkins/workspace/Lucene-Solr-trunk-Solaris/solr/build/solr-core/test/J1/temp/solr.security.TestAuthorizationFramework_52D7198F3F73812C-001/shard-1-001/lib).
[junit4] 2> 2951790 INFO (TEST-TestAuthorizationFramework.authorizationFrameworkTest-seed#[52D7198F3F73812C]) [ ] o.a.s.h.c.HttpShardHandlerFactory created with socketTimeout : 90000,urlScheme : ,connTimeout : 15000,maxConnectionsPerHost : 20,maxConnections : 10000,corePoolSize : 0,maximumPoolSize : 2147483647,maxThreadIdleTime : 5,sizeOfQueue : -1,fairnessPolicy : false,useRetries : false,
[junit4] 2> 2951791 INFO (TEST-TestAuthorizationFramework.authorizationFrameworkTest-seed#[52D7198F3F73812C]) [ ] o.a.s.u.UpdateShardHandler Creating UpdateShardHandler HTTP client with params: socketTimeout=340000&connTimeout=45000&retry=true
[junit4] 2> 2951791 INFO (TEST-TestAuthorizationFramework.authorizationFrameworkTest-seed#[52D7198F3F73812C]) [ ] o.a.s.l.LogWatcher SLF4J impl is org.slf4j.impl.Log4jLoggerFactory
[junit4] 2> 2951791 INFO (TEST-TestAuthorizationFramework.authorizationFrameworkTest-seed#[52D7198F3F73812C]) [ ] o.a.s.l.LogWatcher Registering Log Listener [Log4j (org.slf4j.impl.Log4jLoggerFactory)]
[junit4] 2> 2951791 INFO (TEST-TestAuthorizationFramework.authorizationFrameworkTest-seed#[52D7198F3F73812C]) [ ] o.a.s.c.ZkContainer Zookeeper client=127.0.0.1:41361/solr
[junit4] 2> 2951791 INFO (TEST-TestAuthorizationFramework.authorizationFrameworkTest-seed#[52D7198F3F73812C]) [ ] o.a.s.c.ZkController zkHost includes chroot
[junit4] 2> 2951791 INFO (TEST-TestAuthorizationFramework.authorizationFrameworkTest-seed#[52D7198F3F73812C]) [ ] o.a.s.c.c.SolrZkClient Using default ZkCredentialsProvider
[junit4] 2> 2951792 INFO (TEST-TestAuthorizationFramework.authorizationFrameworkTest-seed#[52D7198F3F73812C]) [ ] o.a.s.c.c.ConnectionManager Waiting for client to connect to ZooKeeper
[junit4] 2> 2951794 INFO (zkCallback-2593-thread-1) [ ] o.a.s.c.c.ConnectionManager Watcher org.apache.solr.common.cloud.ConnectionManager@3b8934d4 name:ZooKeeperConnection Watcher:127.0.0.1:41361 got event WatchedEvent state:SyncConnected type:None path:null path:null type:None
[junit4] 2> 2951794 INFO (TEST-TestAuthorizationFramework.authorizationFrameworkTest-seed#[52D7198F3F73812C]) [ ] o.a.s.c.c.ConnectionManager Client is connected to ZooKeeper
[junit4] 2> 2951794 INFO (TEST-TestAuthorizationFramework.authorizationFrameworkTest-seed#[52D7198F3F73812C]) [ ] o.a.s.c.c.SolrZkClient Using default ZkACLProvider
[junit4] 2> 2951796 INFO (TEST-TestAuthorizationFramework.authorizationFrameworkTest-seed#[52D7198F3F73812C]) [n:127.0.0.1:62737_ ] o.a.s.c.c.ConnectionManager Waiting for client to connect to ZooKeeper
[junit4] 2> 2951798 INFO (zkCallback-2594-thread-1-processing-n:127.0.0.1:62737_) [n:127.0.0.1:62737_ ] o.a.s.c.c.ConnectionManager Watcher org.apache.solr.common.cloud.ConnectionManager@7df38d2 name:ZooKeeperConnection Watcher:127.0.0.1:41361/solr got event WatchedEvent state:SyncConnected type:None path:null path:null type:None
[junit4] 2> 2951798 INFO (TEST-TestAuthorizationFramework.authorizationFrameworkTest-seed#[52D7198F3F73812C]) [n:127.0.0.1:62737_ ] o.a.s.c.c.ConnectionManager Client is connected to ZooKeeper
[junit4] 2> 2951807 INFO (TEST-TestAuthorizationFramework.authorizationFrameworkTest-seed#[52D7198F3F73812C]) [n:127.0.0.1:62737_ ] o.a.s.c.c.ZkStateReader Updating cluster state from ZooKeeper...
[junit4] 2> 2952816 INFO (TEST-TestAuthorizationFramework.authorizationFrameworkTest-seed#[52D7198F3F73812C]) [n:127.0.0.1:62737_ ] o.a.s.c.ZkController Register node as live in ZooKeeper:/live_nodes/127.0.0.1:62737_
[junit4] 2> 2952817 INFO (TEST-TestAuthorizationFramework.authorizationFrameworkTest-seed#[52D7198F3F73812C]) [n:127.0.0.1:62737_ ] o.a.s.c.c.SolrZkClient makePath: /live_nodes/127.0.0.1:62737_
[junit4] 2> 2952819 INFO (zkCallback-2588-thread-1-processing-n:127.0.0.1:55252_) [n:127.0.0.1:55252_ ] o.a.s.c.c.ZkStateReader A live node change: WatchedEvent state:SyncConnected type:NodeChildrenChanged path:/live_nodes, has occurred - updating... (live nodes size: 1)
[junit4] 2> 2952819 INFO (zkCallback-2590-thread-1) [ ] o.a.s.c.c.ZkStateReader A live node change: WatchedEvent state:SyncConnected type:NodeChildrenChanged path:/live_nodes, has occurred - updating... (live nodes size: 1)
[junit4] 2> 2952819 INFO (zkCallback-2594-thread-1-processing-n:127.0.0.1:62737_) [n:127.0.0.1:62737_ ] o.a.s.c.c.ZkStateReader A live node change: WatchedEvent state:SyncConnected type:NodeChildrenChanged path:/live_nodes, has occurred - updating... (live nodes size: 1)
[junit4] 2> 2952822 INFO (TEST-TestAuthorizationFramework.authorizationFrameworkTest-seed#[52D7198F3F73812C]) [n:127.0.0.1:62737_ ] o.a.s.c.Overseer Overseer (id=null) closing
[junit4] 2> 2952823 INFO (TEST-TestAuthorizationFramework.authorizationFrameworkTest-seed#[52D7198F3F73812C]) [n:127.0.0.1:62737_ ] o.a.s.c.LeaderElector Joined leadership election with path: /overseer_elect/election/94599777381449737-127.0.0.1:62737_-n_0000000001
[junit4] 2> 2952824 INFO (TEST-TestAuthorizationFramework.authorizationFrameworkTest-seed#[52D7198F3F73812C]) [n:127.0.0.1:62737_ ] o.a.s.c.LeaderElector Watching path /overseer_elect/election/94599777381449733-127.0.0.1:55252_-n_0000000000 to know if I could be the leader
[junit4] 2> 2952831 INFO (TEST-TestAuthorizationFramework.authorizationFrameworkTest-seed#[52D7198F3F73812C]) [n:127.0.0.1:62737_ ] o.a.s.c.CoreContainer Initializing authorization plugin: org.apache.solr.security.MockAuthorizationPlugin
[junit4] 2> 2952832 INFO (TEST-TestAuthorizationFramework.authorizationFrameworkTest-seed#[52D7198F3F73812C]) [n:127.0.0.1:62737_ ] o.a.s.c.CoreContainer No authentication plugin used.
[junit4] 2> 2952833 INFO (TEST-TestAuthorizationFramework.authorizationFrameworkTest-seed#[52D7198F3F73812C]) [n:127.0.0.1:62737_ ] o.a.s.c.CoresLocator Looking for core definitions underneath /export/home/jenkins/workspace/Lucene-Solr-trunk-Solaris/solr/build/solr-core/test/J1/../../../../../../../../../../export/home/jenkins/workspace/Lucene-Solr-trunk-Solaris/solr/build/solr-core/test/J1/temp/solr.security.TestAuthorizationFramework_52D7198F3F73812C-001/shard-1-001/cores
[junit4] 2> 2952834 INFO (TEST-TestAuthorizationFramework.authorizationFrameworkTest-seed#[52D7198F3F73812C]) [n:127.0.0.1:62737_ ] o.a.s.c.SolrCore Created CoreDescriptor: {name=collection1, config=solrconfig.xml, transient=false, schema=schema.xml, loadOnStartup=true, configSetProperties=configsetprops.json, instanceDir=/export/home/jenkins/workspace/Lucene-Solr-trunk-Solaris/solr/build/solr-core/test/J1/../../../../../../../../../../export/home/jenkins/workspace/Lucene-Solr-trunk-Solaris/solr/build/solr-core/test/J1/temp/solr.security.TestAuthorizationFramework_52D7198F3F73812C-001/shard-1-001/cores/collection1, collection=collection1, absoluteInstDir=/export/home/jenkins/workspace/Lucene-Solr-trunk-Solaris/solr/build/solr-core/test/J1/../../../../../../../../../../export/home/jenkins/workspace/Lucene-Solr-trunk-Solaris/solr/build/solr-core/test/J1/temp/solr.security.TestAuthorizationFramework_52D7198F3F73812C-001/shard-1-001/cores/collection1/, coreNodeName=, dataDir=data/, shard=}
[junit4] 2> 2952834 INFO (TEST-TestAuthorizationFramework.authorizationFrameworkTest-seed#[52D7198F3F73812C]) [n:127.0.0.1:62737_ ] o.a.s.c.CoresLocator Found core collection1 in /export/home/jenkins/workspace/Lucene-Solr-trunk-Solaris/solr/build/solr-core/test/J1/../../../../../../../../../../export/home/jenkins/workspace/Lucene-Solr-trunk-Solaris/solr/build/solr-core/test/J1/temp/solr.security.TestAuthorizationFramework_52D7198F3F73812C-001/shard-1-001/cores/collection1/
[junit4] 2> 2952834 INFO (TEST-TestAuthorizationFramework.authorizationFrameworkTest-seed#[52D7198F3F73812C]) [n:127.0.0.1:62737_ ] o.a.s.c.CoresLocator Found 1 core definitions
[junit4] 2> 2952836 INFO (coreLoadExecutor-9728-thread-1-processing-n:127.0.0.1:62737_) [n:127.0.0.1:62737_ c:collection1 x:collection1] o.a.s.c.ZkController publishing state=down
[junit4] 2> 2952836 INFO (TEST-TestAuthorizationFramework.authorizationFrameworkTest-seed#[52D7198F3F73812C]) [n:127.0.0.1:62737_ ] o.a.s.s.SolrDispatchFilter user.dir=/export/home/jenkins/workspace/Lucene-Solr-trunk-Solaris/solr/build/solr-core/test/J1
[junit4] 2> 2952836 INFO (TEST-TestAuthorizationFramework.authorizationFrameworkTest-seed#[52D7198F3F73812C]) [n:127.0.0.1:62737_ ] o.a.s.s.SolrDispatchFilter SolrDispatchFilter.init() done
[junit4] 2> 2952836 INFO (coreLoadExecutor-9728-thread-1-processing-n:127.0.0.1:62737_) [n:127.0.0.1:62737_ c:collection1 x:collection1] o.a.s.c.ZkController numShards not found on descriptor - reading it from system property
[junit4] 2> 2952839 INFO (OverseerStateUpdate-94599777381449733-127.0.0.1:55252_-n_0000000000) [n:127.0.0.1:55252_ ] o.a.s.c.Overseer processMessage: queueSize: 1, message = {
[junit4] 2> "core":"collection1",
[junit4] 2> "roles":null,
[junit4] 2> "base_url":"http://127.0.0.1:62737",
[junit4] 2> "node_name":"127.0.0.1:62737_",
[junit4] 2> "numShards":"2",
[junit4] 2> "state":"down",
[junit4] 2> "shard":null,
[junit4] 2> "collection":"collection1",
[junit4] 2> "operation":"state"} current state version: 3
[junit4] 2> 2952839 INFO (coreLoadExecutor-9728-thread-1-processing-n:127.0.0.1:62737_) [n:127.0.0.1:62737_ c:collection1 x:collection1] o.a.s.c.ZkController look for our core node name
[junit4] 2> 2952840 INFO (OverseerStateUpdate-94599777381449733-127.0.0.1:55252_-n_0000000000) [n:127.0.0.1:55252_ ] o.a.s.c.o.ReplicaMutator Update state numShards=2 message={
[junit4] 2> "core":"collection1",
[junit4] 2> "roles":null,
[junit4] 2> "base_url":"http://127.0.0.1:62737",
[junit4] 2> "node_name":"127.0.0.1:62737_",
[junit4] 2> "numShards":"2",
[junit4] 2> "state":"down",
[junit4] 2> "shard":null,
[junit4] 2> "collection":"collection1",
[junit4] 2> "operation":"state"}
[junit4] 2> 2952840 INFO (OverseerStateUpdate-94599777381449733-127.0.0.1:55252_-n_0000000000) [n:127.0.0.1:55252_ ] o.a.s.c.o.ClusterStateMutator building a new cName: collection1
[junit4] 2> 2952840 INFO (OverseerStateUpdate-94599777381449733-127.0.0.1:55252_-n_0000000000) [n:127.0.0.1:55252_ ] o.a.s.c.o.ReplicaMutator Assigning new node to shard shard=shard2
[junit4] 2> 2952945 INFO (zkCallback-2590-thread-1) [ ] o.a.s.c.c.ZkStateReader A cluster state change: WatchedEvent state:SyncConnected type:NodeDataChanged path:/clusterstate.json, has occurred - updating... (live nodes size: 2)
[junit4] 2> 2952945 INFO (zkCallback-2594-thread-1-processing-n:127.0.0.1:62737_) [n:127.0.0.1:62737_ ] o.a.s.c.c.ZkStateReader A cluster state change: WatchedEvent state:SyncConnected type:NodeDataChanged path:/clusterstate.json, has occurred - updating... (live nodes size: 2)
[junit4] 2> 2952945 INFO (zkCallback-2588-thread-1-processing-n:127.0.0.1:55252_) [n:127.0.0.1:55252_ ] o.a.s.c.c.ZkStateReader A cluster state change: WatchedEvent state:SyncConnected type:NodeDataChanged path:/clusterstate.json, has occurred - updating... (live nodes size: 2)
[junit4] 2> 2953840 INFO (coreLoadExecutor-9728-thread-1-processing-n:127.0.0.1:62737_) [n:127.0.0.1:62737_ c:collection1 x:collection1] o.a.s.c.ZkController waiting to find shard id in clusterstate for collection1
[junit4] 2> 2953840 INFO (coreLoadExecutor-9728-thread-1-processing-n:127.0.0.1:62737_) [n:127.0.0.1:62737_ c:collection1 x:collection1] o.a.s.c.ZkController Check for collection zkNode:collection1
[junit4] 2> 2953841 INFO (coreLoadExecutor-9728-thread-1-processing-n:127.0.0.1:62737_) [n:127.0.0.1:62737_ c:collection1 x:collection1] o.a.s.c.ZkController Collection zkNode exists
[junit4] 2> 2953841 INFO (coreLoadExecutor-9728-thread-1-processing-n:127.0.0.1:62737_) [n:127.0.0.1:62737_ c:collection1 x:collection1] o.a.s.c.c.ZkStateReader Load collection config from:/collections/collection1
[junit4] 2> 2953842 INFO (coreLoadExecutor-9728-thread-1-processing-n:127.0.0.1:62737_) [n:127.0.0.1:62737_ c:collection1 x:collection1] o.a.s.c.c.ZkStateReader path=/collections/collection1 configName=conf1 specified config exists in ZooKeeper
[junit4] 2> 2953842 INFO (coreLoadExecutor-9728-thread-1-processing-n:127.0.0.1:62737_) [n:127.0.0.1:62737_ c:collection1 x:collection1] o.a.s.c.SolrResourceLoader new SolrResourceLoader for directory: '/export/home/jenkins/workspace/Lucene-Solr-trunk-Solaris/solr/build/solr-core/test/J1/../../../../../../../../../../export/home/jenkins/workspace/Lucene-Solr-trunk-Solaris/solr/build/solr-core/test/J1/temp/solr.security.TestAuthorizationFramework_52D7198F3F73812C-001/shard-1-001/cores/collection1/'
[junit4] 2> 2953856 INFO (coreLoadExecutor-9728-thread-1-processing-n:127.0.0.1:62737_) [n:127.0.0.1:62737_ c:collection1 x:collection1] o.a.s.c.Config loaded config solrconfig.xml with version 0
[junit4] 2> 2953862 INFO (coreLoadExecutor-9728-thread-1-processing-n:127.0.0.1:62737_) [n:127.0.0.1:62737_ c:collection1 x:collection1] o.a.s.c.SolrConfig current version of requestparams : -1
[junit4] 2> 2953865 INFO (coreLoadExecutor-9728-thread-1-processing-n:127.0.0.1:62737_) [n:127.0.0.1:62737_ c:collection1 x:collection1] o.a.s.c.SolrConfig Using Lucene MatchVersion: 6.0.0
[junit4] 2> 2953866 INFO (coreLoadExecutor-9728-thread-1-processing-n:127.0.0.1:62737_) [n:127.0.0.1:62737_ c:collection1 x:collection1] o.a.s.c.Config Loaded SolrConfig: solrconfig.xml
[junit4] 2> 2953871 INFO (coreLoadExecutor-9728-thread-1-processing-n:127.0.0.1:62737_) [n:127.0.0.1:62737_ c:collection1 x:collection1] o.a.s.s.IndexSchema Reading Solr Schema from /configs/conf1/schema.xml
[junit4] 2> 2953877 INFO (coreLoadExecutor-9728-thread-1-processing-n:127.0.0.1:62737_) [n:127.0.0.1:62737_ c:collection1 x:collection1] o.a.s.s.IndexSchema [collection1] Schema name=test
[junit4] 2> 2953954 INFO (coreLoadExecutor-9728-thread-1-processing-n:127.0.0.1:62737_) [n:127.0.0.1:62737_ c:collection1 x:collection1] o.a.s.s.OpenExchangeRatesOrgProvider Initialized with rates=open-exchange-rates.json, refreshInterval=1440.
[junit4] 2> 2953959 INFO (coreLoadExecutor-9728-thread-1-processing-n:127.0.0.1:62737_) [n:127.0.0.1:62737_ c:collection1 x:collection1] o.a.s.s.IndexSchema default search field in schema is text
[junit4] 2> 2953960 INFO (coreLoadExecutor-9728-thread-1-processing-n:127.0.0.1:62737_) [n:127.0.0.1:62737_ c:collection1 x:collection1] o.a.s.s.IndexSchema unique key field: id
[junit4] 2> 2953972 INFO (coreLoadExecutor-9728-thread-1-processing-n:127.0.0.1:62737_) [n:127.0.0.1:62737_ c:collection1 x:collection1] o.a.s.s.FileExchangeRateProvider Reloading exchange rates from file currency.xml
[junit4] 2> 2953975 INFO (coreLoadExecutor-9728-thread-1-processing-n:127.0.0.1:62737_) [n:127.0.0.1:62737_ c:collection1 x:collection1] o.a.s.s.FileExchangeRateProvider Reloading exchange rates from file currency.xml
[junit4] 2> 2953977 INFO (coreLoadExecutor-9728-thread-1-processing-n:127.0.0.1:62737_) [n:127.0.0.1:62737_ c:collection1 x:collection1] o.a.s.s.OpenExchangeRatesOrgProvider Reloading exchange rates from open-exchange-rates.json
[junit4] 2> 2953978 WARN (coreLoadExecutor-
[...truncated too long message...]
6C5C2EA8903C]:0)
[junit4] > at org.apache.solr.cloud.AbstractDistribZkTestBase.waitForRecoveriesToFinish(AbstractDistribZkTestBase.java:172)
[junit4] > at org.apache.solr.cloud.AbstractFullDistribZkTestBase.waitForRecoveriesToFinish(AbstractFullDistribZkTestBase.java:836)
[junit4] > at org.apache.solr.cloud.AbstractFullDistribZkTestBase.waitForThingsToLevelOut(AbstractFullDistribZkTestBase.java:1393)
[junit4] > at org.apache.solr.security.TestAuthorizationFramework.authorizationFrameworkTest(TestAuthorizationFramework.java:60)
[junit4] > at org.apache.solr.BaseDistributedSearchTestCase$ShardsRepeatRule$ShardsFixedStatement.callStatement(BaseDistributedSearchTestCase.java:963)
[junit4] > at org.apache.solr.BaseDistributedSearchTestCase$ShardsRepeatRule$ShardsStatement.evaluate(BaseDistributedSearchTestCase.java:938)
[junit4] > at java.lang.Thread.run(Thread.java:745)
[junit4] 2> 2993784 INFO (SUITE-TestAuthorizationFramework-seed#[52D7198F3F73812C]-worker) [n:127.0.0.1:46110_ c:collection1 s:shard1 r:core_node4 x:collection1] o.a.s.SolrTestCaseJ4 ###deleteCore
[junit4] 2> NOTE: leaving temporary files on disk at: /export/home/jenkins/workspace/Lucene-Solr-trunk-Solaris/solr/build/solr-core/test/J1/temp/solr.security.TestAuthorizationFramework_52D7198F3F73812C-001
[junit4] 2> NOTE: test params are: codec=Asserting(Lucene53): {}, docValues:{}, sim=RandomSimilarityProvider(queryNorm=false,coord=yes): {}, locale=ar_TN, timezone=Asia/Magadan
[junit4] 2> NOTE: SunOS 5.11 amd64/Oracle Corporation 1.8.0_60 (64-bit)/cpus=3,threads=1,free=217759904,total=518979584
[junit4] 2> NOTE: All tests run in this JVM: [TestMiniSolrCloudClusterSSL, DocExpirationUpdateProcessorFactoryTest, SSLMigrationTest, TestSolrQueryParserDefaultOperatorResource, ShowFileRequestHandlerTest, SolrInfoMBeanTest, HdfsLockFactoryTest, BigEndianAscendingWordSerializerTest, TestManagedStopFilterFactory, CSVRequestHandlerTest, DefaultValueUpdateProcessorTest, MultiThreadedOCPTest, SolrTestCaseJ4Test, TestManagedSchemaFieldTypeResource, TestDefaultSearchFieldResource, SignatureUpdateProcessorFactoryTest, TestInfoStreamLogging, TestRecovery, FieldMutatingUpdateProcessorTest, PreAnalyzedFieldTest, NoCacheHeaderTest, SecurityConfHandlerTest, FileBasedSpellCheckerTest, TestRestManager, TermVectorComponentTest, JavabinLoaderTest, HdfsUnloadDistributedZkTest, CollectionTooManyReplicasTest, SuggesterWFSTTest, HdfsChaosMonkeySafeLeaderTest, LoggingHandlerTest, CdcrRequestHandlerTest, BitVectorTest, TermVectorComponentDistributedTest, TestWriterPerf, SuggesterTSTTest, TestImplicitCoreProperties, DateMathParserTest, ClusterStateTest, NotRequiredUniqueKeyTest, CloudMLTQParserTest, TestSolrQueryParser, DistributedTermsComponentTest, EchoParamsTest, CleanupOldIndexTest, TestFuzzyAnalyzedSuggestions, TestHdfsUpdateLog, LeaderInitiatedRecoveryOnCommitTest, SolrCmdDistributorTest, ChaosMonkeySafeLeaderTest, SpatialRPTFieldTypeTest, TestExclusionRuleCollectionAccess, TestQuerySenderListener, ConvertedLegacyTest, SolrIndexSplitterTest, TestBM25SimilarityFactory, TestOmitPositions, TestSolrIndexConfig, SolrCloudExampleTest, TestSolrDeletionPolicy2, DistanceFunctionTest, AddBlockUpdateTest, SpellingQueryConverterTest, AddSchemaFieldsUpdateProcessorFactoryTest, CollectionStateFormat2Test, AnalyticsMergeStrategyTest, TestSolr4Spatial, TestMiniSolrCloudCluster, BadIndexSchemaTest, AnalyticsQueryTest, TestManagedResource, TriLevelCompositeIdRoutingTest, TestCrossCoreJoin, TestAtomicUpdateErrorCases, FullHLLTest, TestMaxScoreQueryParser, TestCSVResponseWriter, TestExpandComponent, TestSortByMinMaxFunction, CollectionReloadTest, TestMacros, TestZkChroot, TestSolr4Spatial2, RequestLoggingTest, TestCoreDiscovery, TestComplexPhraseQParserPlugin, BinaryUpdateRequestHandlerTest, SortByFunctionTest, TestPerFieldSimilarity, TestDynamicLoading, TimeZoneUtilsTest, TestFieldResource, TestSortingResponseWriter, CdcrVersionReplicationTest, TestDistribDocBasedVersion, AssignTest, HdfsWriteToMultipleCollectionsTest, DistributedQueryComponentCustomSortTest, TestRealTimeGet, ReplicationFactorTest, DistributedFacetPivotLongTailTest, TestOverriddenPrefixQueryForCustomFieldType, TestSuggestSpellingConverter, TestMinMaxOnMultiValuedField, SuggesterTest, HdfsRecoverLeaseTest, TestRequestStatusCollectionAPI, TestReload, TestChildDocTransformer, TestDistributedGrouping, MultiTermTest, TestHighFrequencyDictionaryFactory, SaslZkACLProviderTest, MinimalSchemaTest, TestReRankQParserPlugin, DebugComponentTest, TestMissingGroups, QueryParsingTest, TestCloudPivotFacet, CoreAdminHandlerTest, AsyncCallRequestStatusResponseTest, AutoCommitTest, DataDrivenBlockJoinTest, TestBulkSchemaAPI, CdcrUpdateLogTest, SimpleMLTQParserTest, DistanceUnitsTest, AliasIntegrationTest, CurrencyFieldOpenExchangeTest, UpdateRequestProcessorFactoryTest, TestNamedUpdateProcessors, CursorPagingTest, TestIndexingPerformance, BasicDistributedZkTest, BasicDistributedZk2Test, UnloadDistributedZkTest, CollectionsAPIDistributedZkTest, BasicZkTest, FullSolrCloudDistribCmdsTest, ClusterStateUpdateTest, TestRandomFaceting, ZkSolrClientTest, ShardRoutingCustomTest, DistributedSpellCheckComponentTest, TestStressReorder, TestJoin, TestStressVersions, HardAutoCommitTest, TestRangeQuery, TestCoreContainer, SimpleFacetsTest, SolrCoreTest, StatsComponentTest, SpellCheckComponentTest, QueryElevationComponentTest, TestFiltering, BasicFunctionalityTest, TestLazyCores, DirectUpdateHandlerTest, TestBadConfig, TestIndexSearcher, SoftAutoCommitTest, SimplePostToolTest, TestExtendedDismaxParser, SpellCheckCollatorTest, SolrRequestParserTest, TestFoldingMultitermQuery, DocValuesTest, TestStressLucene, TestTrie, WordBreakSolrSpellCheckerTest, SolrCoreCheckLockOnStartupTest, TestPseudoReturnFields, TestWordDelimiterFilterFactory, DirectUpdateHandlerOptimizeTest, DocValuesMultiTest, CacheHeaderTest, IndexBasedSpellCheckerTest, TestSurroundQueryParser, LukeRequestHandlerTest, TestQueryUtils, TestReversedWildcardFilterFactory, DocumentAnalysisRequestHandlerTest, TestQueryTypes, PrimitiveFieldTypeTest, TermsComponentTest, RequestHandlersTest, TestValueSourceCache, PathHierarchyTokenizerFactoryTest, RequiredFieldsTest, FieldAnalysisRequestHandlerTest, TestArbitraryIndexDir, IndexSchemaRuntimeFieldTest, SolrPluginUtilsTest, TestCollationField, MBeansHandlerTest, UniqFieldsUpdateProcessorFactoryTest, JsonLoaderTest, TestPHPSerializedResponseWriter, PingRequestHandlerTest, HighlighterConfigTest, SOLR749Test, UpdateParamsTest, TestQuerySenderNoQuery, CopyFieldTest, ResponseLogComponentTest, SolrIndexConfigTest, BadComponentTest, TestStressRecovery, TestSystemIdResolver, PrimUtilsTest, DOMUtilTest, RAMDirectoryFactoryTest, TestSolrJ, TestUtils, SliceStateTest, UUIDFieldTest, CircularListTest, TestHighlightDedupGrouping, TestSimpleTrackingShardHandler, TestTolerantSearch, CdcrReplicationDistributedZkTest, CloudExitableDirectoryReaderTest, CollectionsAPIAsyncDistributedZkTest, DeleteInactiveReplicaTest, DeleteLastCustomShardedReplicaTest, DeleteShardTest, DistribCursorPagingTest, DistributedQueueTest, HttpPartitionTest, SharedFSAutoReplicaFailoverTest, SharedFSAutoReplicaFailoverUtilsTest, SimpleCollectionCreateDeleteTest, SolrXmlInZkTest, TestAuthenticationFramework, TestCloudInspectUtil, TestCollectionAPI, TestDownShardTolerantSearch, TestLeaderInitiatedRecoveryThread, TestRandomRequestDistribution, TestShortCircuitedRequests, HdfsSyncSliceTest, StressHdfsTest, CachingDirectoryFactoryTest, HdfsDirectoryFactoryTest, QueryResultKeyTest, TestConfigOverlay, TestConfigSetImmutable, TestConfigSetProperties, TestConfigSets, TestInitParams, TestNRTOpen, TestReloadAndDeleteDocs, TestShardHandlerFactory, TestSolrDynamicMBean, TestConfigReload, TestReqParamsAPI, TestRestoreCore, TestSolrConfigHandlerConcurrent, CoreAdminCreateDiscoverTest, CoreMergeIndexesAdminHandlerTest, InfoHandlerTest, DistributedDebugComponentTest, DistributedExpandComponentTest, DistributedFacetPivotLargeTest, DistributedFacetPivotWhiteBoxTest, TestTrackingShardHandlerFactory, TestManagedSchemaFieldResource, TestSchemaVersionResource, TestUniqueKeyFieldResource, BadCopyFieldTest, DateRangeFieldTest, DocValuesMissingTest, TestBulkSchemaConcurrent, MergeStrategyTest, RankQueryTest, TestAddFieldRealTimeGet, TestFieldSortValues, TestHashQParserPlugin, TestRecoveryHdfs, TestReloadDeadlock, TestSearcherReuse, TestSmileRequest, TestStandardQParsers, TestStressUserVersions, TestJsonFacets, TestLRUStatsCache, PKIAuthenticationIntegrationTest, TestAuthorizationFramework]
[junit4] Completed [533/546] on J1 in 44.34s, 1 test, 1 failure <<< FAILURES!
[...truncated 57 lines...]
BUILD FAILED
/export/home/jenkins/workspace/Lucene-Solr-trunk-Solaris/build.xml:775: The following error occurred while executing this line:
/export/home/jenkins/workspace/Lucene-Solr-trunk-Solaris/build.xml:719: The following error occurred while executing this line:
/export/home/jenkins/workspace/Lucene-Solr-trunk-Solaris/build.xml:59: The following error occurred while executing this line:
/export/home/jenkins/workspace/Lucene-Solr-trunk-Solaris/solr/build.xml:233: The following error occurred while executing this line:
/export/home/jenkins/workspace/Lucene-Solr-trunk-Solaris/solr/common-build.xml:514: The following error occurred while executing this line:
/export/home/jenkins/workspace/Lucene-Solr-trunk-Solaris/lucene/common-build.xml:1432: The following error occurred while executing this line:
/export/home/jenkins/workspace/Lucene-Solr-trunk-Solaris/lucene/common-build.xml:987: There were test failures: 546 suites (8 ignored), 2145 tests, 1 failure, 47 ignored (35 assumptions) [seed: 52D7198F3F73812C]
Total time: 70 minutes 37 seconds
Build step 'Invoke Ant' marked build as failure
Archiving artifacts
[WARNINGS] Skipping publisher since build result is FAILURE
Recording test results
Email was triggered for: Failure - Any
Sending email for trigger: Failure - Any