You are viewing a plain text version of this content. The canonical link for it is here.
Posted to commits@phoenix.apache.org by Apache Jenkins Server <je...@builds.apache.org> on 2015/11/13 19:45:56 UTC

Build failed in Jenkins: Phoenix-4.x-HBase-1.0 #221

See <https://builds.apache.org/job/Phoenix-4.x-HBase-1.0/221/changes>

Changes:

[jmahonin] PHOENIX-2288: PDecimal precision and scale aren't carried through to

------------------------------------------
[...truncated 1185 lines...]
Running org.apache.phoenix.end2end.index.DropViewIT
Tests run: 3, Failures: 0, Errors: 0, Skipped: 0, Time elapsed: 11.92 sec - in org.apache.phoenix.end2end.UpsertSelectAutoCommitIT
Running org.apache.phoenix.end2end.index.GlobalIndexOptimizationIT
Tests run: 1, Failures: 0, Errors: 0, Skipped: 0, Time elapsed: 8.031 sec - in org.apache.phoenix.end2end.index.DropViewIT
Running org.apache.phoenix.end2end.index.IndexIT
Tests run: 3, Failures: 0, Errors: 0, Skipped: 0, Time elapsed: 18.379 sec - in org.apache.phoenix.end2end.index.SaltedIndexIT
Running org.apache.phoenix.end2end.index.LocalIndexIT
Tests run: 6, Failures: 0, Errors: 0, Skipped: 0, Time elapsed: 36.523 sec - in org.apache.phoenix.end2end.index.GlobalIndexOptimizationIT
Running org.apache.phoenix.end2end.index.IndexExpressionIT
Tests run: 28, Failures: 0, Errors: 0, Skipped: 0, Time elapsed: 162.625 sec - in org.apache.phoenix.end2end.InListIT
Running org.apache.phoenix.end2end.index.ViewIndexIT
Tests run: 1, Failures: 0, Errors: 0, Skipped: 0, Time elapsed: 4.747 sec - in org.apache.phoenix.end2end.index.ViewIndexIT
Running org.apache.phoenix.end2end.index.ImmutableIndexIT
Tests run: 2, Failures: 0, Errors: 0, Skipped: 0, Time elapsed: 8.531 sec - in org.apache.phoenix.end2end.index.ImmutableIndexIT
Running org.apache.phoenix.end2end.index.IndexMetadataIT
Tests run: 6, Failures: 0, Errors: 0, Skipped: 0, Time elapsed: 38.204 sec - in org.apache.phoenix.end2end.index.IndexMetadataIT
Running org.apache.phoenix.end2end.index.MutableIndexIT
Tests run: 20, Failures: 0, Errors: 0, Skipped: 0, Time elapsed: 145.886 sec - in org.apache.phoenix.end2end.index.LocalIndexIT
Running org.apache.phoenix.end2end.CSVCommonsLoaderIT
Tests run: 12, Failures: 0, Errors: 0, Skipped: 0, Time elapsed: 50.638 sec - in org.apache.phoenix.end2end.index.MutableIndexIT
Running org.apache.phoenix.end2end.OctetLengthFunctionEnd2EndIT
Tests run: 1, Failures: 0, Errors: 0, Skipped: 0, Time elapsed: 2.215 sec - in org.apache.phoenix.end2end.OctetLengthFunctionEnd2EndIT
Running org.apache.phoenix.end2end.LpadFunctionIT
Tests run: 16, Failures: 0, Errors: 0, Skipped: 0, Time elapsed: 17.425 sec - in org.apache.phoenix.end2end.CSVCommonsLoaderIT
Running org.apache.phoenix.end2end.MinMaxAggregateFunctionIT
Tests run: 1, Failures: 0, Errors: 0, Skipped: 0, Time elapsed: 2.831 sec - in org.apache.phoenix.end2end.MinMaxAggregateFunctionIT
Running org.apache.phoenix.end2end.TimezoneOffsetFunctionIT
Tests run: 12, Failures: 0, Errors: 0, Skipped: 0, Time elapsed: 13.957 sec - in org.apache.phoenix.end2end.LpadFunctionIT
Running org.apache.phoenix.end2end.RegexpSubstrFunctionIT
Tests run: 2, Failures: 0, Errors: 0, Skipped: 0, Time elapsed: 3.075 sec - in org.apache.phoenix.end2end.RegexpSubstrFunctionIT
Running org.apache.phoenix.end2end.BinaryRowKeyIT
Tests run: 7, Failures: 0, Errors: 0, Skipped: 0, Time elapsed: 5.631 sec - in org.apache.phoenix.end2end.TimezoneOffsetFunctionIT
Running org.apache.phoenix.end2end.SignFunctionEnd2EndIT
Tests run: 3, Failures: 0, Errors: 0, Skipped: 0, Time elapsed: 2.899 sec - in org.apache.phoenix.end2end.BinaryRowKeyIT
Running org.apache.phoenix.end2end.SortMergeJoinIT
Tests run: 2, Failures: 0, Errors: 0, Skipped: 0, Time elapsed: 4.664 sec - in org.apache.phoenix.end2end.SignFunctionEnd2EndIT
Running org.apache.phoenix.end2end.DecodeFunctionIT
Tests run: 6, Failures: 0, Errors: 0, Skipped: 0, Time elapsed: 2.837 sec - in org.apache.phoenix.end2end.DecodeFunctionIT
Running org.apache.phoenix.end2end.RTrimFunctionIT
Tests run: 2, Failures: 0, Errors: 0, Skipped: 0, Time elapsed: 2.489 sec - in org.apache.phoenix.end2end.RTrimFunctionIT
Running org.apache.phoenix.end2end.DisableLocalIndexIT
Tests run: 1, Failures: 0, Errors: 0, Skipped: 0, Time elapsed: 3.86 sec - in org.apache.phoenix.end2end.DisableLocalIndexIT
Running org.apache.phoenix.end2end.HashJoinIT
Tests run: 62, Failures: 0, Errors: 0, Skipped: 0, Time elapsed: 171.052 sec - in org.apache.phoenix.end2end.index.IndexExpressionIT
Running org.apache.phoenix.end2end.HashJoinLocalIndexIT
Tests run: 1, Failures: 0, Errors: 0, Skipped: 0, Time elapsed: 13.881 sec - in org.apache.phoenix.end2end.HashJoinLocalIndexIT
Running org.apache.phoenix.end2end.ModulusExpressionIT
Tests run: 11, Failures: 0, Errors: 0, Skipped: 0, Time elapsed: 5.832 sec - in org.apache.phoenix.end2end.ModulusExpressionIT
Running org.apache.phoenix.end2end.ArrayToStringFunctionIT
Tests run: 36, Failures: 0, Errors: 0, Skipped: 0, Time elapsed: 14.87 sec - in org.apache.phoenix.end2end.ArrayToStringFunctionIT
Running org.apache.phoenix.end2end.StoreNullsIT
Tests run: 3, Failures: 0, Errors: 0, Skipped: 0, Time elapsed: 20.81 sec - in org.apache.phoenix.end2end.StoreNullsIT
Running org.apache.phoenix.end2end.EvaluationOfORIT
Tests run: 2, Failures: 0, Errors: 0, Skipped: 0, Time elapsed: 2.602 sec - in org.apache.phoenix.end2end.EvaluationOfORIT
Running org.apache.phoenix.end2end.ExecuteStatementsIT
Tests run: 2, Failures: 0, Errors: 0, Skipped: 0, Time elapsed: 15.746 sec - in org.apache.phoenix.end2end.ExecuteStatementsIT
Running org.apache.phoenix.end2end.ConvertTimezoneFunctionIT
Tests run: 60, Failures: 0, Errors: 0, Skipped: 4, Time elapsed: 280.188 sec - in org.apache.phoenix.end2end.index.IndexIT
Tests run: 7, Failures: 0, Errors: 0, Skipped: 0, Time elapsed: 4.282 sec - in org.apache.phoenix.end2end.ConvertTimezoneFunctionIT
Running org.apache.phoenix.end2end.ExpFunctionEnd2EndIT
Running org.apache.phoenix.end2end.PowerFunctionEnd2EndIT
Tests run: 1, Failures: 0, Errors: 0, Skipped: 0, Time elapsed: 4.69 sec - in org.apache.phoenix.end2end.PowerFunctionEnd2EndIT
Running org.apache.phoenix.end2end.StddevIT
Tests run: 4, Failures: 0, Errors: 0, Skipped: 0, Time elapsed: 5.023 sec - in org.apache.phoenix.end2end.StddevIT
Running org.apache.phoenix.end2end.TenantSpecificViewIndexSaltedIT
Tests run: 3, Failures: 0, Errors: 0, Skipped: 0, Time elapsed: 11.147 sec - in org.apache.phoenix.end2end.ExpFunctionEnd2EndIT
Running org.apache.phoenix.end2end.AlterSessionIT
Tests run: 2, Failures: 0, Errors: 0, Skipped: 0, Time elapsed: 3.825 sec - in org.apache.phoenix.end2end.AlterSessionIT
Running org.apache.phoenix.end2end.FirstValueFunctionIT
Tests run: 4, Failures: 0, Errors: 0, Skipped: 0, Time elapsed: 9.243 sec - in org.apache.phoenix.end2end.TenantSpecificViewIndexSaltedIT
Running org.apache.phoenix.end2end.SkipScanAfterManualSplitIT
Tests run: 7, Failures: 0, Errors: 0, Skipped: 0, Time elapsed: 6.766 sec - in org.apache.phoenix.end2end.FirstValueFunctionIT
Running org.apache.phoenix.end2end.ArrayAppendFunctionIT
Tests run: 108, Failures: 0, Errors: 0, Skipped: 0, Time elapsed: 488.168 sec - in org.apache.phoenix.end2end.SpooledSortMergeJoinIT
Running org.apache.phoenix.end2end.TenantSpecificViewIndexIT
Tests run: 3, Failures: 0, Errors: 0, Skipped: 0, Time elapsed: 31.261 sec - in org.apache.phoenix.end2end.SkipScanAfterManualSplitIT
Running org.apache.phoenix.end2end.GetSetByteBitFunctionEnd2EndIT
Tests run: 1, Failures: 0, Errors: 0, Skipped: 0, Time elapsed: 2.002 sec - in org.apache.phoenix.end2end.GetSetByteBitFunctionEnd2EndIT
Running org.apache.phoenix.end2end.UpgradeIT
Tests run: 34, Failures: 0, Errors: 0, Skipped: 0, Time elapsed: 30.795 sec - in org.apache.phoenix.end2end.ArrayAppendFunctionIT
Running org.apache.phoenix.end2end.LnLogFunctionEnd2EndIT
Tests run: 8, Failures: 0, Errors: 0, Skipped: 0, Time elapsed: 20.089 sec - in org.apache.phoenix.end2end.TenantSpecificViewIndexIT
Running org.apache.phoenix.end2end.SpooledTmpFileDeleteIT
Tests run: 1, Failures: 0, Errors: 0, Skipped: 0, Time elapsed: 6.403 sec - in org.apache.phoenix.end2end.LnLogFunctionEnd2EndIT
Running org.apache.phoenix.end2end.SkipScanQueryIT
Tests run: 1, Failures: 0, Errors: 0, Skipped: 0, Time elapsed: 3.649 sec - in org.apache.phoenix.end2end.SpooledTmpFileDeleteIT
Running org.apache.phoenix.end2end.ArrayConcatFunctionIT
Tests run: 108, Failures: 0, Errors: 0, Skipped: 0, Time elapsed: 178.237 sec - in org.apache.phoenix.end2end.SortMergeJoinIT
Running org.apache.phoenix.end2end.DateTimeIT
Tests run: 9, Failures: 0, Errors: 0, Skipped: 0, Time elapsed: 19.72 sec - in org.apache.phoenix.end2end.SkipScanQueryIT
Running org.apache.phoenix.end2end.ArrayFillFunctionIT
Tests run: 111, Failures: 0, Errors: 0, Skipped: 0, Time elapsed: 173.269 sec - in org.apache.phoenix.end2end.HashJoinIT
Running org.apache.phoenix.end2end.QueryExecWithoutSCNIT
Tests run: 1, Failures: 0, Errors: 0, Skipped: 0, Time elapsed: 3.132 sec - in org.apache.phoenix.end2end.QueryExecWithoutSCNIT
Running org.apache.phoenix.end2end.SubqueryIT
Tests run: 19, Failures: 0, Errors: 0, Skipped: 0, Time elapsed: 12.14 sec - in org.apache.phoenix.end2end.DateTimeIT
Running org.apache.phoenix.trace.PhoenixTracingEndToEndIT
Tests run: 30, Failures: 0, Errors: 0, Skipped: 0, Time elapsed: 26.084 sec - in org.apache.phoenix.end2end.ArrayConcatFunctionIT
Tests run: 6, Failures: 0, Errors: 0, Skipped: 0, Time elapsed: 39.242 sec - in org.apache.phoenix.end2end.UpgradeIT
Running org.apache.phoenix.trace.PhoenixTraceReaderIT
Running org.apache.phoenix.trace.PhoenixTableMetricsWriterIT
Tests run: 2, Failures: 0, Errors: 0, Skipped: 0, Time elapsed: 0.766 sec - in org.apache.phoenix.trace.PhoenixTableMetricsWriterIT
Tests run: 2, Failures: 0, Errors: 0, Skipped: 0, Time elapsed: 1.557 sec - in org.apache.phoenix.trace.PhoenixTraceReaderIT
Tests run: 26, Failures: 0, Errors: 0, Skipped: 0, Time elapsed: 24.894 sec - in org.apache.phoenix.end2end.ArrayFillFunctionIT
Tests run: 21, Failures: 0, Errors: 0, Skipped: 0, Time elapsed: 50.578 sec - in org.apache.phoenix.end2end.SubqueryIT
Tests run: 6, Failures: 0, Errors: 0, Skipped: 0, Time elapsed: 84.586 sec - in org.apache.phoenix.trace.PhoenixTracingEndToEndIT

Results :

Tests run: 1208, Failures: 0, Errors: 0, Skipped: 4

[INFO] 
[INFO] --- maven-failsafe-plugin:2.19:integration-test (NeedTheirOwnClusterTests) @ phoenix-core ---

-------------------------------------------------------
 T E S T S
-------------------------------------------------------
Running org.apache.phoenix.rpc.PhoenixServerRpcIT
Running org.apache.phoenix.rpc.PhoenixClientRpcIT
Running org.apache.phoenix.monitoring.PhoenixMetricsIT
Running org.apache.phoenix.iterate.RoundRobinResultIteratorWithStatsIT
Tests run: 2, Failures: 0, Errors: 0, Skipped: 0, Time elapsed: 6.896 sec - in org.apache.phoenix.rpc.PhoenixClientRpcIT
Tests run: 1, Failures: 0, Errors: 0, Skipped: 0, Time elapsed: 15.339 sec - in org.apache.phoenix.iterate.RoundRobinResultIteratorWithStatsIT
Tests run: 2, Failures: 0, Errors: 0, Skipped: 0, Time elapsed: 17.22 sec - in org.apache.phoenix.rpc.PhoenixServerRpcIT
Running org.apache.phoenix.end2end.ConnectionUtilIT
Running org.apache.phoenix.mapreduce.IndexToolIT
Running org.apache.phoenix.mapreduce.CsvBulkLoadToolIT
Running org.apache.phoenix.end2end.MultiCfQueryExecIT
Tests run: 1, Failures: 0, Errors: 0, Skipped: 0, Time elapsed: 19.258 sec - in org.apache.phoenix.end2end.ConnectionUtilIT
Tests run: 7, Failures: 0, Errors: 0, Skipped: 0, Time elapsed: 18.715 sec - in org.apache.phoenix.end2end.MultiCfQueryExecIT
Tests run: 17, Failures: 2, Errors: 0, Skipped: 0, Time elapsed: 55.6 sec <<< FAILURE! - in org.apache.phoenix.monitoring.PhoenixMetricsIT
testMetricsForUpsertSelectWithAutoCommit(org.apache.phoenix.monitoring.PhoenixMetricsIT)  Time elapsed: 6.063 sec  <<< FAILURE!
java.lang.AssertionError: Unequal values for metric MUTATION_BYTES expected:<5600> but was:<16240>
	at org.apache.phoenix.monitoring.PhoenixMetricsIT.assertMetricsHaveSameValues(PhoenixMetricsIT.java:654)
	at org.apache.phoenix.monitoring.PhoenixMetricsIT.assertMetricsAreSame(PhoenixMetricsIT.java:643)
	at org.apache.phoenix.monitoring.PhoenixMetricsIT.testMetricsForUpsertSelectWithAutoCommit(PhoenixMetricsIT.java:462)

testMetricsForUpsertSelectSameTable(org.apache.phoenix.monitoring.PhoenixMetricsIT)  Time elapsed: 2.698 sec  <<< FAILURE!
java.lang.AssertionError: Unequal values for metric MUTATION_BYTES expected:<5600> but was:<16240>
	at org.apache.phoenix.monitoring.PhoenixMetricsIT.assertMetricsHaveSameValues(PhoenixMetricsIT.java:654)
	at org.apache.phoenix.monitoring.PhoenixMetricsIT.assertMetricsAreSame(PhoenixMetricsIT.java:643)
	at org.apache.phoenix.monitoring.PhoenixMetricsIT.testMetricsForUpsertSelectSameTable(PhoenixMetricsIT.java:615)

Running org.apache.phoenix.end2end.ViewIT
Running org.apache.phoenix.end2end.SaltedViewIT
Running org.apache.phoenix.end2end.StatsCollectorIT
Tests run: 2, Failures: 0, Errors: 0, Skipped: 0, Time elapsed: 20.621 sec - in org.apache.phoenix.end2end.SaltedViewIT
Running org.apache.phoenix.end2end.ParallelIteratorsIT
Tests run: 22, Failures: 0, Errors: 0, Skipped: 0, Time elapsed: 56.871 sec - in org.apache.phoenix.end2end.ViewIT
Tests run: 3, Failures: 0, Errors: 0, Skipped: 0, Time elapsed: 21.125 sec - in org.apache.phoenix.end2end.ParallelIteratorsIT
Running org.apache.phoenix.end2end.QueryWithLimitIT
Tests run: 4, Failures: 0, Errors: 0, Skipped: 0, Time elapsed: 58.419 sec - in org.apache.phoenix.end2end.StatsCollectorIT
Running org.apache.phoenix.end2end.QueryTimeoutIT
Tests run: 2, Failures: 0, Errors: 0, Skipped: 0, Time elapsed: 11.835 sec - in org.apache.phoenix.end2end.QueryWithLimitIT
Running org.apache.phoenix.end2end.ContextClassloaderIT
Tests run: 1, Failures: 0, Errors: 0, Skipped: 0, Time elapsed: 18.556 sec - in org.apache.phoenix.end2end.QueryTimeoutIT
Running org.apache.phoenix.end2end.index.MutableIndexFailureIT
Running org.apache.phoenix.end2end.index.ImmutableIndexWithStatsIT
Tests run: 3, Failures: 0, Errors: 0, Skipped: 0, Time elapsed: 6.955 sec - in org.apache.phoenix.end2end.ContextClassloaderIT
Tests run: 1, Failures: 0, Errors: 0, Skipped: 0, Time elapsed: 10.581 sec - in org.apache.phoenix.end2end.index.ImmutableIndexWithStatsIT
Running org.apache.phoenix.end2end.index.MutableIndexReplicationIT
Running org.apache.phoenix.end2end.UserDefinedFunctionsIT
Tests run: 3, Failures: 0, Errors: 0, Skipped: 2, Time elapsed: 35.053 sec - in org.apache.phoenix.end2end.index.MutableIndexFailureIT
Tests run: 1, Failures: 0, Errors: 0, Skipped: 0, Time elapsed: 19.097 sec - in org.apache.phoenix.end2end.index.MutableIndexReplicationIT
Tests run: 5, Failures: 0, Errors: 0, Skipped: 0, Time elapsed: 172.568 sec - in org.apache.phoenix.mapreduce.CsvBulkLoadToolIT
Tests run: 13, Failures: 0, Errors: 0, Skipped: 0, Time elapsed: 16.992 sec - in org.apache.phoenix.end2end.UserDefinedFunctionsIT
Running org.apache.phoenix.end2end.AlterTableIT
Running org.apache.phoenix.end2end.KeyOnlyIT
Running org.apache.phoenix.end2end.UnionAllIT
Running org.apache.phoenix.end2end.TenantSpecificTablesDDLIT
Tests run: 3, Failures: 0, Errors: 0, Skipped: 0, Time elapsed: 11.069 sec - in org.apache.phoenix.end2end.KeyOnlyIT
Running org.apache.phoenix.end2end.CountDistinctCompressionIT
Tests run: 12, Failures: 0, Errors: 0, Skipped: 0, Time elapsed: 29.011 sec - in org.apache.phoenix.end2end.UnionAllIT
Tests run: 1, Failures: 0, Errors: 0, Skipped: 0, Time elapsed: 11.794 sec - in org.apache.phoenix.end2end.CountDistinctCompressionIT
Tests run: 17, Failures: 0, Errors: 0, Skipped: 0, Time elapsed: 38.447 sec - in org.apache.phoenix.end2end.TenantSpecificTablesDDLIT
Running org.apache.phoenix.end2end.TenantSpecificTablesDMLIT
Running org.apache.phoenix.end2end.SpillableGroupByIT
Tests run: 1, Failures: 0, Errors: 0, Skipped: 0, Time elapsed: 7.9 sec - in org.apache.phoenix.end2end.SpillableGroupByIT
Running org.apache.phoenix.hbase.index.FailForUnsupportedHBaseVersionsIT
Running org.apache.phoenix.end2end.StatsCollectorWithSplitsAndMultiCFIT
Tests run: 2, Failures: 0, Errors: 0, Skipped: 0, Time elapsed: 17.08 sec - in org.apache.phoenix.hbase.index.FailForUnsupportedHBaseVersionsIT
Running org.apache.phoenix.hbase.index.covered.EndToEndCoveredColumnsIndexBuilderIT
Tests run: 2, Failures: 0, Errors: 0, Skipped: 0, Time elapsed: 28.959 sec - in org.apache.phoenix.end2end.StatsCollectorWithSplitsAndMultiCFIT
Tests run: 2, Failures: 0, Errors: 0, Skipped: 0, Time elapsed: 9.573 sec - in org.apache.phoenix.hbase.index.covered.EndToEndCoveredColumnsIndexBuilderIT
Running org.apache.phoenix.hbase.index.covered.example.FailWithoutRetriesIT
Tests run: 16, Failures: 0, Errors: 0, Skipped: 0, Time elapsed: 51.241 sec - in org.apache.phoenix.end2end.TenantSpecificTablesDMLIT
Running org.apache.phoenix.hbase.index.covered.example.EndtoEndIndexingWithCompressionIT
Tests run: 1, Failures: 0, Errors: 0, Skipped: 0, Time elapsed: 8.957 sec - in org.apache.phoenix.hbase.index.covered.example.FailWithoutRetriesIT
Running org.apache.phoenix.hbase.index.balancer.IndexLoadBalancerIT
Running org.apache.phoenix.hbase.index.covered.example.EndToEndCoveredIndexingIT
Tests run: 11, Failures: 0, Errors: 0, Skipped: 0, Time elapsed: 51.102 sec - in org.apache.phoenix.hbase.index.covered.example.EndtoEndIndexingWithCompressionIT
Tests run: 11, Failures: 0, Errors: 0, Skipped: 0, Time elapsed: 50.402 sec - in org.apache.phoenix.hbase.index.covered.example.EndToEndCoveredIndexingIT
Running org.apache.hadoop.hbase.regionserver.wal.WALReplayWithIndexWritesAndUncompressedWALInHBase_094_9_IT
Tests run: 9, Failures: 0, Errors: 0, Skipped: 0, Time elapsed: 362.413 sec - in org.apache.phoenix.mapreduce.IndexToolIT
Running org.apache.hadoop.hbase.regionserver.wal.WALReplayWithIndexWritesAndCompressedWALIT
Tests run: 1, Failures: 0, Errors: 0, Skipped: 0, Time elapsed: 16.79 sec - in org.apache.hadoop.hbase.regionserver.wal.WALReplayWithIndexWritesAndUncompressedWALInHBase_094_9_IT
Tests run: 1, Failures: 0, Errors: 0, Skipped: 0, Time elapsed: 17.477 sec - in org.apache.hadoop.hbase.regionserver.wal.WALReplayWithIndexWritesAndCompressedWALIT
Tests run: 9, Failures: 0, Errors: 0, Skipped: 0, Time elapsed: 103.176 sec - in org.apache.phoenix.hbase.index.balancer.IndexLoadBalancerIT
Tests run: 55, Failures: 0, Errors: 0, Skipped: 0, Time elapsed: 347.068 sec - in org.apache.phoenix.end2end.AlterTableIT
Running org.apache.phoenix.execute.PartialCommitIT
Tests run: 6, Failures: 0, Errors: 0, Skipped: 0, Time elapsed: 8.877 sec - in org.apache.phoenix.execute.PartialCommitIT

Results :

Failed tests: 
  PhoenixMetricsIT.testMetricsForUpsertSelectSameTable:615->assertMetricsAreSame:643->assertMetricsHaveSameValues:654 Unequal values for metric MUTATION_BYTES expected:<5600> but was:<16240>
  PhoenixMetricsIT.testMetricsForUpsertSelectWithAutoCommit:462->assertMetricsAreSame:643->assertMetricsHaveSameValues:654 Unequal values for metric MUTATION_BYTES expected:<5600> but was:<16240>

Tests run: 250, Failures: 2, Errors: 0, Skipped: 2

[INFO] 
[INFO] --- maven-failsafe-plugin:2.19:verify (ClientManagedTimeTests) @ phoenix-core ---
[INFO] ------------------------------------------------------------------------
[INFO] Reactor Summary:
[INFO] 
[INFO] Apache Phoenix .................................... SUCCESS [3.213s]
[INFO] Phoenix Core ...................................... FAILURE [46:26.058s]
[INFO] Phoenix - Flume ................................... SKIPPED
[INFO] Phoenix - Pig ..................................... SKIPPED
[INFO] Phoenix Query Server Client ....................... SKIPPED
[INFO] Phoenix Query Server .............................. SKIPPED
[INFO] Phoenix - Pherf ................................... SKIPPED
[INFO] Phoenix - Spark ................................... SKIPPED
[INFO] Phoenix Assembly .................................. SKIPPED
[INFO] Phoenix - Tracing Web Application ................. SKIPPED
[INFO] ------------------------------------------------------------------------
[INFO] BUILD FAILURE
[INFO] ------------------------------------------------------------------------
[INFO] Total time: 46:29.827s
[INFO] Finished at: Fri Nov 13 18:41:59 UTC 2015
[INFO] Final Memory: 61M/1230M
[INFO] ------------------------------------------------------------------------
[ERROR] Failed to execute goal org.apache.maven.plugins:maven-failsafe-plugin:2.19:verify (ClientManagedTimeTests) on project phoenix-core: There are test failures.
[ERROR] 
[ERROR] Please refer to <https://builds.apache.org/job/Phoenix-4.x-HBase-1.0/ws/phoenix-core/target/failsafe-reports> for the individual test results.
[ERROR] -> [Help 1]
[ERROR] 
[ERROR] To see the full stack trace of the errors, re-run Maven with the -e switch.
[ERROR] Re-run Maven using the -X switch to enable full debug logging.
[ERROR] 
[ERROR] For more information about the errors and possible solutions, please read the following articles:
[ERROR] [Help 1] http://cwiki.apache.org/confluence/display/MAVEN/MojoFailureException
[ERROR] 
[ERROR] After correcting the problems, you can resume the build with the command
[ERROR]   mvn <goals> -rf :phoenix-core
Build step 'Invoke top-level Maven targets' marked build as failure
Archiving artifacts
Compressed 1.21 GB of artifacts by 50.8% relative to #214
Recording test results

Jenkins build is back to normal : Phoenix-4.x-HBase-1.0 #223

Posted by Apache Jenkins Server <je...@builds.apache.org>.
See <https://builds.apache.org/job/Phoenix-4.x-HBase-1.0/223/changes>


Build failed in Jenkins: Phoenix-4.x-HBase-1.0 #222

Posted by Apache Jenkins Server <je...@builds.apache.org>.
See <https://builds.apache.org/job/Phoenix-4.x-HBase-1.0/222/changes>

Changes:

[samarth] Fix test failures due to use of priority queue for merge sort (Ankit

------------------------------------------
[...truncated 1389 lines...]
[INFO] Installing <https://builds.apache.org/job/Phoenix-4.x-HBase-1.0/222/artifact/phoenix-core/target/phoenix-core-4.7.0-HBase-1.0-SNAPSHOT-sources.jar> to /home/jenkins/.m2/repository/org/apache/phoenix/phoenix-core/4.7.0-HBase-1.0-SNAPSHOT/phoenix-core-4.7.0-HBase-1.0-SNAPSHOT-sources.jar
[INFO] Installing <https://builds.apache.org/job/Phoenix-4.x-HBase-1.0/222/artifact/phoenix-core/target/phoenix-core-4.7.0-HBase-1.0-SNAPSHOT-tests.jar> to /home/jenkins/.m2/repository/org/apache/phoenix/phoenix-core/4.7.0-HBase-1.0-SNAPSHOT/phoenix-core-4.7.0-HBase-1.0-SNAPSHOT-tests.jar
[INFO]                                                                         
[INFO] ------------------------------------------------------------------------
[INFO] Building Phoenix - Flume 4.7.0-HBase-1.0-SNAPSHOT
[INFO] ------------------------------------------------------------------------
[INFO] 
[INFO] --- maven-clean-plugin:2.5:clean (default-clean) @ phoenix-flume ---
[INFO] Deleting <https://builds.apache.org/job/Phoenix-4.x-HBase-1.0/ws/phoenix-flume/target>
[INFO] 
[INFO] --- maven-checkstyle-plugin:2.13:check (validate) @ phoenix-flume ---
[INFO] 
[INFO] --- build-helper-maven-plugin:1.9.1:add-test-source (add-test-source) @ phoenix-flume ---
[INFO] Test Source directory: <https://builds.apache.org/job/Phoenix-4.x-HBase-1.0/ws/phoenix-flume/src/it/java> added.
[INFO] 
[INFO] --- build-helper-maven-plugin:1.9.1:add-test-resource (add-test-resource) @ phoenix-flume ---
[INFO] 
[INFO] --- maven-remote-resources-plugin:1.5:process (default) @ phoenix-flume ---
[INFO] 
[INFO] --- maven-resources-plugin:2.6:resources (default-resources) @ phoenix-flume ---
[INFO] Using 'UTF-8' encoding to copy filtered resources.
[INFO] skip non existing resourceDirectory <https://builds.apache.org/job/Phoenix-4.x-HBase-1.0/ws/phoenix-flume/src/main/resources>
[INFO] Copying 3 resources
[INFO] 
[INFO] --- maven-compiler-plugin:3.0:compile (default-compile) @ phoenix-flume ---
[INFO] Changes detected - recompiling the module!
[INFO] Compiling 9 source files to <https://builds.apache.org/job/Phoenix-4.x-HBase-1.0/ws/phoenix-flume/target/classes>
[WARNING] <https://builds.apache.org/job/Phoenix-4.x-HBase-1.0/ws/phoenix-flume/src/main/java/org/apache/phoenix/flume/sink/PhoenixSink.java>: <https://builds.apache.org/job/Phoenix-4.x-HBase-1.0/ws/phoenix-flume/src/main/java/org/apache/phoenix/flume/sink/PhoenixSink.java> uses unchecked or unsafe operations.
[WARNING] <https://builds.apache.org/job/Phoenix-4.x-HBase-1.0/ws/phoenix-flume/src/main/java/org/apache/phoenix/flume/sink/PhoenixSink.java>: Recompile with -Xlint:unchecked for details.
[INFO] 
[INFO] --- maven-dependency-plugin:2.1:build-classpath (create-mrapp-generated-classpath) @ phoenix-flume ---
[INFO] Wrote classpath file '<https://builds.apache.org/job/Phoenix-4.x-HBase-1.0/ws/phoenix-flume/target/classes/mrapp-generated-classpath'.>
[INFO] 
[INFO] --- maven-resources-plugin:2.6:testResources (default-testResources) @ phoenix-flume ---
[INFO] Using 'UTF-8' encoding to copy filtered resources.
[INFO] skip non existing resourceDirectory <https://builds.apache.org/job/Phoenix-4.x-HBase-1.0/ws/phoenix-flume/src/test/resources>
[INFO] skip non existing resourceDirectory <https://builds.apache.org/job/Phoenix-4.x-HBase-1.0/ws/phoenix-flume/src/it/resources>
[INFO] Copying 3 resources
[INFO] 
[INFO] --- maven-compiler-plugin:3.0:testCompile (default-testCompile) @ phoenix-flume ---
[INFO] Changes detected - recompiling the module!
[INFO] Compiling 4 source files to <https://builds.apache.org/job/Phoenix-4.x-HBase-1.0/ws/phoenix-flume/target/test-classes>
[INFO] 
[INFO] --- maven-surefire-plugin:2.19:test (default-test) @ phoenix-flume ---
[INFO] 
[INFO] --- maven-source-plugin:2.2.1:jar-no-fork (attach-sources) @ phoenix-flume ---
[INFO] Building jar: <https://builds.apache.org/job/Phoenix-4.x-HBase-1.0/222/artifact/phoenix-flume/target/phoenix-flume-4.7.0-HBase-1.0-SNAPSHOT-sources.jar>
[INFO] 
[INFO] --- maven-jar-plugin:2.4:test-jar (default) @ phoenix-flume ---
[INFO] Building jar: <https://builds.apache.org/job/Phoenix-4.x-HBase-1.0/222/artifact/phoenix-flume/target/phoenix-flume-4.7.0-HBase-1.0-SNAPSHOT-tests.jar>
[INFO] 
[INFO] --- maven-jar-plugin:2.4:jar (default-jar) @ phoenix-flume ---
[INFO] Building jar: <https://builds.apache.org/job/Phoenix-4.x-HBase-1.0/222/artifact/phoenix-flume/target/phoenix-flume-4.7.0-HBase-1.0-SNAPSHOT.jar>
[INFO] 
[INFO] --- maven-site-plugin:3.2:attach-descriptor (attach-descriptor) @ phoenix-flume ---
[INFO] 
[INFO] --- maven-failsafe-plugin:2.19:integration-test (ClientManagedTimeTests) @ phoenix-flume ---

-------------------------------------------------------
 T E S T S
-------------------------------------------------------

Results :

Tests run: 0, Failures: 0, Errors: 0, Skipped: 0

[INFO] 
[INFO] --- maven-failsafe-plugin:2.19:integration-test (HBaseManagedTimeTests) @ phoenix-flume ---

-------------------------------------------------------
 T E S T S
-------------------------------------------------------
Running org.apache.phoenix.flume.PhoenixSinkIT
Running org.apache.phoenix.flume.RegexEventSerializerIT
Tests run: 9, Failures: 0, Errors: 0, Skipped: 0, Time elapsed: 9.783 sec - in org.apache.phoenix.flume.PhoenixSinkIT
Tests run: 6, Failures: 0, Errors: 0, Skipped: 0, Time elapsed: 31.401 sec - in org.apache.phoenix.flume.RegexEventSerializerIT

Results :

Tests run: 15, Failures: 0, Errors: 0, Skipped: 0

[INFO] 
[INFO] --- maven-failsafe-plugin:2.19:integration-test (NeedTheirOwnClusterTests) @ phoenix-flume ---

-------------------------------------------------------
 T E S T S
-------------------------------------------------------

Results :

Tests run: 0, Failures: 0, Errors: 0, Skipped: 0

[INFO] 
[INFO] --- maven-failsafe-plugin:2.19:verify (ClientManagedTimeTests) @ phoenix-flume ---
[INFO] 
[INFO] --- maven-failsafe-plugin:2.19:verify (HBaseManagedTimeTests) @ phoenix-flume ---
[INFO] 
[INFO] --- maven-failsafe-plugin:2.19:verify (NeedTheirOwnClusterTests) @ phoenix-flume ---
[INFO] 
[INFO] --- maven-install-plugin:2.5.1:install (default-install) @ phoenix-flume ---
[INFO] Installing <https://builds.apache.org/job/Phoenix-4.x-HBase-1.0/222/artifact/phoenix-flume/target/phoenix-flume-4.7.0-HBase-1.0-SNAPSHOT.jar> to /home/jenkins/.m2/repository/org/apache/phoenix/phoenix-flume/4.7.0-HBase-1.0-SNAPSHOT/phoenix-flume-4.7.0-HBase-1.0-SNAPSHOT.jar
[INFO] Installing <https://builds.apache.org/job/Phoenix-4.x-HBase-1.0/ws/phoenix-flume/pom.xml> to /home/jenkins/.m2/repository/org/apache/phoenix/phoenix-flume/4.7.0-HBase-1.0-SNAPSHOT/phoenix-flume-4.7.0-HBase-1.0-SNAPSHOT.pom
[INFO] Installing <https://builds.apache.org/job/Phoenix-4.x-HBase-1.0/222/artifact/phoenix-flume/target/phoenix-flume-4.7.0-HBase-1.0-SNAPSHOT-sources.jar> to /home/jenkins/.m2/repository/org/apache/phoenix/phoenix-flume/4.7.0-HBase-1.0-SNAPSHOT/phoenix-flume-4.7.0-HBase-1.0-SNAPSHOT-sources.jar
[INFO] Installing <https://builds.apache.org/job/Phoenix-4.x-HBase-1.0/222/artifact/phoenix-flume/target/phoenix-flume-4.7.0-HBase-1.0-SNAPSHOT-tests.jar> to /home/jenkins/.m2/repository/org/apache/phoenix/phoenix-flume/4.7.0-HBase-1.0-SNAPSHOT/phoenix-flume-4.7.0-HBase-1.0-SNAPSHOT-tests.jar
[INFO]                                                                         
[INFO] ------------------------------------------------------------------------
[INFO] Building Phoenix - Pig 4.7.0-HBase-1.0-SNAPSHOT
[INFO] ------------------------------------------------------------------------
[INFO] 
[INFO] --- maven-clean-plugin:2.5:clean (default-clean) @ phoenix-pig ---
[INFO] Deleting <https://builds.apache.org/job/Phoenix-4.x-HBase-1.0/ws/phoenix-pig/target>
[INFO] 
[INFO] --- maven-checkstyle-plugin:2.13:check (validate) @ phoenix-pig ---
[INFO] 
[INFO] --- build-helper-maven-plugin:1.9.1:add-test-source (add-test-source) @ phoenix-pig ---
[INFO] Test Source directory: <https://builds.apache.org/job/Phoenix-4.x-HBase-1.0/ws/phoenix-pig/src/it/java> added.
[INFO] 
[INFO] --- build-helper-maven-plugin:1.9.1:add-test-resource (add-test-resource) @ phoenix-pig ---
[INFO] 
[INFO] --- maven-remote-resources-plugin:1.5:process (default) @ phoenix-pig ---
[INFO] 
[INFO] --- maven-resources-plugin:2.6:resources (default-resources) @ phoenix-pig ---
[INFO] Using 'UTF-8' encoding to copy filtered resources.
[INFO] skip non existing resourceDirectory <https://builds.apache.org/job/Phoenix-4.x-HBase-1.0/ws/phoenix-pig/src/main/resources>
[INFO] Copying 3 resources
[INFO] 
[INFO] --- maven-compiler-plugin:3.0:compile (default-compile) @ phoenix-pig ---
[INFO] Changes detected - recompiling the module!
[INFO] Compiling 9 source files to <https://builds.apache.org/job/Phoenix-4.x-HBase-1.0/ws/phoenix-pig/target/classes>
[INFO] 
[INFO] --- maven-dependency-plugin:2.1:build-classpath (create-mrapp-generated-classpath) @ phoenix-pig ---
[INFO] Wrote classpath file '<https://builds.apache.org/job/Phoenix-4.x-HBase-1.0/ws/phoenix-pig/target/classes/mrapp-generated-classpath'.>
[INFO] 
[INFO] --- maven-resources-plugin:2.6:testResources (default-testResources) @ phoenix-pig ---
[INFO] Using 'UTF-8' encoding to copy filtered resources.
[INFO] skip non existing resourceDirectory <https://builds.apache.org/job/Phoenix-4.x-HBase-1.0/ws/phoenix-pig/src/test/resources>
[INFO] skip non existing resourceDirectory <https://builds.apache.org/job/Phoenix-4.x-HBase-1.0/ws/phoenix-pig/src/it/resources>
[INFO] Copying 3 resources
[INFO] 
[INFO] --- maven-compiler-plugin:3.0:testCompile (default-testCompile) @ phoenix-pig ---
[INFO] Changes detected - recompiling the module!
[INFO] Compiling 8 source files to <https://builds.apache.org/job/Phoenix-4.x-HBase-1.0/ws/phoenix-pig/target/test-classes>
[INFO] 
[INFO] --- maven-surefire-plugin:2.19:test (default-test) @ phoenix-pig ---

-------------------------------------------------------
 T E S T S
-------------------------------------------------------
Running org.apache.phoenix.pig.util.PhoenixPigSchemaUtilTest
Running org.apache.phoenix.pig.util.TableSchemaParserFunctionTest
Running org.apache.phoenix.pig.util.TypeUtilTest
Tests run: 3, Failures: 0, Errors: 0, Skipped: 0, Time elapsed: 0.13 sec - in org.apache.phoenix.pig.util.TableSchemaParserFunctionTest
Running org.apache.phoenix.pig.util.QuerySchemaParserFunctionTest
Tests run: 1, Failures: 0, Errors: 0, Skipped: 0, Time elapsed: 0.517 sec - in org.apache.phoenix.pig.util.TypeUtilTest
Running org.apache.phoenix.pig.util.SqlQueryToColumnInfoFunctionTest
Tests run: 2, Failures: 0, Errors: 0, Skipped: 0, Time elapsed: 0.67 sec - in org.apache.phoenix.pig.util.PhoenixPigSchemaUtilTest
Tests run: 4, Failures: 0, Errors: 0, Skipped: 0, Time elapsed: 2.242 sec - in org.apache.phoenix.pig.util.QuerySchemaParserFunctionTest
Tests run: 1, Failures: 0, Errors: 0, Skipped: 0, Time elapsed: 1.854 sec - in org.apache.phoenix.pig.util.SqlQueryToColumnInfoFunctionTest

Results :

Tests run: 11, Failures: 0, Errors: 0, Skipped: 0

[INFO] 
[INFO] --- maven-source-plugin:2.2.1:jar-no-fork (attach-sources) @ phoenix-pig ---
[INFO] Building jar: <https://builds.apache.org/job/Phoenix-4.x-HBase-1.0/222/artifact/phoenix-pig/target/phoenix-pig-4.7.0-HBase-1.0-SNAPSHOT-sources.jar>
[INFO] 
[INFO] --- maven-jar-plugin:2.4:test-jar (default) @ phoenix-pig ---
[INFO] Building jar: <https://builds.apache.org/job/Phoenix-4.x-HBase-1.0/222/artifact/phoenix-pig/target/phoenix-pig-4.7.0-HBase-1.0-SNAPSHOT-tests.jar>
[INFO] 
[INFO] --- maven-jar-plugin:2.4:jar (default-jar) @ phoenix-pig ---
[INFO] Building jar: <https://builds.apache.org/job/Phoenix-4.x-HBase-1.0/222/artifact/phoenix-pig/target/phoenix-pig-4.7.0-HBase-1.0-SNAPSHOT.jar>
[INFO] 
[INFO] --- maven-site-plugin:3.2:attach-descriptor (attach-descriptor) @ phoenix-pig ---
[INFO] 
[INFO] --- maven-failsafe-plugin:2.19:integration-test (ClientManagedTimeTests) @ phoenix-pig ---

-------------------------------------------------------
 T E S T S
-------------------------------------------------------

Results :

Tests run: 0, Failures: 0, Errors: 0, Skipped: 0

[INFO] 
[INFO] --- maven-failsafe-plugin:2.19:integration-test (HBaseManagedTimeTests) @ phoenix-pig ---

-------------------------------------------------------
 T E S T S
-------------------------------------------------------
Running org.apache.phoenix.pig.PhoenixHBaseStorerIT
Running org.apache.phoenix.pig.PhoenixHBaseLoaderIT
Running org.apache.phoenix.pig.udf.ReserveNSequenceTestIT
Tests run: 10, Failures: 0, Errors: 0, Skipped: 0, Time elapsed: 2.47 sec - in org.apache.phoenix.pig.udf.ReserveNSequenceTestIT
Tests run: 4, Failures: 0, Errors: 0, Skipped: 0, Time elapsed: 15.619 sec - in org.apache.phoenix.pig.PhoenixHBaseStorerIT
Tests run: 16, Failures: 0, Errors: 0, Skipped: 0, Time elapsed: 51.057 sec - in org.apache.phoenix.pig.PhoenixHBaseLoaderIT

Results :

Tests run: 30, Failures: 0, Errors: 0, Skipped: 0

[INFO] 
[INFO] --- maven-failsafe-plugin:2.19:integration-test (NeedTheirOwnClusterTests) @ phoenix-pig ---

-------------------------------------------------------
 T E S T S
-------------------------------------------------------

Results :

Tests run: 0, Failures: 0, Errors: 0, Skipped: 0

[INFO] 
[INFO] --- maven-failsafe-plugin:2.19:verify (ClientManagedTimeTests) @ phoenix-pig ---
[INFO] ------------------------------------------------------------------------
[INFO] Reactor Summary:
[INFO] 
[INFO] Apache Phoenix .................................... SUCCESS [3.701s]
[INFO] Phoenix Core ...................................... SUCCESS [46:15.577s]
[INFO] Phoenix - Flume ................................... SUCCESS [1:01.364s]
[INFO] Phoenix - Pig ..................................... FAILURE [1:45.720s]
[INFO] Phoenix Query Server Client ....................... SKIPPED
[INFO] Phoenix Query Server .............................. SKIPPED
[INFO] Phoenix - Pherf ................................... SKIPPED
[INFO] Phoenix - Spark ................................... SKIPPED
[INFO] Phoenix Assembly .................................. SKIPPED
[INFO] Phoenix - Tracing Web Application ................. SKIPPED
[INFO] ------------------------------------------------------------------------
[INFO] BUILD FAILURE
[INFO] ------------------------------------------------------------------------
[INFO] Total time: 49:06.970s
[INFO] Finished at: Fri Nov 13 19:35:13 UTC 2015
[INFO] Final Memory: 74M/995M
[INFO] ------------------------------------------------------------------------
[ERROR] Failed to execute goal org.apache.maven.plugins:maven-failsafe-plugin:2.19:verify (ClientManagedTimeTests) on project phoenix-pig: There was a timeout or other error in the fork -> [Help 1]
[ERROR] 
[ERROR] To see the full stack trace of the errors, re-run Maven with the -e switch.
[ERROR] Re-run Maven using the -X switch to enable full debug logging.
[ERROR] 
[ERROR] For more information about the errors and possible solutions, please read the following articles:
[ERROR] [Help 1] http://cwiki.apache.org/confluence/display/MAVEN/MojoExecutionException
[ERROR] 
[ERROR] After correcting the problems, you can resume the build with the command
[ERROR]   mvn <goals> -rf :phoenix-pig
Build step 'Invoke top-level Maven targets' marked build as failure
Archiving artifacts
Compressed 1.25 GB of artifacts by 51.8% relative to #214
Recording test results