You are viewing a plain text version of this content. The canonical link for it is here.
Posted to builds@beam.apache.org by Apache Jenkins Server <je...@builds.apache.org> on 2023/08/31 19:01:08 UTC
Build failed in Jenkins: beam_PostCommit_Java_DataflowV2 #3476
See <https://ci-beam.apache.org/job/beam_PostCommit_Java_DataflowV2/3476/display/redirect?page=changes>
Changes:
[noreply] Upgrade pylint, re-enable bad-builtins check (#28239)
------------------------------------------
[...truncated 65.96 KB...]
0 0 0 0 0 0 0 0 --:--:-- --:--:-- --:--:-- 0version.txt
NOTICES
profiler_java_agent.so
100 4183k 100 4183k 0 0 22.4M 0 --:--:-- --:--:-- --:--:-- 22.4M
> Task :sdks:java:container:goPrepare UP-TO-DATE
> Task :release:go-licenses:java:dockerRun
+ go-licenses csv github.com/apache/beam/sdks/v2/java/container
+ tee /output/licenses/list.csv
> Task :sdks:java:container:goBuild
/home/jenkins/go/bin/go1.21.0 build -o ./build/target/linux_amd64/boot boot.go boot_test.go pathingjar.go pathingjar_test.go
> Task :sdks:java:container:java8:copySdkHarnessLauncher
Execution optimizations have been disabled for task ':sdks:java:container:java8:copySdkHarnessLauncher' to ensure correctness due to the following reasons:
- Gradle detected a problem with the following location: '<https://ci-beam.apache.org/job/beam_PostCommit_Java_DataflowV2/ws/src/sdks/java/container/build/target'.> Reason: Task ':sdks:java:container:java8:copySdkHarnessLauncher' uses this output of task ':sdks:java:container:pullLicenses' without declaring an explicit or implicit dependency. This can lead to incorrect results being produced, depending on what order the tasks are executed. Please refer to https://docs.gradle.org/7.6.2/userguide/validation_problems.html#implicit_dependency for more details about this problem.
> Task :release:go-licenses:java:dockerRun
W0831 15:58:00.858131 85 library.go:101] "golang.org/x/sys/unix" contains non-Go code that can't be inspected for further dependencies:
/go/pkg/mod/golang.org/x/sys@v0.11.0/unix/asm_linux_amd64.s
github.com/apache/beam/sdks/v2/go,https://github.com/apache/beam/blob/sdks/v2.50.0/sdks/go/README.md,Apache-2.0
github.com/apache/beam/sdks/v2/java/container,https://github.com/apache/beam/blob/sdks/v2.50.0/sdks/LICENSE,Apache-2.0
github.com/golang/protobuf,https://github.com/golang/protobuf/blob/v1.5.3/LICENSE,BSD-3-Clause
golang.org/x/net,https://cs.opensource.google/go/x/net/+/v0.14.0:LICENSE,BSD-3-Clause
golang.org/x/sys/unix,https://cs.opensource.google/go/x/sys/+/v0.11.0:LICENSE,BSD-3-Clause
golang.org/x/text,https://cs.opensource.google/go/x/text/+/v0.12.0:LICENSE,BSD-3-Clause
google.golang.org/genproto/googleapis/rpc/status,https://github.com/googleapis/go-genproto/blob/23370e0ffb3e/googleapis/rpc/LICENSE,Apache-2.0
google.golang.org/grpc,https://github.com/grpc/grpc-go/blob/v1.57.0/LICENSE,Apache-2.0
google.golang.org/protobuf,https://github.com/protocolbuffers/protobuf-go/blob/v1.31.0/LICENSE,BSD-3-Clause
+ chmod -R a+w /output/licenses
> Task :release:go-licenses:java:createLicenses
> Task :sdks:java:container:java8:copyGolangLicenses
> Task :sdks:java:container:java8:dockerPrepare
> Task :sdks:java:container:java8:docker
#1 [internal] load build definition from Dockerfile
#1 transferring dockerfile: 2.58kB done
#1 DONE 0.0s
#2 [internal] load .dockerignore
#2 transferring context: 2B done
#2 DONE 0.0s
#3 [internal] load metadata for docker.io/library/eclipse-temurin:8
#3 DONE 0.3s
#4 [ 1/16] FROM docker.io/library/eclipse-temurin:8@sha256:2140fd8af96784eecdedaa72a18f5acb2b12359fb25db021cbdc3987a044466a
#4 resolve docker.io/library/eclipse-temurin:8@sha256:2140fd8af96784eecdedaa72a18f5acb2b12359fb25db021cbdc3987a044466a 0.0s done
#4 CACHED
#5 [internal] load build context
#5 transferring context: 47.19MB 0.4s done
#5 DONE 0.4s
#6 [ 2/16] ADD target/slf4j-api.jar /opt/apache/beam/jars/
#6 DONE 1.0s
#7 [ 3/16] ADD target/slf4j-jdk14.jar /opt/apache/beam/jars/
#7 DONE 0.1s
#8 [ 4/16] ADD target/jcl-over-slf4j.jar /opt/apache/beam/jars/
#8 DONE 0.1s
#9 [ 5/16] ADD target/log4j-over-slf4j.jar /opt/apache/beam/jars/
#9 DONE 0.0s
#10 [ 6/16] ADD target/log4j-to-slf4j.jar /opt/apache/beam/jars/
#10 DONE 0.1s
#11 [ 7/16] ADD target/beam-sdks-java-harness.jar /opt/apache/beam/jars/
#11 DONE 0.1s
#12 [ 8/16] COPY target/jamm.jar target/open-module-agent*.jar /opt/apache/beam/jars/
#12 DONE 0.1s
#13 [ 9/16] COPY target/linux_amd64/boot /opt/apache/beam/
#13 DONE 0.2s
#14 [10/16] COPY target/LICENSE /opt/apache/beam/
#14 DONE 0.1s
#15 [11/16] COPY target/NOTICE /opt/apache/beam/
#15 DONE 0.1s
#16 [12/16] ADD target/third_party_licenses /opt/apache/beam/third_party_licenses/
#16 DONE 0.2s
#17 [13/16] COPY target/LICENSE target/options/* /opt/apache/beam/options/
#17 DONE 0.1s
#18 [14/16] COPY target/go-licenses/* /opt/apache/beam/third_party_licenses/golang/
#18 DONE 0.1s
#19 [15/16] RUN if [ "true" = "false" ] ; then rm -rf /opt/apache/beam/third_party_licenses ; fi
#19 DONE 0.5s
#20 [16/16] COPY target/profiler/* /opt/google_cloud_profiler/
#20 DONE 0.1s
#21 exporting to image
#21 exporting layers
#21 exporting layers 0.2s done
#21 writing image sha256:a582ebe2b81b0ceed120e46b87b55408ba0855e2b679eeff4be18c2937fd78af
#21 writing image sha256:a582ebe2b81b0ceed120e46b87b55408ba0855e2b679eeff4be18c2937fd78af done
#21 naming to docker.io/apache/beam_java8_sdk:2.51.0.dev done
#21 DONE 0.3s
> Task :runners:google-cloud-dataflow-java:buildAndPushDockerJavaContainer
WARNING: `gcloud docker` will not be supported for Docker client versions above 18.03.
As an alternative, use `gcloud auth configure-docker` to configure `docker` to
use `gcloud` as a credential helper, then use `docker` as you would for non-GCR
registries, e.g. `docker pull gcr.io/project-id/my-image`. Add
`--verbosity=error` to silence this warning: `gcloud docker
--verbosity=error -- pull gcr.io/project-id/my-image`.
See: https://cloud.google.com/container-registry/docs/support/deprecation-notices#gcloud-docker
The push refers to repository [us.gcr.io/apache-beam-testing/java-postcommit-it/java]
445da476bfc0: Preparing
5f70bf18a086: Preparing
9a188add2c22: Preparing
a01a4f1ec241: Preparing
5307de98035f: Preparing
a2e23eba5331: Preparing
1d9b1c444ccf: Preparing
4d1771ca631f: Preparing
ffed6d80c642: Preparing
9909b16df3b4: Preparing
499d1c2f74a6: Preparing
4d321bacc96b: Preparing
41717190a859: Preparing
9bf0df8dbb0b: Preparing
a2e23eba5331: Waiting
1d9b1c444ccf: Waiting
14cce561117d: Preparing
4d1771ca631f: Waiting
73ccf7ab8893: Preparing
ffed6d80c642: Waiting
8d645240aa1f: Preparing
41717190a859: Waiting
448d6b995622: Preparing
9bf0df8dbb0b: Waiting
14cce561117d: Waiting
4d321bacc96b: Waiting
499d1c2f74a6: Waiting
73ccf7ab8893: Waiting
da3efb8b12ef: Preparing
bce45ce613d3: Preparing
da3efb8b12ef: Waiting
5f70bf18a086: Layer already exists
9a188add2c22: Pushed
a2e23eba5331: Pushed
a01a4f1ec241: Pushed
5307de98035f: Pushed
445da476bfc0: Pushed
1d9b1c444ccf: Pushed
ffed6d80c642: Pushed
499d1c2f74a6: Pushed
4d1771ca631f: Pushed
9909b16df3b4: Pushed
73ccf7ab8893: Layer already exists
8d645240aa1f: Layer already exists
4d321bacc96b: Pushed
448d6b995622: Layer already exists
bce45ce613d3: Layer already exists
da3efb8b12ef: Layer already exists
41717190a859: Pushed
9bf0df8dbb0b: Pushed
14cce561117d: Pushed
20230831155737: digest: sha256:dc87652b64bfac7952abeef4e0f249595ebcc0ebb6fbaf75f0395e4afcfefe70 size: 4504
> Task :runners:google-cloud-dataflow-java:coreSDKJavaRunnerV2IntegrationTest NO-SOURCE
> Task :runners:google-cloud-dataflow-java:examplesJavaRunnerV2IntegrationTest
***********************************************************
***********************************************************
**********************Set Up Pubsub************************
The Pub/Sub topic has been set up for this example: projects/apache-beam-testing/topics/testpipeline-jenkins-0831155830-3553dc1e
The Pub/Sub subscription has been set up for this example: projects/apache-beam-testing/subscriptions/testpipeline-jenkins-0831155830-3553dc1e
*************************Tear Down*************************
The Pub/Sub topic has been deleted: projects/apache-beam-testing/topics/testpipeline-jenkins-0831155830-3553dc1e
The Pub/Sub subscription has been deleted: projects/apache-beam-testing/subscriptions/testpipeline-jenkins-0831155830-3553dc1e
***********************************************************
***********************************************************
***********************************************************
***********************************************************
**********************Set Up Pubsub************************
The Pub/Sub topic has been set up for this example: projects/apache-beam-testing/topics/testpipeline-jenkins-0831155830-6e2807c1
The Pub/Sub subscription has been set up for this example: projects/apache-beam-testing/subscriptions/testpipeline-jenkins-0831155830-6e2807c1
*************************Tear Down*************************
The Pub/Sub topic has been deleted: projects/apache-beam-testing/topics/testpipeline-jenkins-0831155830-6e2807c1
The Pub/Sub subscription has been deleted: projects/apache-beam-testing/subscriptions/testpipeline-jenkins-0831155830-6e2807c1
***********************************************************
***********************************************************
> Task :runners:google-cloud-dataflow-java:googleCloudPlatformRunnerV2IntegrationTest
org.apache.beam.sdk.io.gcp.bigquery.StorageApiSinkRowUpdateIT > testCdc FAILED
org.apache.beam.sdk.Pipeline$PipelineExecutionException at StorageApiSinkRowUpdateIT.java:118
Caused by: java.lang.RuntimeException at StorageApiWriteUnshardedRecords.java:734
137 tests completed, 1 failed, 25 skipped
> Task :runners:google-cloud-dataflow-java:googleCloudPlatformRunnerV2IntegrationTest FAILED
> Task :runners:google-cloud-dataflow-java:cleanUpDockerJavaImages
Untagged: us.gcr.io/apache-beam-testing/java-postcommit-it/java:20230831155737
Untagged: us.gcr.io/apache-beam-testing/java-postcommit-it/java@sha256:dc87652b64bfac7952abeef4e0f249595ebcc0ebb6fbaf75f0395e4afcfefe70
Deleted: sha256:a582ebe2b81b0ceed120e46b87b55408ba0855e2b679eeff4be18c2937fd78af
WARNING: Successfully resolved tag to sha256, but it is recommended to use sha256 directly.
Tag: [us.gcr.io/apache-beam-testing/java-postcommit-it/java:20230831155737]
- referencing digest: [us.gcr.io/apache-beam-testing/java-postcommit-it/java@sha256:dc87652b64bfac7952abeef4e0f249595ebcc0ebb6fbaf75f0395e4afcfefe70]
Deleted [[us.gcr.io/apache-beam-testing/java-postcommit-it/java:20230831155737] (referencing [us.gcr.io/apache-beam-testing/java-postcommit-it/java@sha256:dc87652b64bfac7952abeef4e0f249595ebcc0ebb6fbaf75f0395e4afcfefe70])].
Removing untagged image us.gcr.io/apache-beam-testing/java-postcommit-it/java@sha256:dc87652b64bfac7952abeef4e0f249595ebcc0ebb6fbaf75f0395e4afcfefe70
FAILURE: Build failed with an exception.
* What went wrong:
Execution failed for task ':runners:google-cloud-dataflow-java:googleCloudPlatformRunnerV2IntegrationTest'.
> There were failing tests. See the report at: file://<https://ci-beam.apache.org/job/beam_PostCommit_Java_DataflowV2/ws/src/runners/google-cloud-dataflow-java/build/reports/tests/googleCloudPlatformRunnerV2IntegrationTest/index.html>
* Try:
> Run with --stacktrace option to get the stack trace.
> Run with --info or --debug option to get more log output.
* Get more help at https://help.gradle.org
Deprecated Gradle features were used in this build, making it incompatible with Gradle 8.0.
You can use '--warning-mode all' to show the individual deprecation warnings and determine if they come from your own scripts or plugins.
See https://docs.gradle.org/7.6.2/userguide/command_line_interface.html#sec:command_line_warnings
Execution optimizations have been disabled for 1 invalid unit(s) of work during this build to ensure correctness.
Please consult deprecation warnings for more details.
BUILD FAILED in 3h 3m 43s
156 actionable tasks: 98 executed, 54 from cache, 4 up-to-date
Publishing build scan...
https://ge.apache.org/s/htekpiei2mlew
Build step 'Invoke Gradle script' changed build result to FAILURE
Build step 'Invoke Gradle script' marked build as failure
---------------------------------------------------------------------
To unsubscribe, e-mail: builds-unsubscribe@beam.apache.org
For additional commands, e-mail: builds-help@beam.apache.org
Jenkins build is back to normal : beam_PostCommit_Java_DataflowV2 #3477
Posted by Apache Jenkins Server <je...@builds.apache.org>.
See <https://ci-beam.apache.org/job/beam_PostCommit_Java_DataflowV2/3477/display/redirect>
---------------------------------------------------------------------
To unsubscribe, e-mail: builds-unsubscribe@beam.apache.org
For additional commands, e-mail: builds-help@beam.apache.org