You are viewing a plain text version of this content. The canonical link for it is here.
Posted to dev@kafka.apache.org by Apache Jenkins Server <je...@builds.apache.org> on 2021/03/05 15:05:08 UTC
Build failed in Jenkins: Kafka » kafka-trunk-jdk8 #546
See <https://ci-builds.apache.org/job/Kafka/job/kafka-trunk-jdk8/546/display/redirect?page=changes>
Changes:
[github] MINOR: Update log level in SaslServerAuthenticator (#10270)
------------------------------------------
[...truncated 3.66 MB...]
LogTest > testDeleteSnapshotsOnIncrementLogStartOffset() STARTED
LogTest > testDeleteSnapshotsOnIncrementLogStartOffset() PASSED
LogTest > testCorruptIndexRebuild() STARTED
LogTest > testCorruptIndexRebuild() PASSED
LogTest > shouldDeleteTimeBasedSegmentsReadyToBeDeleted() STARTED
LogTest > shouldDeleteTimeBasedSegmentsReadyToBeDeleted() PASSED
LogTest > testReadWithTooSmallMaxLength() STARTED
LogTest > testReadWithTooSmallMaxLength() PASSED
LogTest > testOverCompactedLogRecovery() STARTED
LogTest > testOverCompactedLogRecovery() PASSED
LogTest > testBogusIndexSegmentsAreRemoved() STARTED
LogTest > testBogusIndexSegmentsAreRemoved() PASSED
LogTest > testLeaderEpochCacheClearedAfterStaticMessageFormatDowngrade() STARTED
LogTest > testLeaderEpochCacheClearedAfterStaticMessageFormatDowngrade() PASSED
LogTest > testCompressedMessages() STARTED
LogTest > testCompressedMessages() PASSED
LogTest > testAppendMessageWithNullPayload() STARTED
LogTest > testAppendMessageWithNullPayload() PASSED
LogTest > testCorruptLog() STARTED
LogTest > testCorruptLog() PASSED
LogTest > testLogRecoversToCorrectOffset() STARTED
LogTest > testLogRecoversToCorrectOffset() PASSED
LogTest > testReopenThenTruncate() STARTED
LogTest > testReopenThenTruncate() PASSED
LogTest > testZombieCoordinatorFenced() STARTED
LogTest > testZombieCoordinatorFenced() PASSED
LogTest > testOldProducerEpoch() STARTED
LogTest > testOldProducerEpoch() PASSED
LogTest > testProducerSnapshotsRecoveryAfterUncleanShutdownV1() STARTED
LogTest > testProducerSnapshotsRecoveryAfterUncleanShutdownV1() PASSED
LogTest > testDegenerateSegmentSplit() STARTED
LogTest > testDegenerateSegmentSplit() PASSED
LogTest > testParseTopicPartitionNameForMissingPartition() STARTED
LogTest > testParseTopicPartitionNameForMissingPartition() PASSED
LogTest > testParseTopicPartitionNameForEmptyName() STARTED
LogTest > testParseTopicPartitionNameForEmptyName() PASSED
LogTest > testOffsetSnapshot() STARTED
LogTest > testOffsetSnapshot() PASSED
LogTest > testOpenDeletesObsoleteFiles() STARTED
LogTest > testOpenDeletesObsoleteFiles() PASSED
LogTest > shouldUpdateOffsetForLeaderEpochsWhenDeletingSegments() STARTED
LogTest > shouldUpdateOffsetForLeaderEpochsWhenDeletingSegments() PASSED
LogTest > testLogDeleteDirName() STARTED
LogTest > testLogDeleteDirName() PASSED
LogTest > testDeleteOldSegments() STARTED
LogTest > testDeleteOldSegments() PASSED
LogTest > testRebuildTimeIndexForOldMessages() STARTED
LogTest > testRebuildTimeIndexForOldMessages() PASSED
LogTest > testProducerIdMapTruncateTo() STARTED
LogTest > testProducerIdMapTruncateTo() PASSED
LogTest > testTakeSnapshotOnRollAndDeleteSnapshotOnRecoveryPointCheckpoint() STARTED
LogTest > testTakeSnapshotOnRollAndDeleteSnapshotOnRecoveryPointCheckpoint() PASSED
LogTest > testLogEndLessThanStartAfterReopen() STARTED
LogTest > testLogEndLessThanStartAfterReopen() PASSED
LogTest > testLogRecoversForLeaderEpoch() STARTED
LogTest > testLogRecoversForLeaderEpoch() PASSED
LogTest > testRetentionDeletesProducerStateSnapshots() STARTED
LogTest > testRetentionDeletesProducerStateSnapshots() PASSED
LogTest > testLoadingLogDeletesProducerStateSnapshotsPastLogEndOffset() STARTED
LogTest > testLoadingLogDeletesProducerStateSnapshotsPastLogEndOffset() PASSED
LogTest > testRetentionIdempotency() STARTED
LogTest > testRetentionIdempotency() PASSED
LogTest > testWriteLeaderEpochCheckpointAfterDirectoryRename() STARTED
LogTest > testWriteLeaderEpochCheckpointAfterDirectoryRename() PASSED
LogTest > testOverCompactedLogRecoveryMultiRecord() STARTED
LogTest > testOverCompactedLogRecoveryMultiRecord() PASSED
LogTest > testSizeBasedLogRoll() STARTED
LogTest > testSizeBasedLogRoll() PASSED
LogTest > testRebuildProducerIdMapWithCompactedData() STARTED
LogTest > testRebuildProducerIdMapWithCompactedData() PASSED
LogTest > shouldNotDeleteSizeBasedSegmentsWhenUnderRetentionSize() STARTED
LogTest > shouldNotDeleteSizeBasedSegmentsWhenUnderRetentionSize() PASSED
LogTest > testTransactionIndexUpdatedThroughReplication() STARTED
LogTest > testTransactionIndexUpdatedThroughReplication() PASSED
LogTest > testTimeBasedLogRollJitter() STARTED
LogTest > testTimeBasedLogRollJitter() PASSED
LogTest > testParseTopicPartitionName() STARTED
LogTest > testParseTopicPartitionName() PASSED
LogTest > testEndTxnWithFencedProducerEpoch() STARTED
LogTest > testEndTxnWithFencedProducerEpoch() PASSED
LogTest > testRecoveryOfSegmentWithOffsetOverflow() STARTED
LogTest > testRecoveryOfSegmentWithOffsetOverflow() PASSED
LogTest > testRecoverAfterNonMonotonicCoordinatorEpochWrite() STARTED
LogTest > testRecoverAfterNonMonotonicCoordinatorEpochWrite() PASSED
LogTest > testLoadProducersAfterDeleteRecordsMidSegment() STARTED
LogTest > testLoadProducersAfterDeleteRecordsMidSegment() PASSED
LogTest > testInitializationOfProducerSnapshotsUpgradePath() STARTED
LogTest > testInitializationOfProducerSnapshotsUpgradePath() PASSED
LogTest > shouldDeleteStartOffsetBreachedSegmentsWhenPolicyDoesNotIncludeDelete() STARTED
LogTest > shouldDeleteStartOffsetBreachedSegmentsWhenPolicyDoesNotIncludeDelete() PASSED
LogTest > testSkipLoadingIfEmptyProducerStateBeforeTruncation() STARTED
LogTest > testSkipLoadingIfEmptyProducerStateBeforeTruncation() PASSED
LogTest > testTruncateTo() STARTED
LogTest > testTruncateTo() PASSED
LogTest > testSkipTruncateAndReloadIfNewMessageFormatAndCleanShutdown() STARTED
LogTest > testSkipTruncateAndReloadIfNewMessageFormatAndCleanShutdown() PASSED
LogTest > shouldApplyEpochToMessageOnAppendIfLeader() STARTED
LogTest > shouldApplyEpochToMessageOnAppendIfLeader() PASSED
LogTest > testLogDeletionAfterClose() STARTED
LogTest > testLogDeletionAfterClose() PASSED
LogTest > testLoadProducersAfterDeleteRecordsOnSegment() STARTED
LogTest > testLoadProducersAfterDeleteRecordsOnSegment() PASSED
LogTest > testAppendToOrReadFromLogInFailedLogDir() STARTED
LogTest > testAppendToOrReadFromLogInFailedLogDir() PASSED
LogTest > testCleanShutdownFile() STARTED
LogTest > testCleanShutdownFile() PASSED
LogTest > testTransactionIndexUpdated() STARTED
LogTest > testTransactionIndexUpdated() PASSED
LogTest > testBuildTimeIndexWhenNotAssigningOffsets() STARTED
LogTest > testBuildTimeIndexWhenNotAssigningOffsets() PASSED
LogTest > testProducerExpireCheckAfterDelete() STARTED
LogTest > testProducerExpireCheckAfterDelete() PASSED
3456 tests completed, 1 failed, 7 skipped
> Task :core:test FAILED
FAILURE: Build failed with an exception.
* What went wrong:
Execution failed for task ':core:test'.
> There were failing tests. See the report at: file://<https://ci-builds.apache.org/job/Kafka/job/kafka-trunk-jdk8/ws/core/build/reports/tests/test/index.html>
* Try:
Run with --stacktrace option to get the stack trace. Run with --info or --debug option to get more log output. Run with --scan to get full insights.
* Get more help at https://help.gradle.org
Deprecated Gradle features were used in this build, making it incompatible with Gradle 7.0.
Use '--warning-mode all' to show the individual deprecation warnings.
See https://docs.gradle.org/6.8.3/userguide/command_line_interface.html#sec:command_line_warnings
BUILD FAILED in 1h 37m 24s
257 actionable tasks: 220 executed, 37 up-to-date
Build step 'Execute shell' marked build as failure
Recording test results
Not sending mail to unregistered user github@hugo-hirsch.de
Jenkins build is back to normal : Kafka » kafka-trunk-jdk8 #553
Posted by Apache Jenkins Server <je...@builds.apache.org>.
See <https://ci-builds.apache.org/job/Kafka/job/kafka-trunk-jdk8/553/display/redirect?page=changes>
Build failed in Jenkins: Kafka » kafka-trunk-jdk8 #552
Posted by Apache Jenkins Server <je...@builds.apache.org>.
See <https://ci-builds.apache.org/job/Kafka/job/kafka-trunk-jdk8/552/display/redirect?page=changes>
Changes:
[github] MINOR: Add missing log argument (#10262)
------------------------------------------
[...truncated 7.31 MB...]
KafkaZkClientTest > testCreateRecursive() STARTED
KafkaZkClientTest > testCreateRecursive() PASSED
KafkaZkClientTest > testGetConsumerOffsetNoData() STARTED
KafkaZkClientTest > testGetConsumerOffsetNoData() PASSED
KafkaZkClientTest > testDeleteTopicPathMethods() STARTED
KafkaZkClientTest > testDeleteTopicPathMethods() PASSED
KafkaZkClientTest > testSetTopicPartitionStatesRaw() STARTED
KafkaZkClientTest > testSetTopicPartitionStatesRaw() PASSED
KafkaZkClientTest > testAclManagementMethods() STARTED
KafkaZkClientTest > testAclManagementMethods() PASSED
KafkaZkClientTest > testPreferredReplicaElectionMethods() STARTED
KafkaZkClientTest > testPreferredReplicaElectionMethods() PASSED
KafkaZkClientTest > testPropagateLogDir() STARTED
KafkaZkClientTest > testPropagateLogDir() PASSED
KafkaZkClientTest > testGetDataAndStat() STARTED
KafkaZkClientTest > testGetDataAndStat() PASSED
KafkaZkClientTest > testReassignPartitionsInProgress() STARTED
KafkaZkClientTest > testReassignPartitionsInProgress() PASSED
KafkaZkClientTest > testCreateTopLevelPaths() STARTED
KafkaZkClientTest > testCreateTopLevelPaths() PASSED
KafkaZkClientTest > testGetAllTopicsInClusterDoesNotTriggerWatch() STARTED
KafkaZkClientTest > testGetAllTopicsInClusterDoesNotTriggerWatch() PASSED
KafkaZkClientTest > testIsrChangeNotificationGetters() STARTED
KafkaZkClientTest > testIsrChangeNotificationGetters() PASSED
KafkaZkClientTest > testLogDirEventNotificationsDeletion() STARTED
KafkaZkClientTest > testLogDirEventNotificationsDeletion() PASSED
KafkaZkClientTest > testGetLogConfigs() STARTED
KafkaZkClientTest > testGetLogConfigs() PASSED
KafkaZkClientTest > testBrokerSequenceIdMethods() STARTED
KafkaZkClientTest > testBrokerSequenceIdMethods() PASSED
KafkaZkClientTest > testAclMethods() STARTED
KafkaZkClientTest > testAclMethods() PASSED
KafkaZkClientTest > testCreateSequentialPersistentPath() STARTED
KafkaZkClientTest > testCreateSequentialPersistentPath() PASSED
KafkaZkClientTest > testConditionalUpdatePath() STARTED
KafkaZkClientTest > testConditionalUpdatePath() PASSED
KafkaZkClientTest > testGetAllTopicsInClusterTriggersWatch() STARTED
KafkaZkClientTest > testGetAllTopicsInClusterTriggersWatch() PASSED
KafkaZkClientTest > testDeleteTopicZNode() STARTED
KafkaZkClientTest > testDeleteTopicZNode() PASSED
KafkaZkClientTest > testDeletePath() STARTED
KafkaZkClientTest > testDeletePath() PASSED
KafkaZkClientTest > testGetBrokerMethods() STARTED
KafkaZkClientTest > testGetBrokerMethods() PASSED
KafkaZkClientTest > testCreateTokenChangeNotification() STARTED
KafkaZkClientTest > testCreateTokenChangeNotification() PASSED
KafkaZkClientTest > testGetTopicsAndPartitions() STARTED
KafkaZkClientTest > testGetTopicsAndPartitions() PASSED
KafkaZkClientTest > testRegisterBrokerInfo() STARTED
KafkaZkClientTest > testRegisterBrokerInfo() PASSED
KafkaZkClientTest > testRetryRegisterBrokerInfo() STARTED
KafkaZkClientTest > testRetryRegisterBrokerInfo() PASSED
KafkaZkClientTest > testConsumerOffsetPath() STARTED
KafkaZkClientTest > testConsumerOffsetPath() PASSED
KafkaZkClientTest > testDeleteRecursiveWithControllerEpochVersionCheck() STARTED
KafkaZkClientTest > testDeleteRecursiveWithControllerEpochVersionCheck() PASSED
KafkaZkClientTest > testTopicAssignments() STARTED
KafkaZkClientTest > testTopicAssignments() PASSED
KafkaZkClientTest > testControllerManagementMethods() STARTED
KafkaZkClientTest > testControllerManagementMethods() PASSED
KafkaZkClientTest > testTopicAssignmentMethods() STARTED
KafkaZkClientTest > testTopicAssignmentMethods() PASSED
KafkaZkClientTest > testConnectionViaNettyClient() STARTED
KafkaZkClientTest > testConnectionViaNettyClient() PASSED
KafkaZkClientTest > testPropagateIsrChanges() STARTED
KafkaZkClientTest > testPropagateIsrChanges() PASSED
KafkaZkClientTest > testControllerEpochMethods() STARTED
KafkaZkClientTest > testControllerEpochMethods() PASSED
KafkaZkClientTest > testDeleteRecursive() STARTED
KafkaZkClientTest > testDeleteRecursive() PASSED
KafkaZkClientTest > testGetTopicPartitionStates() STARTED
KafkaZkClientTest > testGetTopicPartitionStates() PASSED
KafkaZkClientTest > testCreateConfigChangeNotification() STARTED
KafkaZkClientTest > testCreateConfigChangeNotification() PASSED
KafkaZkClientTest > testDelegationTokenMethods() STARTED
KafkaZkClientTest > testDelegationTokenMethods() PASSED
LiteralAclStoreTest > shouldHaveCorrectPaths() STARTED
LiteralAclStoreTest > shouldHaveCorrectPaths() PASSED
LiteralAclStoreTest > shouldRoundTripChangeNode() STARTED
LiteralAclStoreTest > shouldRoundTripChangeNode() PASSED
LiteralAclStoreTest > shouldThrowFromEncodeOnNoneLiteral() STARTED
LiteralAclStoreTest > shouldThrowFromEncodeOnNoneLiteral() PASSED
LiteralAclStoreTest > shouldWriteChangesToTheWritePath() STARTED
LiteralAclStoreTest > shouldWriteChangesToTheWritePath() PASSED
LiteralAclStoreTest > shouldHaveCorrectPatternType() STARTED
LiteralAclStoreTest > shouldHaveCorrectPatternType() PASSED
LiteralAclStoreTest > shouldDecodeResourceUsingTwoPartLogic() STARTED
LiteralAclStoreTest > shouldDecodeResourceUsingTwoPartLogic() PASSED
ReassignPartitionsZNodeTest > testDecodeInvalidJson() STARTED
ReassignPartitionsZNodeTest > testDecodeInvalidJson() PASSED
ReassignPartitionsZNodeTest > testEncode() STARTED
ReassignPartitionsZNodeTest > testEncode() PASSED
ReassignPartitionsZNodeTest > testDecodeValidJson() STARTED
ReassignPartitionsZNodeTest > testDecodeValidJson() PASSED
ControllerContextTest > testPartitionFullReplicaAssignmentReturnsEmptyAssignmentIfTopicOrPartitionDoesNotExist() STARTED
ControllerContextTest > testPartitionFullReplicaAssignmentReturnsEmptyAssignmentIfTopicOrPartitionDoesNotExist() PASSED
ControllerContextTest > testPartitionReplicaAssignmentForTopicReturnsEmptyMapIfTopicDoesNotExist() STARTED
ControllerContextTest > testPartitionReplicaAssignmentForTopicReturnsEmptyMapIfTopicDoesNotExist() PASSED
ControllerContextTest > testPreferredReplicaImbalanceMetric() STARTED
ControllerContextTest > testPreferredReplicaImbalanceMetric() PASSED
ControllerContextTest > testPartitionReplicaAssignmentForTopicReturnsExpectedReplicaAssignments() STARTED
ControllerContextTest > testPartitionReplicaAssignmentForTopicReturnsExpectedReplicaAssignments() PASSED
ControllerContextTest > testReassignTo() STARTED
ControllerContextTest > testReassignTo() PASSED
ControllerContextTest > testPartitionReplicaAssignment() STARTED
ControllerContextTest > testPartitionReplicaAssignment() PASSED
ControllerContextTest > testUpdatePartitionFullReplicaAssignmentUpdatesReplicaAssignment() STARTED
ControllerContextTest > testUpdatePartitionFullReplicaAssignmentUpdatesReplicaAssignment() PASSED
ControllerContextTest > testReassignToIdempotence() STARTED
ControllerContextTest > testReassignToIdempotence() PASSED
ControllerContextTest > testPartitionReplicaAssignmentReturnsEmptySeqIfTopicOrPartitionDoesNotExist() STARTED
ControllerContextTest > testPartitionReplicaAssignmentReturnsEmptySeqIfTopicOrPartitionDoesNotExist() PASSED
3471 tests completed, 1 failed, 7 skipped
> Task :core:test FAILED
FAILURE: Build failed with an exception.
* What went wrong:
Execution failed for task ':core:test'.
> There were failing tests. See the report at: file://<https://ci-builds.apache.org/job/Kafka/job/kafka-trunk-jdk8/ws/core/build/reports/tests/test/index.html>
* Try:
Run with --stacktrace option to get the stack trace. Run with --info or --debug option to get more log output. Run with --scan to get full insights.
* Get more help at https://help.gradle.org
Deprecated Gradle features were used in this build, making it incompatible with Gradle 7.0.
Use '--warning-mode all' to show the individual deprecation warnings.
See https://docs.gradle.org/6.8.3/userguide/command_line_interface.html#sec:command_line_warnings
BUILD FAILED in 1h 46m 40s
257 actionable tasks: 250 executed, 7 up-to-date
Build step 'Execute shell' marked build as failure
Recording test results
[Checks API] No suitable checks publisher found.
Not sending mail to unregistered user github@hugo-hirsch.de
Build failed in Jenkins: Kafka » kafka-trunk-jdk8 #551
Posted by Apache Jenkins Server <je...@builds.apache.org>.
See <https://ci-builds.apache.org/job/Kafka/job/kafka-trunk-jdk8/551/display/redirect?page=changes>
Changes:
[github] MINOR: Refer users to `kafka-storage.sh` if `meta.properties` is missing (#10279)
------------------------------------------
[...truncated 3.66 MB...]
LogValidatorTest > testUncompressedBatchWithoutRecordsNotAllowed() STARTED
LogValidatorTest > testUncompressedBatchWithoutRecordsNotAllowed() PASSED
LogValidatorTest > testOffsetAssignmentAfterDownConversionV1ToV0NonCompressed() STARTED
LogValidatorTest > testOffsetAssignmentAfterDownConversionV1ToV0NonCompressed() PASSED
LogValidatorTest > testAbsoluteOffsetAssignmentNonCompressed() STARTED
LogValidatorTest > testAbsoluteOffsetAssignmentNonCompressed() PASSED
LogValidatorTest > testOffsetAssignmentAfterDownConversionV2ToV1Compressed() STARTED
LogValidatorTest > testOffsetAssignmentAfterDownConversionV2ToV1Compressed() PASSED
LogValidatorTest > testOffsetAssignmentAfterDownConversionV1ToV0Compressed() STARTED
LogValidatorTest > testOffsetAssignmentAfterDownConversionV1ToV0Compressed() PASSED
LogValidatorTest > testOffsetAssignmentAfterUpConversionV0ToV2Compressed() STARTED
LogValidatorTest > testOffsetAssignmentAfterUpConversionV0ToV2Compressed() PASSED
LogValidatorTest > testNonCompressedV1() STARTED
LogValidatorTest > testNonCompressedV1() PASSED
LogValidatorTest > testNonCompressedV2() STARTED
LogValidatorTest > testNonCompressedV2() PASSED
LogValidatorTest > testOffsetAssignmentAfterUpConversionV1ToV2NonCompressed() STARTED
LogValidatorTest > testOffsetAssignmentAfterUpConversionV1ToV2NonCompressed() PASSED
LogValidatorTest > testInvalidCreateTimeCompressedV1() STARTED
LogValidatorTest > testInvalidCreateTimeCompressedV1() PASSED
LogValidatorTest > testInvalidCreateTimeCompressedV2() STARTED
LogValidatorTest > testInvalidCreateTimeCompressedV2() PASSED
LogValidatorTest > testNonIncreasingOffsetRecordBatchHasMetricsLogged() STARTED
LogValidatorTest > testNonIncreasingOffsetRecordBatchHasMetricsLogged() PASSED
LogValidatorTest > testRecompressionV1() STARTED
LogValidatorTest > testRecompressionV1() PASSED
LogValidatorTest > testRecompressionV2() STARTED
LogValidatorTest > testRecompressionV2() PASSED
ProducerStateManagerTest > testSkipEmptyTransactions() STARTED
ProducerStateManagerTest > testSkipEmptyTransactions() PASSED
ProducerStateManagerTest > testControlRecordBumpsProducerEpoch() STARTED
ProducerStateManagerTest > testControlRecordBumpsProducerEpoch() PASSED
ProducerStateManagerTest > testProducerSequenceWithWrapAroundBatchRecord() STARTED
ProducerStateManagerTest > testProducerSequenceWithWrapAroundBatchRecord() PASSED
ProducerStateManagerTest > testCoordinatorFencing() STARTED
ProducerStateManagerTest > testCoordinatorFencing() PASSED
ProducerStateManagerTest > testLoadFromTruncatedSnapshotFile() STARTED
ProducerStateManagerTest > testLoadFromTruncatedSnapshotFile() PASSED
ProducerStateManagerTest > testTruncateFullyAndStartAt() STARTED
ProducerStateManagerTest > testTruncateFullyAndStartAt() PASSED
ProducerStateManagerTest > testRemoveExpiredPidsOnReload() STARTED
ProducerStateManagerTest > testRemoveExpiredPidsOnReload() PASSED
ProducerStateManagerTest > testRecoverFromSnapshotFinishedTransaction() STARTED
ProducerStateManagerTest > testRecoverFromSnapshotFinishedTransaction() PASSED
ProducerStateManagerTest > testOutOfSequenceAfterControlRecordEpochBump() STARTED
ProducerStateManagerTest > testOutOfSequenceAfterControlRecordEpochBump() PASSED
ProducerStateManagerTest > testFirstUnstableOffsetAfterTruncation() STARTED
ProducerStateManagerTest > testFirstUnstableOffsetAfterTruncation() PASSED
ProducerStateManagerTest > testTakeSnapshot() STARTED
ProducerStateManagerTest > testTakeSnapshot() PASSED
ProducerStateManagerTest > testRecoverFromSnapshotUnfinishedTransaction() STARTED
ProducerStateManagerTest > testRecoverFromSnapshotUnfinishedTransaction() PASSED
ProducerStateManagerTest > testDeleteSnapshotsBefore() STARTED
ProducerStateManagerTest > testDeleteSnapshotsBefore() PASSED
ProducerStateManagerTest > testAppendEmptyControlBatch() STARTED
ProducerStateManagerTest > testAppendEmptyControlBatch() PASSED
ProducerStateManagerTest > testNoValidationOnFirstEntryWhenLoadingLog() STARTED
ProducerStateManagerTest > testNoValidationOnFirstEntryWhenLoadingLog() PASSED
ProducerStateManagerTest > testRemoveStraySnapshotsKeepCleanShutdownSnapshot() STARTED
ProducerStateManagerTest > testRemoveStraySnapshotsKeepCleanShutdownSnapshot() PASSED
ProducerStateManagerTest > testRemoveAllStraySnapshots() STARTED
ProducerStateManagerTest > testRemoveAllStraySnapshots() PASSED
ProducerStateManagerTest > testLoadFromEmptySnapshotFile() STARTED
ProducerStateManagerTest > testLoadFromEmptySnapshotFile() PASSED
ProducerStateManagerTest > testProducersWithOngoingTransactionsDontExpire() STARTED
ProducerStateManagerTest > testProducersWithOngoingTransactionsDontExpire() PASSED
ProducerStateManagerTest > testBasicIdMapping() STARTED
ProducerStateManagerTest > testBasicIdMapping() PASSED
ProducerStateManagerTest > updateProducerTransactionState() STARTED
ProducerStateManagerTest > updateProducerTransactionState() PASSED
ProducerStateManagerTest > testPrepareUpdateDoesNotMutate() STARTED
ProducerStateManagerTest > testPrepareUpdateDoesNotMutate() PASSED
ProducerStateManagerTest > testSequenceNotValidatedForGroupMetadataTopic() STARTED
ProducerStateManagerTest > testSequenceNotValidatedForGroupMetadataTopic() PASSED
ProducerStateManagerTest > testLastStableOffsetCompletedTxn() STARTED
ProducerStateManagerTest > testLastStableOffsetCompletedTxn() PASSED
ProducerStateManagerTest > testFirstUnstableOffset() STARTED
ProducerStateManagerTest > testFirstUnstableOffset() PASSED
ProducerStateManagerTest > testTxnFirstOffsetMetadataCached() STARTED
ProducerStateManagerTest > testTxnFirstOffsetMetadataCached() PASSED
ProducerStateManagerTest > testCoordinatorFencedAfterReload() STARTED
ProducerStateManagerTest > testCoordinatorFencedAfterReload() PASSED
ProducerStateManagerTest > testAcceptAppendWithoutProducerStateOnReplica() STARTED
ProducerStateManagerTest > testAcceptAppendWithoutProducerStateOnReplica() PASSED
ProducerStateManagerTest > testProducerStateAfterFencingAbortMarker() STARTED
ProducerStateManagerTest > testProducerStateAfterFencingAbortMarker() PASSED
ProducerStateManagerTest > testLoadFromCorruptSnapshotFile() STARTED
ProducerStateManagerTest > testLoadFromCorruptSnapshotFile() PASSED
ProducerStateManagerTest > testProducerSequenceWrapAround() STARTED
ProducerStateManagerTest > testProducerSequenceWrapAround() PASSED
ProducerStateManagerTest > testPidExpirationTimeout() STARTED
ProducerStateManagerTest > testPidExpirationTimeout() PASSED
ProducerStateManagerTest > testAcceptAppendWithSequenceGapsOnReplica() STARTED
ProducerStateManagerTest > testAcceptAppendWithSequenceGapsOnReplica() PASSED
ProducerStateManagerTest > testAppendTxnMarkerWithNoProducerState() STARTED
ProducerStateManagerTest > testAppendTxnMarkerWithNoProducerState() PASSED
ProducerStateManagerTest > testOldEpochForControlRecord() STARTED
ProducerStateManagerTest > testOldEpochForControlRecord() PASSED
ProducerStateManagerTest > testTruncateAndReloadRemovesOutOfRangeSnapshots() STARTED
ProducerStateManagerTest > testTruncateAndReloadRemovesOutOfRangeSnapshots() PASSED
ProducerStateManagerTest > testProducerSequenceInvalidWrapAround() STARTED
ProducerStateManagerTest > testProducerSequenceInvalidWrapAround() PASSED
ProducerStateManagerTest > testRecoverFromSnapshotEmptyTransaction() STARTED
ProducerStateManagerTest > testRecoverFromSnapshotEmptyTransaction() PASSED
ProducerStateManagerTest > testNonTransactionalAppendWithOngoingTransaction() STARTED
ProducerStateManagerTest > testNonTransactionalAppendWithOngoingTransaction() PASSED
ProducerStateManagerTest > testLoadFromSnapshotRetainsNonExpiredProducers() STARTED
ProducerStateManagerTest > testLoadFromSnapshotRetainsNonExpiredProducers() PASSED
ProducerStateManagerTest > testSkipSnapshotIfOffsetUnchanged() STARTED
ProducerStateManagerTest > testSkipSnapshotIfOffsetUnchanged() PASSED
TransactionsWithMaxInFlightOneTest > testTransactionalProducerSingleBrokerMaxInFlightOne() STARTED
TransactionsWithMaxInFlightOneTest > testTransactionalProducerSingleBrokerMaxInFlightOne() PASSED
3471 tests completed, 2 failed, 7 skipped
> Task :core:test FAILED
FAILURE: Build failed with an exception.
* What went wrong:
Execution failed for task ':core:test'.
> There were failing tests. See the report at: file://<https://ci-builds.apache.org/job/Kafka/job/kafka-trunk-jdk8/ws/core/build/reports/tests/test/index.html>
* Try:
Run with --stacktrace option to get the stack trace. Run with --info or --debug option to get more log output. Run with --scan to get full insights.
* Get more help at https://help.gradle.org
Deprecated Gradle features were used in this build, making it incompatible with Gradle 7.0.
Use '--warning-mode all' to show the individual deprecation warnings.
See https://docs.gradle.org/6.8.3/userguide/command_line_interface.html#sec:command_line_warnings
BUILD FAILED in 1h 30m 29s
257 actionable tasks: 220 executed, 37 up-to-date
Build step 'Execute shell' marked build as failure
Recording test results
[Checks API] No suitable checks publisher found.
Not sending mail to unregistered user github@hugo-hirsch.de
Build failed in Jenkins: Kafka » kafka-trunk-jdk8 #550
Posted by Apache Jenkins Server <je...@builds.apache.org>.
See <https://ci-builds.apache.org/job/Kafka/job/kafka-trunk-jdk8/550/display/redirect?page=changes>
Changes:
[github] KAFKA-12403; Ensure local state deleted on `RemoveTopicRecord` received (#10252)
------------------------------------------
[...truncated 3.66 MB...]
LogValidatorTest > testUncompressedBatchWithoutRecordsNotAllowed() STARTED
LogValidatorTest > testUncompressedBatchWithoutRecordsNotAllowed() PASSED
LogValidatorTest > testOffsetAssignmentAfterDownConversionV1ToV0NonCompressed() STARTED
LogValidatorTest > testOffsetAssignmentAfterDownConversionV1ToV0NonCompressed() PASSED
LogValidatorTest > testAbsoluteOffsetAssignmentNonCompressed() STARTED
LogValidatorTest > testAbsoluteOffsetAssignmentNonCompressed() PASSED
LogValidatorTest > testOffsetAssignmentAfterDownConversionV2ToV1Compressed() STARTED
LogValidatorTest > testOffsetAssignmentAfterDownConversionV2ToV1Compressed() PASSED
LogValidatorTest > testOffsetAssignmentAfterDownConversionV1ToV0Compressed() STARTED
LogValidatorTest > testOffsetAssignmentAfterDownConversionV1ToV0Compressed() PASSED
LogValidatorTest > testOffsetAssignmentAfterUpConversionV0ToV2Compressed() STARTED
LogValidatorTest > testOffsetAssignmentAfterUpConversionV0ToV2Compressed() PASSED
LogValidatorTest > testNonCompressedV1() STARTED
LogValidatorTest > testNonCompressedV1() PASSED
LogValidatorTest > testNonCompressedV2() STARTED
LogValidatorTest > testNonCompressedV2() PASSED
LogValidatorTest > testOffsetAssignmentAfterUpConversionV1ToV2NonCompressed() STARTED
LogValidatorTest > testOffsetAssignmentAfterUpConversionV1ToV2NonCompressed() PASSED
LogValidatorTest > testInvalidCreateTimeCompressedV1() STARTED
LogValidatorTest > testInvalidCreateTimeCompressedV1() PASSED
LogValidatorTest > testInvalidCreateTimeCompressedV2() STARTED
LogValidatorTest > testInvalidCreateTimeCompressedV2() PASSED
LogValidatorTest > testNonIncreasingOffsetRecordBatchHasMetricsLogged() STARTED
LogValidatorTest > testNonIncreasingOffsetRecordBatchHasMetricsLogged() PASSED
LogValidatorTest > testRecompressionV1() STARTED
LogValidatorTest > testRecompressionV1() PASSED
LogValidatorTest > testRecompressionV2() STARTED
LogValidatorTest > testRecompressionV2() PASSED
ProducerStateManagerTest > testSkipEmptyTransactions() STARTED
ProducerStateManagerTest > testSkipEmptyTransactions() PASSED
ProducerStateManagerTest > testControlRecordBumpsProducerEpoch() STARTED
ProducerStateManagerTest > testControlRecordBumpsProducerEpoch() PASSED
ProducerStateManagerTest > testProducerSequenceWithWrapAroundBatchRecord() STARTED
ProducerStateManagerTest > testProducerSequenceWithWrapAroundBatchRecord() PASSED
ProducerStateManagerTest > testCoordinatorFencing() STARTED
ProducerStateManagerTest > testCoordinatorFencing() PASSED
ProducerStateManagerTest > testLoadFromTruncatedSnapshotFile() STARTED
ProducerStateManagerTest > testLoadFromTruncatedSnapshotFile() PASSED
ProducerStateManagerTest > testTruncateFullyAndStartAt() STARTED
ProducerStateManagerTest > testTruncateFullyAndStartAt() PASSED
ProducerStateManagerTest > testRemoveExpiredPidsOnReload() STARTED
ProducerStateManagerTest > testRemoveExpiredPidsOnReload() PASSED
ProducerStateManagerTest > testRecoverFromSnapshotFinishedTransaction() STARTED
ProducerStateManagerTest > testRecoverFromSnapshotFinishedTransaction() PASSED
ProducerStateManagerTest > testOutOfSequenceAfterControlRecordEpochBump() STARTED
ProducerStateManagerTest > testOutOfSequenceAfterControlRecordEpochBump() PASSED
ProducerStateManagerTest > testFirstUnstableOffsetAfterTruncation() STARTED
ProducerStateManagerTest > testFirstUnstableOffsetAfterTruncation() PASSED
ProducerStateManagerTest > testTakeSnapshot() STARTED
ProducerStateManagerTest > testTakeSnapshot() PASSED
ProducerStateManagerTest > testRecoverFromSnapshotUnfinishedTransaction() STARTED
ProducerStateManagerTest > testRecoverFromSnapshotUnfinishedTransaction() PASSED
ProducerStateManagerTest > testDeleteSnapshotsBefore() STARTED
ProducerStateManagerTest > testDeleteSnapshotsBefore() PASSED
ProducerStateManagerTest > testAppendEmptyControlBatch() STARTED
ProducerStateManagerTest > testAppendEmptyControlBatch() PASSED
ProducerStateManagerTest > testNoValidationOnFirstEntryWhenLoadingLog() STARTED
ProducerStateManagerTest > testNoValidationOnFirstEntryWhenLoadingLog() PASSED
ProducerStateManagerTest > testRemoveStraySnapshotsKeepCleanShutdownSnapshot() STARTED
ProducerStateManagerTest > testRemoveStraySnapshotsKeepCleanShutdownSnapshot() PASSED
ProducerStateManagerTest > testRemoveAllStraySnapshots() STARTED
ProducerStateManagerTest > testRemoveAllStraySnapshots() PASSED
ProducerStateManagerTest > testLoadFromEmptySnapshotFile() STARTED
ProducerStateManagerTest > testLoadFromEmptySnapshotFile() PASSED
ProducerStateManagerTest > testProducersWithOngoingTransactionsDontExpire() STARTED
ProducerStateManagerTest > testProducersWithOngoingTransactionsDontExpire() PASSED
ProducerStateManagerTest > testBasicIdMapping() STARTED
ProducerStateManagerTest > testBasicIdMapping() PASSED
ProducerStateManagerTest > updateProducerTransactionState() STARTED
ProducerStateManagerTest > updateProducerTransactionState() PASSED
ProducerStateManagerTest > testPrepareUpdateDoesNotMutate() STARTED
ProducerStateManagerTest > testPrepareUpdateDoesNotMutate() PASSED
ProducerStateManagerTest > testSequenceNotValidatedForGroupMetadataTopic() STARTED
ProducerStateManagerTest > testSequenceNotValidatedForGroupMetadataTopic() PASSED
ProducerStateManagerTest > testLastStableOffsetCompletedTxn() STARTED
ProducerStateManagerTest > testLastStableOffsetCompletedTxn() PASSED
ProducerStateManagerTest > testFirstUnstableOffset() STARTED
ProducerStateManagerTest > testFirstUnstableOffset() PASSED
ProducerStateManagerTest > testTxnFirstOffsetMetadataCached() STARTED
ProducerStateManagerTest > testTxnFirstOffsetMetadataCached() PASSED
ProducerStateManagerTest > testCoordinatorFencedAfterReload() STARTED
ProducerStateManagerTest > testCoordinatorFencedAfterReload() PASSED
ProducerStateManagerTest > testAcceptAppendWithoutProducerStateOnReplica() STARTED
ProducerStateManagerTest > testAcceptAppendWithoutProducerStateOnReplica() PASSED
ProducerStateManagerTest > testProducerStateAfterFencingAbortMarker() STARTED
ProducerStateManagerTest > testProducerStateAfterFencingAbortMarker() PASSED
ProducerStateManagerTest > testLoadFromCorruptSnapshotFile() STARTED
ProducerStateManagerTest > testLoadFromCorruptSnapshotFile() PASSED
ProducerStateManagerTest > testProducerSequenceWrapAround() STARTED
ProducerStateManagerTest > testProducerSequenceWrapAround() PASSED
ProducerStateManagerTest > testPidExpirationTimeout() STARTED
ProducerStateManagerTest > testPidExpirationTimeout() PASSED
ProducerStateManagerTest > testAcceptAppendWithSequenceGapsOnReplica() STARTED
ProducerStateManagerTest > testAcceptAppendWithSequenceGapsOnReplica() PASSED
ProducerStateManagerTest > testAppendTxnMarkerWithNoProducerState() STARTED
ProducerStateManagerTest > testAppendTxnMarkerWithNoProducerState() PASSED
ProducerStateManagerTest > testOldEpochForControlRecord() STARTED
ProducerStateManagerTest > testOldEpochForControlRecord() PASSED
ProducerStateManagerTest > testTruncateAndReloadRemovesOutOfRangeSnapshots() STARTED
ProducerStateManagerTest > testTruncateAndReloadRemovesOutOfRangeSnapshots() PASSED
ProducerStateManagerTest > testProducerSequenceInvalidWrapAround() STARTED
ProducerStateManagerTest > testProducerSequenceInvalidWrapAround() PASSED
ProducerStateManagerTest > testRecoverFromSnapshotEmptyTransaction() STARTED
ProducerStateManagerTest > testRecoverFromSnapshotEmptyTransaction() PASSED
ProducerStateManagerTest > testNonTransactionalAppendWithOngoingTransaction() STARTED
ProducerStateManagerTest > testNonTransactionalAppendWithOngoingTransaction() PASSED
ProducerStateManagerTest > testLoadFromSnapshotRetainsNonExpiredProducers() STARTED
ProducerStateManagerTest > testLoadFromSnapshotRetainsNonExpiredProducers() PASSED
ProducerStateManagerTest > testSkipSnapshotIfOffsetUnchanged() STARTED
ProducerStateManagerTest > testSkipSnapshotIfOffsetUnchanged() PASSED
TransactionsWithMaxInFlightOneTest > testTransactionalProducerSingleBrokerMaxInFlightOne() STARTED
TransactionsWithMaxInFlightOneTest > testTransactionalProducerSingleBrokerMaxInFlightOne() PASSED
3471 tests completed, 2 failed, 7 skipped
> Task :core:test FAILED
FAILURE: Build failed with an exception.
* What went wrong:
Execution failed for task ':core:test'.
> There were failing tests. See the report at: file://<https://ci-builds.apache.org/job/Kafka/job/kafka-trunk-jdk8/ws/core/build/reports/tests/test/index.html>
* Try:
Run with --stacktrace option to get the stack trace. Run with --info or --debug option to get more log output. Run with --scan to get full insights.
* Get more help at https://help.gradle.org
Deprecated Gradle features were used in this build, making it incompatible with Gradle 7.0.
Use '--warning-mode all' to show the individual deprecation warnings.
See https://docs.gradle.org/6.8.3/userguide/command_line_interface.html#sec:command_line_warnings
BUILD FAILED in 1h 26m 10s
257 actionable tasks: 220 executed, 37 up-to-date
Build step 'Execute shell' marked build as failure
Recording test results
[Checks API] No suitable checks publisher found.
Not sending mail to unregistered user github@hugo-hirsch.de
Build failed in Jenkins: Kafka » kafka-trunk-jdk8 #549
Posted by Apache Jenkins Server <je...@builds.apache.org>.
See <https://ci-builds.apache.org/job/Kafka/job/kafka-trunk-jdk8/549/display/redirect?page=changes>
Changes:
[github] MINOR: add missing space to errro message when setting uint16 (#10274)
------------------------------------------
[...truncated 3.66 MB...]
LogTest > testReadWithTooSmallMaxLength() PASSED
LogTest > testOverCompactedLogRecovery() STARTED
LogTest > testOverCompactedLogRecovery() PASSED
LogTest > testBogusIndexSegmentsAreRemoved() STARTED
LogTest > testBogusIndexSegmentsAreRemoved() PASSED
LogTest > testLeaderEpochCacheClearedAfterStaticMessageFormatDowngrade() STARTED
LogTest > testLeaderEpochCacheClearedAfterStaticMessageFormatDowngrade() PASSED
LogTest > testCompressedMessages() STARTED
LogTest > testCompressedMessages() PASSED
LogTest > testAppendMessageWithNullPayload() STARTED
LogTest > testAppendMessageWithNullPayload() PASSED
LogTest > testCorruptLog() STARTED
LogTest > testCorruptLog() PASSED
LogTest > testLogRecoversToCorrectOffset() STARTED
LogTest > testLogRecoversToCorrectOffset() PASSED
LogTest > testReopenThenTruncate() STARTED
LogTest > testReopenThenTruncate() PASSED
LogTest > testZombieCoordinatorFenced() STARTED
LogTest > testZombieCoordinatorFenced() PASSED
LogTest > testOldProducerEpoch() STARTED
LogTest > testOldProducerEpoch() PASSED
LogTest > testProducerSnapshotsRecoveryAfterUncleanShutdownV1() STARTED
LogTest > testProducerSnapshotsRecoveryAfterUncleanShutdownV1() PASSED
LogTest > testDegenerateSegmentSplit() STARTED
LogTest > testDegenerateSegmentSplit() PASSED
LogTest > testParseTopicPartitionNameForMissingPartition() STARTED
LogTest > testParseTopicPartitionNameForMissingPartition() PASSED
LogTest > testParseTopicPartitionNameForEmptyName() STARTED
LogTest > testParseTopicPartitionNameForEmptyName() PASSED
LogTest > testOffsetSnapshot() STARTED
LogTest > testOffsetSnapshot() PASSED
LogTest > testOpenDeletesObsoleteFiles() STARTED
LogTest > testOpenDeletesObsoleteFiles() PASSED
LogTest > shouldUpdateOffsetForLeaderEpochsWhenDeletingSegments() STARTED
LogTest > shouldUpdateOffsetForLeaderEpochsWhenDeletingSegments() PASSED
LogTest > testLogDeleteDirName() STARTED
LogTest > testLogDeleteDirName() PASSED
LogTest > testDeleteOldSegments() STARTED
LogTest > testDeleteOldSegments() PASSED
LogTest > testRebuildTimeIndexForOldMessages() STARTED
LogTest > testRebuildTimeIndexForOldMessages() PASSED
LogTest > testProducerIdMapTruncateTo() STARTED
LogTest > testProducerIdMapTruncateTo() PASSED
LogTest > testTakeSnapshotOnRollAndDeleteSnapshotOnRecoveryPointCheckpoint() STARTED
LogTest > testTakeSnapshotOnRollAndDeleteSnapshotOnRecoveryPointCheckpoint() PASSED
LogTest > testLogEndLessThanStartAfterReopen() STARTED
LogTest > testLogEndLessThanStartAfterReopen() PASSED
LogTest > testLogRecoversForLeaderEpoch() STARTED
LogTest > testLogRecoversForLeaderEpoch() PASSED
LogTest > testRetentionDeletesProducerStateSnapshots() STARTED
LogTest > testRetentionDeletesProducerStateSnapshots() PASSED
LogTest > testLoadingLogDeletesProducerStateSnapshotsPastLogEndOffset() STARTED
LogTest > testLoadingLogDeletesProducerStateSnapshotsPastLogEndOffset() PASSED
LogTest > testRetentionIdempotency() STARTED
LogTest > testRetentionIdempotency() PASSED
LogTest > testWriteLeaderEpochCheckpointAfterDirectoryRename() STARTED
LogTest > testWriteLeaderEpochCheckpointAfterDirectoryRename() PASSED
LogTest > testOverCompactedLogRecoveryMultiRecord() STARTED
LogTest > testOverCompactedLogRecoveryMultiRecord() PASSED
LogTest > testSizeBasedLogRoll() STARTED
LogTest > testSizeBasedLogRoll() PASSED
LogTest > testRebuildProducerIdMapWithCompactedData() STARTED
LogTest > testRebuildProducerIdMapWithCompactedData() PASSED
LogTest > shouldNotDeleteSizeBasedSegmentsWhenUnderRetentionSize() STARTED
LogTest > shouldNotDeleteSizeBasedSegmentsWhenUnderRetentionSize() PASSED
LogTest > testTransactionIndexUpdatedThroughReplication() STARTED
LogTest > testTransactionIndexUpdatedThroughReplication() PASSED
LogTest > testTimeBasedLogRollJitter() STARTED
LogTest > testTimeBasedLogRollJitter() PASSED
LogTest > testParseTopicPartitionName() STARTED
LogTest > testParseTopicPartitionName() PASSED
LogTest > testEndTxnWithFencedProducerEpoch() STARTED
LogTest > testEndTxnWithFencedProducerEpoch() PASSED
LogTest > testRecoveryOfSegmentWithOffsetOverflow() STARTED
LogTest > testRecoveryOfSegmentWithOffsetOverflow() PASSED
LogTest > testRecoverAfterNonMonotonicCoordinatorEpochWrite() STARTED
LogTest > testRecoverAfterNonMonotonicCoordinatorEpochWrite() PASSED
LogTest > testLoadProducersAfterDeleteRecordsMidSegment() STARTED
LogTest > testLoadProducersAfterDeleteRecordsMidSegment() PASSED
LogTest > testInitializationOfProducerSnapshotsUpgradePath() STARTED
LogTest > testInitializationOfProducerSnapshotsUpgradePath() PASSED
LogTest > shouldDeleteStartOffsetBreachedSegmentsWhenPolicyDoesNotIncludeDelete() STARTED
LogTest > shouldDeleteStartOffsetBreachedSegmentsWhenPolicyDoesNotIncludeDelete() PASSED
LogTest > testSkipLoadingIfEmptyProducerStateBeforeTruncation() STARTED
LogTest > testSkipLoadingIfEmptyProducerStateBeforeTruncation() PASSED
LogTest > testTruncateTo() STARTED
LogTest > testTruncateTo() PASSED
LogTest > testSkipTruncateAndReloadIfNewMessageFormatAndCleanShutdown() STARTED
LogTest > testSkipTruncateAndReloadIfNewMessageFormatAndCleanShutdown() PASSED
LogTest > shouldApplyEpochToMessageOnAppendIfLeader() STARTED
LogTest > shouldApplyEpochToMessageOnAppendIfLeader() PASSED
LogTest > testLogDeletionAfterClose() STARTED
LogTest > testLogDeletionAfterClose() PASSED
LogTest > testLoadProducersAfterDeleteRecordsOnSegment() STARTED
LogTest > testLoadProducersAfterDeleteRecordsOnSegment() PASSED
LogTest > testAppendToOrReadFromLogInFailedLogDir() STARTED
LogTest > testAppendToOrReadFromLogInFailedLogDir() PASSED
LogTest > testCleanShutdownFile() STARTED
LogTest > testCleanShutdownFile() PASSED
LogTest > testTransactionIndexUpdated() STARTED
LogTest > testTransactionIndexUpdated() PASSED
LogTest > testBuildTimeIndexWhenNotAssigningOffsets() STARTED
LogTest > testBuildTimeIndexWhenNotAssigningOffsets() PASSED
LogTest > testProducerExpireCheckAfterDelete() STARTED
LogTest > testProducerExpireCheckAfterDelete() PASSED
3467 tests completed, 2 failed, 7 skipped
> Task :core:test FAILED
FAILURE: Build completed with 2 failures.
1: Task failed with an exception.
-----------
* What went wrong:
Execution failed for task ':connect:runtime:test'.
> There were failing tests. See the report at: file://<https://ci-builds.apache.org/job/Kafka/job/kafka-trunk-jdk8/ws/connect/runtime/build/reports/tests/test/index.html>
* Try:
Run with --stacktrace option to get the stack trace. Run with --info or --debug option to get more log output. Run with --scan to get full insights.
==============================================================================
2: Task failed with an exception.
-----------
* What went wrong:
Execution failed for task ':core:test'.
> There were failing tests. See the report at: file://<https://ci-builds.apache.org/job/Kafka/job/kafka-trunk-jdk8/ws/core/build/reports/tests/test/index.html>
* Try:
Run with --stacktrace option to get the stack trace. Run with --info or --debug option to get more log output. Run with --scan to get full insights.
==============================================================================
* Get more help at https://help.gradle.org
Deprecated Gradle features were used in this build, making it incompatible with Gradle 7.0.
Use '--warning-mode all' to show the individual deprecation warnings.
See https://docs.gradle.org/6.8.3/userguide/command_line_interface.html#sec:command_line_warnings
BUILD FAILED in 1h 37m 57s
257 actionable tasks: 220 executed, 37 up-to-date
Build step 'Execute shell' marked build as failure
Recording test results
[Checks API] No suitable checks publisher found.
Not sending mail to unregistered user github@hugo-hirsch.de
Build failed in Jenkins: Kafka » kafka-trunk-jdk8 #548
Posted by Apache Jenkins Server <je...@builds.apache.org>.
See <https://ci-builds.apache.org/job/Kafka/job/kafka-trunk-jdk8/548/display/redirect?page=changes>
Changes:
[github] KAFKA-12381: remove live broker checks for forwarding topic creation (#10240)
------------------------------------------
[...truncated 3.66 MB...]
LogTest > testDeleteSnapshotsOnIncrementLogStartOffset() STARTED
LogTest > testDeleteSnapshotsOnIncrementLogStartOffset() PASSED
LogTest > testCorruptIndexRebuild() STARTED
LogTest > testCorruptIndexRebuild() PASSED
LogTest > shouldDeleteTimeBasedSegmentsReadyToBeDeleted() STARTED
LogTest > shouldDeleteTimeBasedSegmentsReadyToBeDeleted() PASSED
LogTest > testReadWithTooSmallMaxLength() STARTED
LogTest > testReadWithTooSmallMaxLength() PASSED
LogTest > testOverCompactedLogRecovery() STARTED
LogTest > testOverCompactedLogRecovery() PASSED
LogTest > testBogusIndexSegmentsAreRemoved() STARTED
LogTest > testBogusIndexSegmentsAreRemoved() PASSED
LogTest > testLeaderEpochCacheClearedAfterStaticMessageFormatDowngrade() STARTED
LogTest > testLeaderEpochCacheClearedAfterStaticMessageFormatDowngrade() PASSED
LogTest > testCompressedMessages() STARTED
LogTest > testCompressedMessages() PASSED
LogTest > testAppendMessageWithNullPayload() STARTED
LogTest > testAppendMessageWithNullPayload() PASSED
LogTest > testCorruptLog() STARTED
LogTest > testCorruptLog() PASSED
LogTest > testLogRecoversToCorrectOffset() STARTED
LogTest > testLogRecoversToCorrectOffset() PASSED
LogTest > testReopenThenTruncate() STARTED
LogTest > testReopenThenTruncate() PASSED
LogTest > testZombieCoordinatorFenced() STARTED
LogTest > testZombieCoordinatorFenced() PASSED
LogTest > testOldProducerEpoch() STARTED
LogTest > testOldProducerEpoch() PASSED
LogTest > testProducerSnapshotsRecoveryAfterUncleanShutdownV1() STARTED
LogTest > testProducerSnapshotsRecoveryAfterUncleanShutdownV1() PASSED
LogTest > testDegenerateSegmentSplit() STARTED
LogTest > testDegenerateSegmentSplit() PASSED
LogTest > testParseTopicPartitionNameForMissingPartition() STARTED
LogTest > testParseTopicPartitionNameForMissingPartition() PASSED
LogTest > testParseTopicPartitionNameForEmptyName() STARTED
LogTest > testParseTopicPartitionNameForEmptyName() PASSED
LogTest > testOffsetSnapshot() STARTED
LogTest > testOffsetSnapshot() PASSED
LogTest > testOpenDeletesObsoleteFiles() STARTED
LogTest > testOpenDeletesObsoleteFiles() PASSED
LogTest > shouldUpdateOffsetForLeaderEpochsWhenDeletingSegments() STARTED
LogTest > shouldUpdateOffsetForLeaderEpochsWhenDeletingSegments() PASSED
LogTest > testLogDeleteDirName() STARTED
LogTest > testLogDeleteDirName() PASSED
LogTest > testDeleteOldSegments() STARTED
LogTest > testDeleteOldSegments() PASSED
LogTest > testRebuildTimeIndexForOldMessages() STARTED
LogTest > testRebuildTimeIndexForOldMessages() PASSED
LogTest > testProducerIdMapTruncateTo() STARTED
LogTest > testProducerIdMapTruncateTo() PASSED
LogTest > testTakeSnapshotOnRollAndDeleteSnapshotOnRecoveryPointCheckpoint() STARTED
LogTest > testTakeSnapshotOnRollAndDeleteSnapshotOnRecoveryPointCheckpoint() PASSED
LogTest > testLogEndLessThanStartAfterReopen() STARTED
LogTest > testLogEndLessThanStartAfterReopen() PASSED
LogTest > testLogRecoversForLeaderEpoch() STARTED
LogTest > testLogRecoversForLeaderEpoch() PASSED
LogTest > testRetentionDeletesProducerStateSnapshots() STARTED
LogTest > testRetentionDeletesProducerStateSnapshots() PASSED
LogTest > testLoadingLogDeletesProducerStateSnapshotsPastLogEndOffset() STARTED
LogTest > testLoadingLogDeletesProducerStateSnapshotsPastLogEndOffset() PASSED
LogTest > testRetentionIdempotency() STARTED
LogTest > testRetentionIdempotency() PASSED
LogTest > testWriteLeaderEpochCheckpointAfterDirectoryRename() STARTED
LogTest > testWriteLeaderEpochCheckpointAfterDirectoryRename() PASSED
LogTest > testOverCompactedLogRecoveryMultiRecord() STARTED
LogTest > testOverCompactedLogRecoveryMultiRecord() PASSED
LogTest > testSizeBasedLogRoll() STARTED
LogTest > testSizeBasedLogRoll() PASSED
LogTest > testRebuildProducerIdMapWithCompactedData() STARTED
LogTest > testRebuildProducerIdMapWithCompactedData() PASSED
LogTest > shouldNotDeleteSizeBasedSegmentsWhenUnderRetentionSize() STARTED
LogTest > shouldNotDeleteSizeBasedSegmentsWhenUnderRetentionSize() PASSED
LogTest > testTransactionIndexUpdatedThroughReplication() STARTED
LogTest > testTransactionIndexUpdatedThroughReplication() PASSED
LogTest > testTimeBasedLogRollJitter() STARTED
LogTest > testTimeBasedLogRollJitter() PASSED
LogTest > testParseTopicPartitionName() STARTED
LogTest > testParseTopicPartitionName() PASSED
LogTest > testEndTxnWithFencedProducerEpoch() STARTED
LogTest > testEndTxnWithFencedProducerEpoch() PASSED
LogTest > testRecoveryOfSegmentWithOffsetOverflow() STARTED
LogTest > testRecoveryOfSegmentWithOffsetOverflow() PASSED
LogTest > testRecoverAfterNonMonotonicCoordinatorEpochWrite() STARTED
LogTest > testRecoverAfterNonMonotonicCoordinatorEpochWrite() PASSED
LogTest > testLoadProducersAfterDeleteRecordsMidSegment() STARTED
LogTest > testLoadProducersAfterDeleteRecordsMidSegment() PASSED
LogTest > testInitializationOfProducerSnapshotsUpgradePath() STARTED
LogTest > testInitializationOfProducerSnapshotsUpgradePath() PASSED
LogTest > shouldDeleteStartOffsetBreachedSegmentsWhenPolicyDoesNotIncludeDelete() STARTED
LogTest > shouldDeleteStartOffsetBreachedSegmentsWhenPolicyDoesNotIncludeDelete() PASSED
LogTest > testSkipLoadingIfEmptyProducerStateBeforeTruncation() STARTED
LogTest > testSkipLoadingIfEmptyProducerStateBeforeTruncation() PASSED
LogTest > testTruncateTo() STARTED
LogTest > testTruncateTo() PASSED
LogTest > testSkipTruncateAndReloadIfNewMessageFormatAndCleanShutdown() STARTED
LogTest > testSkipTruncateAndReloadIfNewMessageFormatAndCleanShutdown() PASSED
LogTest > shouldApplyEpochToMessageOnAppendIfLeader() STARTED
LogTest > shouldApplyEpochToMessageOnAppendIfLeader() PASSED
LogTest > testLogDeletionAfterClose() STARTED
LogTest > testLogDeletionAfterClose() PASSED
LogTest > testLoadProducersAfterDeleteRecordsOnSegment() STARTED
LogTest > testLoadProducersAfterDeleteRecordsOnSegment() PASSED
LogTest > testAppendToOrReadFromLogInFailedLogDir() STARTED
LogTest > testAppendToOrReadFromLogInFailedLogDir() PASSED
LogTest > testCleanShutdownFile() STARTED
LogTest > testCleanShutdownFile() PASSED
LogTest > testTransactionIndexUpdated() STARTED
LogTest > testTransactionIndexUpdated() PASSED
LogTest > testBuildTimeIndexWhenNotAssigningOffsets() STARTED
LogTest > testBuildTimeIndexWhenNotAssigningOffsets() PASSED
LogTest > testProducerExpireCheckAfterDelete() STARTED
LogTest > testProducerExpireCheckAfterDelete() PASSED
3467 tests completed, 1 failed, 7 skipped
> Task :core:test FAILED
FAILURE: Build failed with an exception.
* What went wrong:
Execution failed for task ':core:test'.
> There were failing tests. See the report at: file://<https://ci-builds.apache.org/job/Kafka/job/kafka-trunk-jdk8/ws/core/build/reports/tests/test/index.html>
* Try:
Run with --stacktrace option to get the stack trace. Run with --info or --debug option to get more log output. Run with --scan to get full insights.
* Get more help at https://help.gradle.org
Deprecated Gradle features were used in this build, making it incompatible with Gradle 7.0.
Use '--warning-mode all' to show the individual deprecation warnings.
See https://docs.gradle.org/6.8.3/userguide/command_line_interface.html#sec:command_line_warnings
BUILD FAILED in 1h 31m 16s
257 actionable tasks: 220 executed, 37 up-to-date
Build step 'Execute shell' marked build as failure
Recording test results
Not sending mail to unregistered user github@hugo-hirsch.de
Build failed in Jenkins: Kafka » kafka-trunk-jdk8 #547
Posted by Apache Jenkins Server <je...@builds.apache.org>.
See <https://ci-builds.apache.org/job/Kafka/job/kafka-trunk-jdk8/547/display/redirect?page=changes>
Changes:
[github] KAFKA-12347: updating TaskMetadata (#10211)
------------------------------------------
[...truncated 3.65 MB...]
LogTest > testDeleteSnapshotsOnIncrementLogStartOffset() STARTED
LogTest > testDeleteSnapshotsOnIncrementLogStartOffset() PASSED
LogTest > testCorruptIndexRebuild() STARTED
LogTest > testCorruptIndexRebuild() PASSED
LogTest > shouldDeleteTimeBasedSegmentsReadyToBeDeleted() STARTED
LogTest > shouldDeleteTimeBasedSegmentsReadyToBeDeleted() PASSED
LogTest > testReadWithTooSmallMaxLength() STARTED
LogTest > testReadWithTooSmallMaxLength() PASSED
LogTest > testOverCompactedLogRecovery() STARTED
LogTest > testOverCompactedLogRecovery() PASSED
LogTest > testBogusIndexSegmentsAreRemoved() STARTED
LogTest > testBogusIndexSegmentsAreRemoved() PASSED
LogTest > testLeaderEpochCacheClearedAfterStaticMessageFormatDowngrade() STARTED
LogTest > testLeaderEpochCacheClearedAfterStaticMessageFormatDowngrade() PASSED
LogTest > testCompressedMessages() STARTED
LogTest > testCompressedMessages() PASSED
LogTest > testAppendMessageWithNullPayload() STARTED
LogTest > testAppendMessageWithNullPayload() PASSED
LogTest > testCorruptLog() STARTED
LogTest > testCorruptLog() PASSED
LogTest > testLogRecoversToCorrectOffset() STARTED
LogTest > testLogRecoversToCorrectOffset() PASSED
LogTest > testReopenThenTruncate() STARTED
LogTest > testReopenThenTruncate() PASSED
LogTest > testZombieCoordinatorFenced() STARTED
LogTest > testZombieCoordinatorFenced() PASSED
LogTest > testOldProducerEpoch() STARTED
LogTest > testOldProducerEpoch() PASSED
LogTest > testProducerSnapshotsRecoveryAfterUncleanShutdownV1() STARTED
LogTest > testProducerSnapshotsRecoveryAfterUncleanShutdownV1() PASSED
LogTest > testDegenerateSegmentSplit() STARTED
LogTest > testDegenerateSegmentSplit() PASSED
LogTest > testParseTopicPartitionNameForMissingPartition() STARTED
LogTest > testParseTopicPartitionNameForMissingPartition() PASSED
LogTest > testParseTopicPartitionNameForEmptyName() STARTED
LogTest > testParseTopicPartitionNameForEmptyName() PASSED
LogTest > testOffsetSnapshot() STARTED
LogTest > testOffsetSnapshot() PASSED
LogTest > testOpenDeletesObsoleteFiles() STARTED
LogTest > testOpenDeletesObsoleteFiles() PASSED
LogTest > shouldUpdateOffsetForLeaderEpochsWhenDeletingSegments() STARTED
LogTest > shouldUpdateOffsetForLeaderEpochsWhenDeletingSegments() PASSED
LogTest > testLogDeleteDirName() STARTED
LogTest > testLogDeleteDirName() PASSED
LogTest > testDeleteOldSegments() STARTED
LogTest > testDeleteOldSegments() PASSED
LogTest > testRebuildTimeIndexForOldMessages() STARTED
LogTest > testRebuildTimeIndexForOldMessages() PASSED
LogTest > testProducerIdMapTruncateTo() STARTED
LogTest > testProducerIdMapTruncateTo() PASSED
LogTest > testTakeSnapshotOnRollAndDeleteSnapshotOnRecoveryPointCheckpoint() STARTED
LogTest > testTakeSnapshotOnRollAndDeleteSnapshotOnRecoveryPointCheckpoint() PASSED
LogTest > testLogEndLessThanStartAfterReopen() STARTED
LogTest > testLogEndLessThanStartAfterReopen() PASSED
LogTest > testLogRecoversForLeaderEpoch() STARTED
LogTest > testLogRecoversForLeaderEpoch() PASSED
LogTest > testRetentionDeletesProducerStateSnapshots() STARTED
LogTest > testRetentionDeletesProducerStateSnapshots() PASSED
LogTest > testLoadingLogDeletesProducerStateSnapshotsPastLogEndOffset() STARTED
LogTest > testLoadingLogDeletesProducerStateSnapshotsPastLogEndOffset() PASSED
LogTest > testRetentionIdempotency() STARTED
LogTest > testRetentionIdempotency() PASSED
LogTest > testWriteLeaderEpochCheckpointAfterDirectoryRename() STARTED
LogTest > testWriteLeaderEpochCheckpointAfterDirectoryRename() PASSED
LogTest > testOverCompactedLogRecoveryMultiRecord() STARTED
LogTest > testOverCompactedLogRecoveryMultiRecord() PASSED
LogTest > testSizeBasedLogRoll() STARTED
LogTest > testSizeBasedLogRoll() PASSED
LogTest > testRebuildProducerIdMapWithCompactedData() STARTED
LogTest > testRebuildProducerIdMapWithCompactedData() PASSED
LogTest > shouldNotDeleteSizeBasedSegmentsWhenUnderRetentionSize() STARTED
LogTest > shouldNotDeleteSizeBasedSegmentsWhenUnderRetentionSize() PASSED
LogTest > testTransactionIndexUpdatedThroughReplication() STARTED
LogTest > testTransactionIndexUpdatedThroughReplication() PASSED
LogTest > testTimeBasedLogRollJitter() STARTED
LogTest > testTimeBasedLogRollJitter() PASSED
LogTest > testParseTopicPartitionName() STARTED
LogTest > testParseTopicPartitionName() PASSED
LogTest > testEndTxnWithFencedProducerEpoch() STARTED
LogTest > testEndTxnWithFencedProducerEpoch() PASSED
LogTest > testRecoveryOfSegmentWithOffsetOverflow() STARTED
LogTest > testRecoveryOfSegmentWithOffsetOverflow() PASSED
LogTest > testRecoverAfterNonMonotonicCoordinatorEpochWrite() STARTED
LogTest > testRecoverAfterNonMonotonicCoordinatorEpochWrite() PASSED
LogTest > testLoadProducersAfterDeleteRecordsMidSegment() STARTED
LogTest > testLoadProducersAfterDeleteRecordsMidSegment() PASSED
LogTest > testInitializationOfProducerSnapshotsUpgradePath() STARTED
LogTest > testInitializationOfProducerSnapshotsUpgradePath() PASSED
LogTest > shouldDeleteStartOffsetBreachedSegmentsWhenPolicyDoesNotIncludeDelete() STARTED
LogTest > shouldDeleteStartOffsetBreachedSegmentsWhenPolicyDoesNotIncludeDelete() PASSED
LogTest > testSkipLoadingIfEmptyProducerStateBeforeTruncation() STARTED
LogTest > testSkipLoadingIfEmptyProducerStateBeforeTruncation() PASSED
LogTest > testTruncateTo() STARTED
LogTest > testTruncateTo() PASSED
LogTest > testSkipTruncateAndReloadIfNewMessageFormatAndCleanShutdown() STARTED
LogTest > testSkipTruncateAndReloadIfNewMessageFormatAndCleanShutdown() PASSED
LogTest > shouldApplyEpochToMessageOnAppendIfLeader() STARTED
LogTest > shouldApplyEpochToMessageOnAppendIfLeader() PASSED
LogTest > testLogDeletionAfterClose() STARTED
LogTest > testLogDeletionAfterClose() PASSED
LogTest > testLoadProducersAfterDeleteRecordsOnSegment() STARTED
LogTest > testLoadProducersAfterDeleteRecordsOnSegment() PASSED
LogTest > testAppendToOrReadFromLogInFailedLogDir() STARTED
LogTest > testAppendToOrReadFromLogInFailedLogDir() PASSED
LogTest > testCleanShutdownFile() STARTED
LogTest > testCleanShutdownFile() PASSED
LogTest > testTransactionIndexUpdated() STARTED
LogTest > testTransactionIndexUpdated() PASSED
LogTest > testBuildTimeIndexWhenNotAssigningOffsets() STARTED
LogTest > testBuildTimeIndexWhenNotAssigningOffsets() PASSED
LogTest > testProducerExpireCheckAfterDelete() STARTED
LogTest > testProducerExpireCheckAfterDelete() PASSED
3456 tests completed, 1 failed, 7 skipped
> Task :core:test FAILED
FAILURE: Build failed with an exception.
* What went wrong:
Execution failed for task ':core:test'.
> There were failing tests. See the report at: file://<https://ci-builds.apache.org/job/Kafka/job/kafka-trunk-jdk8/ws/core/build/reports/tests/test/index.html>
* Try:
Run with --stacktrace option to get the stack trace. Run with --info or --debug option to get more log output. Run with --scan to get full insights.
* Get more help at https://help.gradle.org
Deprecated Gradle features were used in this build, making it incompatible with Gradle 7.0.
Use '--warning-mode all' to show the individual deprecation warnings.
See https://docs.gradle.org/6.8.3/userguide/command_line_interface.html#sec:command_line_warnings
BUILD FAILED in 1h 30m 35s
257 actionable tasks: 220 executed, 37 up-to-date
Build step 'Execute shell' marked build as failure
Recording test results
Not sending mail to unregistered user github@hugo-hirsch.de