You are viewing a plain text version of this content. The canonical link for it is here.
Posted to notifications@maven.apache.org by Apache Jenkins Server <je...@builds.apache.org> on 2014/12/14 10:52:41 UTC

Build failed in Jenkins: maven-enforcer-m3.1.x #149

See <https://builds.apache.org/job/maven-enforcer-m3.1.x/149/changes>

Changes:

[khmarbaise] [MENFORCER-219] Add m2e mapping

------------------------------------------
[...truncated 165 lines...]
Running org.apache.maven.plugins.enforcer.TestRequireReleaseVersion
[debug] This project cannot be a snapshot:testGroupId:snapshot:jar:2.0-SNAPSHOT
[debug] Parent Cannot be a snapshot: testGroupId:snapshot:jar:2.0-SNAPSHOT
Tests run: 2, Failures: 0, Errors: 0, Skipped: 0, Time elapsed: 0.007 sec - in org.apache.maven.plugins.enforcer.TestRequireReleaseVersion
Running org.apache.maven.plugins.enforcer.ReactorModuleConvergenceTest
Tests run: 9, Failures: 0, Errors: 0, Skipped: 0, Time elapsed: 0.553 sec - in org.apache.maven.plugins.enforcer.ReactorModuleConvergenceTest
Running org.apache.maven.plugins.enforcer.TestEvaluateBeanshell
[debug] Echo condition : ${env} == null
[debug] Echo script : "This is a test." == null
[debug] Echo evaluating : false
[debug] Echo condition : this is not valid beanshell
[debug] Echo script : this is not valid beanshell
[debug] Echo condition : ${env} == null
[debug] Echo condition : ${env} == null
[debug] Echo script : "This is a test." == null
[debug] Echo evaluating : false
[debug] Echo condition : ${env} == "This is a test."
[debug] Echo script : "This is a test." == "This is a test."
[debug] Echo evaluating : true
Tests run: 5, Failures: 0, Errors: 0, Skipped: 0, Time elapsed: 0.059 sec - in org.apache.maven.plugins.enforcer.TestEvaluateBeanshell
Running org.apache.maven.plugins.enforcer.TestNoSnapshots
[warn] The "NoSnapshots" rule is deprecated. Use "requireReleaseDeps" instead
[warn] The "NoSnapshots" rule is deprecated. Use "requireReleaseDeps" instead
[debug] Found Banned Dependency: testGroupId:snapshot:jar:2.0-SNAPSHOT
Use 'mvn dependency:tree' to locate the source of the banned dependencies.
[warn] The "NoSnapshots" rule is deprecated. Use "requireReleaseDeps" instead
[debug] Found Banned Dependency: testGroupId:snapshot:jar:2.0-SNAPSHOT
Use 'mvn dependency:tree' to locate the source of the banned dependencies.
Tests run: 2, Failures: 0, Errors: 0, Skipped: 0, Time elapsed: 0.003 sec - in org.apache.maven.plugins.enforcer.TestNoSnapshots
Running org.apache.maven.plugins.enforcer.TestRequireOS
[info] OS Info: Arch: i386 Family: unix Name: linux Version: 3.2.0-68-generic
[info] Testing Mojo Using Valid Family: unix Invalid Family: win9x
[debug] OS Info: Arch: i386 Family: unix Name: linux Version: 3.2.0-68-generic
[info] Caught Expected Exception:Invalid Family type used. Valid family types are: win9x, tandem, os/400, z/os, netware, mac, windows, os/2, unix, openvms, dos,
Tests run: 2, Failures: 0, Errors: 0, Skipped: 0, Time elapsed: 0.003 sec - in org.apache.maven.plugins.enforcer.TestRequireOS
Running org.apache.maven.plugins.enforcer.TestRequireReleaseDeps
[debug] Found Banned Dependency: testGroupId:snapshot:jar:2.0-SNAPSHOT
Use 'mvn dependency:tree' to locate the source of the banned dependencies.
[debug] Found Banned Dependency: testGroupId:snapshot:jar:2.0-SNAPSHOT
Use 'mvn dependency:tree' to locate the source of the banned dependencies.
[debug] Found Banned Dependency: testGroupId:snapshot:jar:2.0-SNAPSHOT
Use 'mvn dependency:tree' to locate the source of the banned dependencies.
[debug] Parent Cannot be a snapshot: testGroupId:snapshot:jar:2.0-SNAPSHOT
Tests run: 2, Failures: 0, Errors: 0, Skipped: 0, Time elapsed: 0.001 sec - in org.apache.maven.plugins.enforcer.TestRequireReleaseDeps
Running org.apache.maven.plugins.enforcer.RequireActiveProfileTest
Tests run: 9, Failures: 0, Errors: 0, Skipped: 0, Time elapsed: 0.077 sec - in org.apache.maven.plugins.enforcer.RequireActiveProfileTest
Running org.apache.maven.plugins.enforcer.TestAlwaysPass
[info] Always pass!
Tests run: 1, Failures: 0, Errors: 0, Skipped: 0, Time elapsed: 0 sec - in org.apache.maven.plugins.enforcer.TestAlwaysPass
Running org.apache.maven.plugins.enforcer.TestRequireJavaVersion
[debug] Detected Java String: 1.6.0_45
[debug] Normalized Java String: 1.6.0-45
[debug] Parsed Version: Major: 1 Minor: 6 Incremental: 0 Build: 45 Qualifier: null
[debug] Detected JDK Version: 1.6.0-45 is allowed in the range 1.6.0-45.
[debug] Detected Java String: 1.6.0_45
[debug] Normalized Java String: 1.6.0-45
[debug] Parsed Version: Major: 1 Minor: 6 Incremental: 0 Build: 45 Qualifier: null
[debug] Detected Java String: 1.6.0_45
[debug] Normalized Java String: 1.6.0-45
[debug] Parsed Version: Major: 1 Minor: 6 Incremental: 0 Build: 45 Qualifier: null
[debug] Detected JDK Version: 1.6.0-45 is allowed in the range 1.6.0_45.
Tests run: 3, Failures: 0, Errors: 0, Skipped: 0, Time elapsed: 0.004 sec - in org.apache.maven.plugins.enforcer.TestRequireJavaVersion
Running org.apache.maven.plugins.enforcer.BanDistributionManagementTest
Tests run: 9, Failures: 0, Errors: 0, Skipped: 0, Time elapsed: 0.117 sec - in org.apache.maven.plugins.enforcer.BanDistributionManagementTest
Running org.apache.maven.plugins.enforcer.TestRequireFilesSize
[debug] /tmp/enforcer2561221368475220521tmp size (0) is OK (max. 10000 byte).
[debug] /tmp/enforcer6531117607492616484tmp size (0) is OK (max. 10000 byte).
Tests run: 8, Failures: 0, Errors: 0, Skipped: 0, Time elapsed: 0.086 sec - in org.apache.maven.plugins.enforcer.TestRequireFilesSize
Running org.apache.maven.plugins.enforcer.TestAlwaysFail
Tests run: 1, Failures: 0, Errors: 0, Skipped: 0, Time elapsed: 0.001 sec - in org.apache.maven.plugins.enforcer.TestAlwaysFail
Running org.apache.maven.plugins.enforcer.TestBannedRepositories
Tests run: 4, Failures: 0, Errors: 0, Skipped: 0, Time elapsed: 0.16 sec - in org.apache.maven.plugins.enforcer.TestBannedRepositories
Running org.apache.maven.plugins.enforcer.TestBannedDependencies
Tests run: 21, Failures: 0, Errors: 0, Skipped: 0, Time elapsed: 0.049 sec - in org.apache.maven.plugins.enforcer.TestBannedDependencies
Running org.apache.maven.plugins.enforcer.utils.TestEnforcerRuleUtils
Tests run: 6, Failures: 0, Errors: 0, Skipped: 0, Time elapsed: 0.115 sec - in org.apache.maven.plugins.enforcer.utils.TestEnforcerRuleUtils
Running org.apache.maven.plugins.enforcer.utils.TestMockEnforcerExpressionEvaluator
Tests run: 1, Failures: 0, Errors: 0, Skipped: 0, Time elapsed: 0 sec - in org.apache.maven.plugins.enforcer.utils.TestMockEnforcerExpressionEvaluator
Running org.apache.maven.plugins.enforcer.utils.TestArtifactMatcher
Tests run: 3, Failures: 0, Errors: 0, Skipped: 0, Time elapsed: 0.004 sec - in org.apache.maven.plugins.enforcer.utils.TestArtifactMatcher
Running org.apache.maven.plugins.enforcer.TestRequireFilesDontExist
Tests run: 7, Failures: 0, Errors: 0, Skipped: 0, Time elapsed: 0.003 sec - in org.apache.maven.plugins.enforcer.TestRequireFilesDontExist
Running org.apache.maven.plugins.enforcer.TestRequirePluginVersions
Tests run: 15, Failures: 0, Errors: 0, Skipped: 0, Time elapsed: 0.263 sec - in org.apache.maven.plugins.enforcer.TestRequirePluginVersions
Running org.apache.maven.plugins.enforcer.TestRequireFilesExist
Tests run: 7, Failures: 0, Errors: 0, Skipped: 0, Time elapsed: 0.004 sec - in org.apache.maven.plugins.enforcer.TestRequireFilesExist
Running org.apache.maven.plugins.enforcer.TestAbstractVersionEnforcer
[debug] Detected test Version: 2.0.5 is allowed in the range [2.0.5,).
[debug] Detected test Version: 2.0.5 is allowed in the range [2.0.4,).
[debug] Detected test Version: 2.0.5 is allowed in the range [2.0.4,2.0.5].
[debug] Detected test Version: 2.0.5 is allowed in the range [2.0.4,2.0.6].
[debug] Detected test Version: 2.0.5 is allowed in the range [2.0.4,2.0.6).
[debug] Detected test Version: 2.0.5 is allowed in the range [2.0,).
[debug] Detected test Version: 2.0.5 is allowed in the range [2.0.0,).
[debug] Detected test Version: 2.0.5 is allowed in the range 2.0.
[debug] Detected test Version: 2.0.5 is allowed in the range 2.0.4.
[debug] Detected test Version: 2.0.5 is allowed in the range 2.0.5.
Tests run: 2, Failures: 0, Errors: 0, Skipped: 0, Time elapsed: 0.002 sec - in org.apache.maven.plugins.enforcer.TestAbstractVersionEnforcer
Running org.apache.maven.plugins.enforcer.TestRequireProperty
Tests run: 3, Failures: 0, Errors: 0, Skipped: 0, Time elapsed: 0.002 sec - in org.apache.maven.plugins.enforcer.TestRequireProperty
Running org.apache.maven.plugins.enforcer.TestRequireEnvironmentVariable
Tests run: 2, Failures: 0, Errors: 0, Skipped: 0, Time elapsed: 0.002 sec - in org.apache.maven.plugins.enforcer.TestRequireEnvironmentVariable
Running org.apache.maven.plugins.enforcer.TestMavenVersion
[debug] Detected Maven Version: 2.0.5
[debug] Detected Maven Version: 2.0.5 is allowed in the range 2.0.5.
[debug] Detected Maven Version: 2.0.5
[debug] Detected Maven Version: 2.0.5
[debug] Detected Maven Version: 2.0.5 is allowed in the range 1.6.0_45.
Tests run: 2, Failures: 0, Errors: 0, Skipped: 0, Time elapsed: 0.001 sec - in org.apache.maven.plugins.enforcer.TestMavenVersion

Results :

Tests run: 150, Failures: 0, Errors: 0, Skipped: 0

[JENKINS] Recording test results
log4j:WARN No appenders could be found for logger (org.apache.commons.beanutils.converters.BooleanConverter).
log4j:WARN Please initialize the log4j system properly.
[INFO] 
[INFO] --- maven-jar-plugin:2.5:jar (default-jar) @ enforcer-rules ---
[INFO] Building jar: <https://builds.apache.org/job/maven-enforcer-m3.1.x/ws/enforcer-rules/target/enforcer-rules-2.0-SNAPSHOT.jar>
[INFO] 
[INFO] --- maven-site-plugin:3.4:attach-descriptor (attach-descriptor) @ enforcer-rules ---
[INFO] 
[INFO] --- maven-jar-plugin:2.5:test-jar (default) @ enforcer-rules ---
[INFO] Building jar: <https://builds.apache.org/job/maven-enforcer-m3.1.x/ws/enforcer-rules/target/enforcer-rules-2.0-SNAPSHOT-tests.jar>
[INFO] 
[INFO] --- maven-checkstyle-plugin:2.13:check (checkstyle-check) @ enforcer-rules ---
[INFO] 
[INFO] There are 1 checkstyle errors.
[INFO] 
[INFO] --- maven-install-plugin:2.5.2:install (default-install) @ enforcer-rules ---
[INFO] Installing <https://builds.apache.org/job/maven-enforcer-m3.1.x/ws/enforcer-rules/target/enforcer-rules-2.0-SNAPSHOT.jar> to /home/jenkins/jenkins-slave/maven-repositories/0/org/apache/maven/enforcer/enforcer-rules/2.0-SNAPSHOT/enforcer-rules-2.0-SNAPSHOT.jar
[INFO] Installing <https://builds.apache.org/job/maven-enforcer-m3.1.x/ws/enforcer-rules/pom.xml> to /home/jenkins/jenkins-slave/maven-repositories/0/org/apache/maven/enforcer/enforcer-rules/2.0-SNAPSHOT/enforcer-rules-2.0-SNAPSHOT.pom
[INFO] Installing <https://builds.apache.org/job/maven-enforcer-m3.1.x/ws/enforcer-rules/target/enforcer-rules-2.0-SNAPSHOT-tests.jar> to /home/jenkins/jenkins-slave/maven-repositories/0/org/apache/maven/enforcer/enforcer-rules/2.0-SNAPSHOT/enforcer-rules-2.0-SNAPSHOT-tests.jar
[INFO]                                                                         
[INFO] ------------------------------------------------------------------------
[INFO] Building Apache Maven Enforcer Plugin 2.0-SNAPSHOT
[INFO] ------------------------------------------------------------------------
[INFO] 
[INFO] --- maven-clean-plugin:2.5:clean (default-clean) @ maven-enforcer-plugin ---
[INFO] Deleting <https://builds.apache.org/job/maven-enforcer-m3.1.x/ws/maven-enforcer-plugin/target>
[INFO] 
[INFO] --- maven-enforcer-plugin:1.3.1:enforce (enforce-bytecode-version) @ maven-enforcer-plugin ---
[INFO] 
[INFO] --- maven-enforcer-plugin:1.3.1:enforce (ban-known-bad-maven-versions) @ maven-enforcer-plugin ---
[INFO] 
[INFO] --- apache-rat-plugin:0.11:check (rat-check) @ maven-enforcer-plugin ---
[INFO] 51 implicit excludes (use -debug for more details).
[INFO] Exclude: src/it/projects/require-plugin-versions-plugin-with-integration-test-lifecycle/META-INF/MANIFEST.MF
[INFO] Exclude: DEPENDENCIES
[INFO] 132 resources included (use -debug for more details)
[INFO] Rat check: Summary of files. Unapproved: 1 unknown: 1 generated: 0 approved: 131 licence.
[INFO] ------------------------------------------------------------------------
[INFO] Reactor Summary:
[INFO] 
[INFO] Apache Maven Enforcer ............................. SUCCESS [5.503s]
[INFO] Apache Maven Enforcer API ......................... SUCCESS [2.545s]
[INFO] Apache Maven Enforcer Rules ....................... SUCCESS [10.107s]
[INFO] Apache Maven Enforcer Plugin ...................... FAILURE [0.997s]
[INFO] ------------------------------------------------------------------------
[INFO] BUILD FAILURE
[INFO] ------------------------------------------------------------------------
[INFO] Total time: 20.849s
[INFO] Finished at: Sun Dec 14 09:52:38 UTC 2014
[INFO] Final Memory: 24M/239M
[INFO] ------------------------------------------------------------------------
Waiting for Jenkins to finish collecting data
[ERROR] Failed to execute goal org.apache.rat:apache-rat-plugin:0.11:check (rat-check) on project maven-enforcer-plugin: Too many files with unapproved license: 1 See RAT report in: <https://builds.apache.org/job/maven-enforcer-m3.1.x/ws/maven-enforcer-plugin/target/rat.txt> -> [Help 1]
org.apache.maven.lifecycle.LifecycleExecutionException: Failed to execute goal org.apache.rat:apache-rat-plugin:0.11:check (rat-check) on project maven-enforcer-plugin: Too many files with unapproved license: 1 See RAT report in: <https://builds.apache.org/job/maven-enforcer-m3.1.x/ws/maven-enforcer-plugin/target/rat.txt>
	at org.apache.maven.lifecycle.internal.MojoExecutor.execute(MojoExecutor.java:212)
	at org.apache.maven.lifecycle.internal.MojoExecutor.execute(MojoExecutor.java:153)
	at org.apache.maven.lifecycle.internal.MojoExecutor.execute(MojoExecutor.java:145)
	at org.apache.maven.lifecycle.internal.LifecycleModuleBuilder.buildProject(LifecycleModuleBuilder.java:84)
	at org.apache.maven.lifecycle.internal.LifecycleModuleBuilder.buildProject(LifecycleModuleBuilder.java:59)
	at org.apache.maven.lifecycle.internal.LifecycleStarter.singleThreadedBuild(LifecycleStarter.java:183)
	at org.apache.maven.lifecycle.internal.LifecycleStarter.execute(LifecycleStarter.java:161)
	at org.apache.maven.DefaultMaven.doExecute(DefaultMaven.java:317)
	at org.apache.maven.DefaultMaven.execute(DefaultMaven.java:152)
	at org.jvnet.hudson.maven3.launcher.Maven31Launcher.main(Maven31Launcher.java:132)
	at sun.reflect.NativeMethodAccessorImpl.invoke0(Native Method)
	at sun.reflect.NativeMethodAccessorImpl.invoke(NativeMethodAccessorImpl.java:39)
	at sun.reflect.DelegatingMethodAccessorImpl.invoke(DelegatingMethodAccessorImpl.java:25)
	at java.lang.reflect.Method.invoke(Method.java:597)
	at org.codehaus.plexus.classworlds.launcher.Launcher.launchStandard(Launcher.java:330)
	at org.codehaus.plexus.classworlds.launcher.Launcher.launch(Launcher.java:238)
	at jenkins.maven3.agent.Maven31Main.launch(Maven31Main.java:181)
	at sun.reflect.NativeMethodAccessorImpl.invoke0(Native Method)
	at sun.reflect.NativeMethodAccessorImpl.invoke(NativeMethodAccessorImpl.java:39)
	at sun.reflect.DelegatingMethodAccessorImpl.invoke(DelegatingMethodAccessorImpl.java:25)
	at java.lang.reflect.Method.invoke(Method.java:597)
	at hudson.maven.Maven3Builder.call(Maven3Builder.java:136)
	at hudson.maven.Maven3Builder.call(Maven3Builder.java:71)
	at hudson.remoting.UserRequest.perform(UserRequest.java:118)
	at hudson.remoting.UserRequest.perform(UserRequest.java:48)
	at hudson.remoting.Request$2.run(Request.java:328)
	at hudson.remoting.InterceptingExecutorService$1.call(InterceptingExecutorService.java:72)
	at java.util.concurrent.FutureTask$Sync.innerRun(FutureTask.java:303)
	at java.util.concurrent.FutureTask.run(FutureTask.java:138)
	at java.util.concurrent.ThreadPoolExecutor$Worker.runTask(ThreadPoolExecutor.java:895)
	at java.util.concurrent.ThreadPoolExecutor$Worker.run(ThreadPoolExecutor.java:918)
	at java.lang.Thread.run(Thread.java:662)
Caused by: org.apache.rat.mp.RatCheckException: Too many files with unapproved license: 1 See RAT report in: <https://builds.apache.org/job/maven-enforcer-m3.1.x/ws/maven-enforcer-plugin/target/rat.txt>
	at org.apache.rat.mp.RatCheckMojo.check(RatCheckMojo.java:194)
	at org.apache.rat.mp.RatCheckMojo.execute(RatCheckMojo.java:182)
	at org.apache.maven.plugin.DefaultBuildPluginManager.executeMojo(DefaultBuildPluginManager.java:106)
	at org.apache.maven.lifecycle.internal.MojoExecutor.execute(MojoExecutor.java:208)
	... 31 more
[ERROR] 
[ERROR] Re-run Maven using the -X switch to enable full debug logging.
[ERROR] 
[ERROR] For more information about the errors and possible solutions, please read the following articles:
[ERROR] [Help 1] http://cwiki.apache.org/confluence/display/MAVEN/MojoFailureException
[ERROR] 
[ERROR] After correcting the problems, you can resume the build with the command
[ERROR]   mvn <goals> -rf :maven-enforcer-plugin
[JENKINS] Archiving <https://builds.apache.org/job/maven-enforcer-m3.1.x/ws/enforcer-rules/pom.xml> to org.apache.maven.enforcer/enforcer-rules/2.0-SNAPSHOT/enforcer-rules-2.0-SNAPSHOT.pom
[JENKINS] Archiving <https://builds.apache.org/job/maven-enforcer-m3.1.x/ws/enforcer-rules/target/enforcer-rules-2.0-SNAPSHOT.jar> to org.apache.maven.enforcer/enforcer-rules/2.0-SNAPSHOT/enforcer-rules-2.0-SNAPSHOT.jar
[JENKINS] Archiving <https://builds.apache.org/job/maven-enforcer-m3.1.x/ws/enforcer-rules/target/enforcer-rules-2.0-SNAPSHOT-tests.jar> to org.apache.maven.enforcer/enforcer-rules/2.0-SNAPSHOT/enforcer-rules-2.0-SNAPSHOT-tests.jar
Sending artifact delta relative to maven-enforcer-m3.1.x ? Apache Maven Enforcer Rules #148
Archived 3 artifacts
Archive block size is 32768
Received 0 blocks and 200997 bytes
Compression is 0.0%
Took 0.14 sec
[JENKINS] Archiving <https://builds.apache.org/job/maven-enforcer-m3.1.x/ws/enforcer-api/pom.xml> to org.apache.maven.enforcer/enforcer-api/2.0-SNAPSHOT/enforcer-api-2.0-SNAPSHOT.pom
[JENKINS] Archiving <https://builds.apache.org/job/maven-enforcer-m3.1.x/ws/enforcer-api/target/enforcer-api-2.0-SNAPSHOT.jar> to org.apache.maven.enforcer/enforcer-api/2.0-SNAPSHOT/enforcer-api-2.0-SNAPSHOT.jar
Sending artifact delta relative to maven-enforcer-m3.1.x ? Apache Maven Enforcer API #148
Archived 2 artifacts
Archive block size is 32768
Received 0 blocks and 13842 bytes
Compression is 0.0%
Took 62 ms
[JENKINS] Archiving <https://builds.apache.org/job/maven-enforcer-m3.1.x/ws/pom.xml> to org.apache.maven.enforcer/enforcer/2.0-SNAPSHOT/enforcer-2.0-SNAPSHOT.pom
[JENKINS] Archiving <https://builds.apache.org/job/maven-enforcer-m3.1.x/ws/target/enforcer-2.0-SNAPSHOT-site.xml> to org.apache.maven.enforcer/enforcer/2.0-SNAPSHOT/enforcer-2.0-SNAPSHOT-site.xml
Sending artifact delta relative to maven-enforcer-m3.1.x ? Apache Maven Enforcer #148
Archived 2 artifacts
Archive block size is 32768
Received 0 blocks and 8804 bytes
Compression is 0.0%
Took 36 ms
[JENKINS] Archiving <https://builds.apache.org/job/maven-enforcer-m3.1.x/ws/maven-enforcer-plugin/pom.xml> to org.apache.maven.plugins/maven-enforcer-plugin/2.0-SNAPSHOT/maven-enforcer-plugin-2.0-SNAPSHOT.pom
Sending artifact delta relative to maven-enforcer-m3.1.x ? Apache Maven Enforcer Plugin #148
Archived 1 artifacts
Archive block size is 32768
Received 0 blocks and 7100 bytes
Compression is 0.0%
Took 51 ms
Sending e-mails to: notifications@maven.apache.org khmarbaise@apache.org
channel stopped

Jenkins build is back to normal : maven-enforcer-m3.1.x #150

Posted by Apache Jenkins Server <je...@builds.apache.org>.
See <https://builds.apache.org/job/maven-enforcer-m3.1.x/150/changes>