You are viewing a plain text version of this content. The canonical link for it is here.
Posted to dev@tuscany.apache.org by Apache Hudson Server <hu...@hudson.zones.apache.org> on 2009/08/23 03:49:54 UTC
Build failed in Hudson: Tuscany-2.x-JDK1.5 » Apache Tuscany SCA iTest Distribution calculator-rmi #5
See http://hudson.zones.apache.org/hudson/job/Tuscany-2.x-JDK1.5/org.apache.tuscany.sca$itest-distribution-calculator-rmi/5/
------------------------------------------
[INFO] ------------------------------------------------------------------------
[INFO] Building Apache Tuscany SCA iTest Distribution calculator-rmi
[INFO] task-segment: [clean, install]
[INFO] ------------------------------------------------------------------------
[INFO] [clean:clean]
[INFO] Deleting directory http://hudson.zones.apache.org/hudson/job/Tuscany-2.x-JDK1.5/org.apache.tuscany.sca$itest-distribution-calculator-rmi/ws/target
[INFO] [resources:resources]
[INFO] Using default encoding to copy filtered resources.
[INFO] [compiler:compile]
[INFO] No sources to compile
[INFO] [resources:testResources]
[INFO] Using default encoding to copy filtered resources.
[INFO] [compiler:testCompile]
[INFO] No sources to compile
[INFO] [surefire:test]
[INFO] No tests to run.
[HUDSON] Recording test results
[INFO] [jar:jar]
[INFO] Building jar: http://hudson.zones.apache.org/hudson/job/Tuscany-2.x-JDK1.5/org.apache.tuscany.sca$itest-distribution-calculator-rmi/ws/target/itest-distribution-calculator-rmi-2.0-SNAPSHOT.jar
[INFO] [antrun:run {execution: run-samples}]
[INFO] Executing tasks
run:
init:
[mkdir] Created dir: /export/home/hudson/hudson/jobs/Tuscany-2.x-JDK1.5/workspace/sca/distribution/all/target/apache-tuscany-sca-all-2.0-SNAPSHOT-dir/tuscany-sca-2.0-SNAPSHOT/samples/calculator-rmi-service/target/classes
compile:
[javac] Compiling 12 source files to /export/home/hudson/hudson/jobs/Tuscany-2.x-JDK1.5/workspace/sca/distribution/all/target/apache-tuscany-sca-all-2.0-SNAPSHOT-dir/tuscany-sca-2.0-SNAPSHOT/samples/calculator-rmi-service/target/classes
[copy] Copying 2 files to /export/home/hudson/hudson/jobs/Tuscany-2.x-JDK1.5/workspace/sca/distribution/all/target/apache-tuscany-sca-all-2.0-SNAPSHOT-dir/tuscany-sca-2.0-SNAPSHOT/samples/calculator-rmi-service/target/classes
[jar] Building jar: /export/home/hudson/hudson/jobs/Tuscany-2.x-JDK1.5/workspace/sca/distribution/all/target/apache-tuscany-sca-all-2.0-SNAPSHOT-dir/tuscany-sca-2.0-SNAPSHOT/samples/calculator-rmi-service/target/sample-calculator-rmi-service.jar
run:
init:
[mkdir] Created dir: /export/home/hudson/hudson/jobs/Tuscany-2.x-JDK1.5/workspace/sca/distribution/all/target/apache-tuscany-sca-all-2.0-SNAPSHOT-dir/tuscany-sca-2.0-SNAPSHOT/samples/calculator-rmi-reference/target/classes
compile:
[javac] Compiling 7 source files to /export/home/hudson/hudson/jobs/Tuscany-2.x-JDK1.5/workspace/sca/distribution/all/target/apache-tuscany-sca-all-2.0-SNAPSHOT-dir/tuscany-sca-2.0-SNAPSHOT/samples/calculator-rmi-reference/target/classes
[copy] Copying 1 file to /export/home/hudson/hudson/jobs/Tuscany-2.x-JDK1.5/workspace/sca/distribution/all/target/apache-tuscany-sca-all-2.0-SNAPSHOT-dir/tuscany-sca-2.0-SNAPSHOT/samples/calculator-rmi-reference/target/classes
[jar] Building jar: /export/home/hudson/hudson/jobs/Tuscany-2.x-JDK1.5/workspace/sca/distribution/all/target/apache-tuscany-sca-all-2.0-SNAPSHOT-dir/tuscany-sca-2.0-SNAPSHOT/samples/calculator-rmi-reference/target/sample-calculator-rmi-reference.jar
run:
[java] Aug 23, 2009 1:48:50 AM org.apache.tuscany.sca.node.impl.NodeImpl start
[java] INFO: Starting node: http://tuscany.apache.org/sca/1.1/nodes/default0 domain: tuscany.apache.org
[java] Aug 23, 2009 1:48:50 AM org.apache.tuscany.sca.node.impl.NodeImpl start
[java] INFO: Starting node: http://tuscany.apache.org/sca/1.1/nodes/default0 domain: tuscany.apache.org
[java] 2009-08-23 01:48:52.217::INFO: Logging to STDERR via org.mortbay.log.StdErrLog
[java] 2009-08-23 01:48:52.497::INFO: Logging to STDERR via org.mortbay.log.StdErrLog
[java] Aug 23, 2009 1:49:03 AM org.apache.tuscany.sca.node.impl.NodeFactoryImpl loadContributions
[java] INFO: Loading contribution: file:/zonestorage/hudson/home/hudson/hudson/jobs/Tuscany-2.x-JDK1.5/workspace/sca/distribution/all/target/apache-tuscany-sca-all-2.0-SNAPSHOT-dir/tuscany-sca-2.0-SNAPSHOT/samples/calculator-rmi-reference/target/sample-calculator-rmi-reference.jar
[java] Aug 23, 2009 1:49:03 AM org.apache.tuscany.sca.node.impl.NodeFactoryImpl loadContributions
[java] INFO: Loading contribution: file:/zonestorage/hudson/home/hudson/hudson/jobs/Tuscany-2.x-JDK1.5/workspace/sca/distribution/all/target/apache-tuscany-sca-all-2.0-SNAPSHOT-dir/tuscany-sca-2.0-SNAPSHOT/samples/calculator-rmi-service/target/sample-calculator-rmi-service.jar
[java] Aug 23, 2009 1:49:04 AM org.apache.tuscany.sca.node.impl.NodeFactoryImpl configureNode
[java] INFO: Adding composite: {http://sample}Calculator to domain
[java] Aug 23, 2009 1:49:04 AM org.apache.tuscany.sca.node.impl.NodeFactoryImpl configureNode
[java] INFO: Adding composite: {http://sample}Calculator to domain
[java] Aug 23, 2009 1:49:04 AM org.apache.tuscany.sca.endpoint.impl.EndpointRegistryImpl addEndpoint
[java] INFO: Add endpoint - (@13305839)Endpoint: URI = CalculatorServiceComponent#service-binding(CalculatorService/CalculatorService)
[java] Aug 23, 2009 1:49:04 AM org.apache.tuscany.sca.endpoint.impl.EndpointRegistryImpl addEndpointReference
[java] INFO: Add endpoint reference - (@24512621)EndpointReference: URI = CalculatorServiceComponent#reference-binding(subtractService/subtractService) RESOLVED_BINDING Target = (@2310757)Endpoint:
[java] Aug 23, 2009 1:49:04 AM org.apache.tuscany.sca.endpoint.impl.EndpointRegistryImpl addEndpointReference
[java] INFO: Add endpoint reference - (@24658983)EndpointReference: URI = CalculatorServiceComponent#reference-binding(addService/addService) RESOLVED_BINDING Target = (@12743356)Endpoint:
[java] Aug 23, 2009 1:49:04 AM org.apache.tuscany.sca.endpoint.impl.EndpointRegistryImpl addEndpointReference
[java] INFO: Add endpoint reference - (@33212498)EndpointReference: URI = CalculatorServiceComponent#reference-binding(multiplyService/multiplyService) RESOLVED_BINDING Target = (@24480977)Endpoint:
[java] Aug 23, 2009 1:49:04 AM org.apache.tuscany.sca.endpoint.impl.EndpointRegistryImpl addEndpointReference
[java] INFO: Add endpoint reference - (@7339385)EndpointReference: URI = CalculatorServiceComponent#reference-binding(divideService/divideService) RESOLVED_BINDING Target = (@6964063)Endpoint:
[java] Aug 23, 2009 1:49:04 AM org.apache.tuscany.sca.endpoint.impl.EndpointRegistryImpl addEndpointReference
[java] INFO: Add endpoint reference - (@13158358)EndpointReference: URI = CalculatorServiceComponent#reference-binding($self$.CalculatorService/CalculatorService) WIRED_TARGET_FOUND_AND_MATCHED Target = (@13305839)Endpoint: URI = CalculatorServiceComponent#service-binding(CalculatorService/CalculatorService)
[java] Exception in thread "main" java.lang.reflect.InvocationTargetException
[java] at sun.reflect.NativeMethodAccessorImpl.invoke0(Native Method)
[java] at sun.reflect.NativeMethodAccessorImpl.invoke(NativeMethodAccessorImpl.java:39)
[java] at sun.reflect.DelegatingMethodAccessorImpl.invoke(DelegatingMethodAccessorImpl.java:25)
[java] at java.lang.reflect.Method.invoke(Method.java:585)
[java] at org.apache.tuscany.sca.launcher.LauncherMain.invokeMainMethod(LauncherMain.java:114)
[java] at org.apache.tuscany.sca.launcher.LauncherMain.main(LauncherMain.java:55)
[java] Caused by: org.apache.tuscany.sca.host.rmi.RMIHostRuntimeException: Connection refused to host: localhost; nested exception is:
[java] java.net.ConnectException: Connection refused
[java] at sun.rmi.transport.tcp.TCPEndpoint.newSocket(TCPEndpoint.java:574)
[java] at sun.rmi.transport.tcp.TCPChannel.createConnection(TCPChannel.java:185)
[java] at sun.rmi.transport.tcp.TCPChannel.newConnection(TCPChannel.java:171)
[java] at sun.rmi.server.UnicastRef.newCall(UnicastRef.java:306)
[java] at sun.rmi.registry.RegistryImpl_Stub.lookup(Unknown Source)
[java] at org.apache.tuscany.sca.host.rmi.DefaultRMIHost.findService(DefaultRMIHost.java:116)
[java] at org.apache.tuscany.sca.host.rmi.ExtensibleRMIHost.findService(ExtensibleRMIHost.java:56)
[java] at org.apache.tuscany.sca.binding.rmi.provider.RMIBindingInvoker.invokeTarget(RMIBindingInvoker.java:81)
[java] at org.apache.tuscany.sca.binding.rmi.provider.RMIBindingInvoker.invoke(RMIBindingInvoker.java:54)
[java] at org.apache.tuscany.sca.core.invocation.impl.JDKInvocationHandler.invoke(JDKInvocationHandler.java:277)
[java] at org.apache.tuscany.sca.core.invocation.impl.JDKInvocationHandler.invoke(JDKInvocationHandler.java:142)
[java] at $Proxy7.add(Unknown Source)
[java] at calculator.CalculatorServiceImpl.add(CalculatorServiceImpl.java:54)
[java] at sun.reflect.NativeMethodAccessorImpl.invoke0(Native Method)
[java] at sun.reflect.NativeMethodAccessorImpl.invoke(NativeMethodAccessorImpl.java:39)
[java] at sun.reflect.DelegatingMethodAccessorImpl.invoke(DelegatingMethodAccessorImpl.java:25)
[java] at java.lang.reflect.Method.invoke(Method.java:585)
[java] at org.apache.tuscany.sca.implementation.java.invocation.JavaImplementationInvoker.invoke(JavaImplementationInvoker.java:136)
[java] at org.apache.tuscany.sca.core.databinding.wire.PassByValueInterceptor.invoke(PassByValueInterceptor.java:61)
[java] at org.apache.tuscany.sca.binding.sca.provider.SCABindingInvoker.invoke(SCABindingInvoker.java:61)
[java] at org.apache.tuscany.sca.core.databinding.wire.PassByValueInterceptor.invoke(PassByValueInterceptor.java:61)
[java] at org.apache.tuscany.sca.core.invocation.impl.JDKInvocationHandler.invoke(JDKInvocationHandler.java:277)
[java] at org.apache.tuscany.sca.core.invocation.impl.JDKInvocationHandler.invoke(JDKInvocationHandler.java:142)
[java] at $Proxy5.add(Unknown Source)
[java] at calculator.CalculatorClient.main(CalculatorClient.java:40)
[java] ... 6 more
[java] Aug 23, 2009 1:49:05 AM org.apache.tuscany.sca.host.rmi.DefaultRMIHost registerService
[java] INFO: RMI service registered: rmi://localhost:8099/CalculatorRMIService
[java] Aug 23, 2009 1:49:05 AM org.apache.tuscany.sca.endpoint.impl.EndpointRegistryImpl addEndpoint
[java] INFO: Add endpoint - (@32879825)Endpoint: URI = CalculatorServiceComponent#service-binding(CalculatorService/CalculatorService)
[java] Aug 23, 2009 1:49:05 AM org.apache.tuscany.sca.endpoint.impl.EndpointRegistryImpl addEndpointReference
[java] INFO: Add endpoint reference - (@3289716)EndpointReference: URI = CalculatorServiceComponent#reference(subtractService) WIRED_TARGET_FOUND_READY_FOR_MATCHING Target = (@26116262)Endpoint: URI = SubtractServiceComponent#service(SubtractServiceImpl) [Unresolved]
[java] Aug 23, 2009 1:49:05 AM org.apache.tuscany.sca.endpoint.impl.EndpointRegistryImpl addEndpointReference
[java] INFO: Add endpoint reference - (@15087110)EndpointReference: URI = CalculatorServiceComponent#reference(addService) WIRED_TARGET_FOUND_READY_FOR_MATCHING Target = (@31779675)Endpoint: URI = AddServiceComponent#service(AddServiceImpl) [Unresolved]
[java] Aug 23, 2009 1:49:05 AM org.apache.tuscany.sca.endpoint.impl.EndpointRegistryImpl addEndpointReference
[java] INFO: Add endpoint reference - (@1553074)EndpointReference: URI = CalculatorServiceComponent#reference(multiplyService) WIRED_TARGET_FOUND_READY_FOR_MATCHING Target = (@30725267)Endpoint: URI = MultiplyServiceComponent#service(MultiplyServiceImpl) [Unresolved]
[java] Aug 23, 2009 1:49:05 AM org.apache.tuscany.sca.endpoint.impl.EndpointRegistryImpl addEndpointReference
[java] INFO: Add endpoint reference - (@30423630)EndpointReference: URI = CalculatorServiceComponent#reference(divideService) WIRED_TARGET_FOUND_READY_FOR_MATCHING Target = (@27517983)Endpoint: URI = DivideServiceComponent#service(DivideServiceImpl) [Unresolved]
[java] Aug 23, 2009 1:49:05 AM org.apache.tuscany.sca.endpoint.impl.EndpointRegistryImpl addEndpoint
[java] INFO: Add endpoint - (@14011068)Endpoint: URI = AddServiceComponent#service-binding(AddServiceImpl/AddServiceImpl)
[java] Aug 23, 2009 1:49:05 AM org.apache.tuscany.sca.endpoint.impl.EndpointRegistryImpl addEndpoint
[java] INFO: Add endpoint - (@32574055)Endpoint: URI = SubtractServiceComponent#service-binding(SubtractServiceImpl/SubtractServiceImpl)
[java] Aug 23, 2009 1:49:05 AM org.apache.tuscany.sca.endpoint.impl.EndpointRegistryImpl addEndpoint
[java] INFO: Add endpoint - (@31594013)Endpoint: URI = MultiplyServiceComponent#service-binding(MultiplyServiceImpl/MultiplyServiceImpl)
[java] Aug 23, 2009 1:49:05 AM org.apache.tuscany.sca.endpoint.impl.EndpointRegistryImpl addEndpoint
[java] INFO: Add endpoint - (@1704781)Endpoint: URI = DivideServiceComponent#service-binding(DivideServiceImpl/DivideServiceImpl)
[java] Hit enter to stop node...
[HUDSON] Archiving http://hudson.zones.apache.org/hudson/job/Tuscany-2.x-JDK1.5/org.apache.tuscany.sca$itest-distribution-calculator-rmi/ws/pom.xml to /export/home/hudson/hudson/jobs/Tuscany-2.x-JDK1.5/modules/org.apache.tuscany.sca$itest-distribution-calculator-rmi/builds/2009-08-23_00-30-19/archive/org.apache.tuscany.sca/itest-distribution-calculator-rmi/2.0-SNAPSHOT/pom.xml
[HUDSON] Archiving http://hudson.zones.apache.org/hudson/job/Tuscany-2.x-JDK1.5/org.apache.tuscany.sca$itest-distribution-calculator-rmi/ws/target/itest-distribution-calculator-rmi-2.0-SNAPSHOT.jar to /export/home/hudson/hudson/jobs/Tuscany-2.x-JDK1.5/modules/org.apache.tuscany.sca$itest-distribution-calculator-rmi/builds/2009-08-23_00-30-19/archive/org.apache.tuscany.sca/itest-distribution-calculator-rmi/2.0-SNAPSHOT/itest-distribution-calculator-rmi-2.0-SNAPSHOT.jar
[INFO] ------------------------------------------------------------------------
[ERROR] BUILD ERROR
[INFO] ------------------------------------------------------------------------
[INFO] An Ant BuildException has occured: The following error occurred while executing this line:
http://hudson.zones.apache.org/hudson/job/Tuscany-2.x-JDK1.5/org.apache.tuscany.sca$itest-distribution-calculator-rmi/ws/build.xml :44: The following error occurred while executing this line:
/export/home/hudson/hudson/jobs/Tuscany-2.x-JDK1.5/workspace/sca/distribution/all/target/apache-tuscany-sca-all-2.0-SNAPSHOT-dir/tuscany-sca-2.0-SNAPSHOT/samples/calculator-rmi-reference/build.xml:59: Java returned: 1
[INFO] ------------------------------------------------------------------------
[INFO] For more information, run Maven with the -e switch
[INFO] ------------------------------------------------------------------------
[INFO] Total time: 78 minutes 53 seconds
[INFO] Finished at: Sun Aug 23 01:49:17 UTC 2009
Build failed in Hudson: Tuscany-2.x-JDK1.5 » Apache Tuscany SCA iTest Distribution calculator-rmi #8
Posted by Apache Hudson Server <hu...@hudson.zones.apache.org>.
See http://hudson.zones.apache.org/hudson/job/Tuscany-2.x-JDK1.5/org.apache.tuscany.sca$itest-distribution-calculator-rmi/8/
------------------------------------------
[INFO] ------------------------------------------------------------------------
[INFO] Building Apache Tuscany SCA iTest Distribution calculator-rmi
[INFO] task-segment: [clean, install]
[INFO] ------------------------------------------------------------------------
[INFO] [clean:clean]
[INFO] Deleting directory http://hudson.zones.apache.org/hudson/job/Tuscany-2.x-JDK1.5/org.apache.tuscany.sca$itest-distribution-calculator-rmi/ws/target
[INFO] [resources:resources]
[INFO] Using default encoding to copy filtered resources.
[INFO] [compiler:compile]
[INFO] No sources to compile
[INFO] [resources:testResources]
[INFO] Using default encoding to copy filtered resources.
[INFO] [compiler:testCompile]
[INFO] No sources to compile
[INFO] [surefire:test]
[INFO] No tests to run.
[HUDSON] Recording test results
[INFO] [jar:jar]
[INFO] Building jar: http://hudson.zones.apache.org/hudson/job/Tuscany-2.x-JDK1.5/org.apache.tuscany.sca$itest-distribution-calculator-rmi/ws/target/itest-distribution-calculator-rmi-2.0-SNAPSHOT.jar
[INFO] [antrun:run {execution: run-samples}]
[INFO] Executing tasks
run:
init:
[mkdir] Created dir: /export/home/hudson/hudson/jobs/Tuscany-2.x-JDK1.5/workspace/sca/distribution/all/target/apache-tuscany-sca-all-2.0-SNAPSHOT-dir/tuscany-sca-2.0-SNAPSHOT/samples/calculator-rmi-service/target/classes
compile:
[javac] Compiling 12 source files to /export/home/hudson/hudson/jobs/Tuscany-2.x-JDK1.5/workspace/sca/distribution/all/target/apache-tuscany-sca-all-2.0-SNAPSHOT-dir/tuscany-sca-2.0-SNAPSHOT/samples/calculator-rmi-service/target/classes
[copy] Copying 2 files to /export/home/hudson/hudson/jobs/Tuscany-2.x-JDK1.5/workspace/sca/distribution/all/target/apache-tuscany-sca-all-2.0-SNAPSHOT-dir/tuscany-sca-2.0-SNAPSHOT/samples/calculator-rmi-service/target/classes
[jar] Building jar: /export/home/hudson/hudson/jobs/Tuscany-2.x-JDK1.5/workspace/sca/distribution/all/target/apache-tuscany-sca-all-2.0-SNAPSHOT-dir/tuscany-sca-2.0-SNAPSHOT/samples/calculator-rmi-service/target/sample-calculator-rmi-service.jar
run:
init:
[mkdir] Created dir: /export/home/hudson/hudson/jobs/Tuscany-2.x-JDK1.5/workspace/sca/distribution/all/target/apache-tuscany-sca-all-2.0-SNAPSHOT-dir/tuscany-sca-2.0-SNAPSHOT/samples/calculator-rmi-reference/target/classes
compile:
[javac] Compiling 7 source files to /export/home/hudson/hudson/jobs/Tuscany-2.x-JDK1.5/workspace/sca/distribution/all/target/apache-tuscany-sca-all-2.0-SNAPSHOT-dir/tuscany-sca-2.0-SNAPSHOT/samples/calculator-rmi-reference/target/classes
[copy] Copying 1 file to /export/home/hudson/hudson/jobs/Tuscany-2.x-JDK1.5/workspace/sca/distribution/all/target/apache-tuscany-sca-all-2.0-SNAPSHOT-dir/tuscany-sca-2.0-SNAPSHOT/samples/calculator-rmi-reference/target/classes
[jar] Building jar: /export/home/hudson/hudson/jobs/Tuscany-2.x-JDK1.5/workspace/sca/distribution/all/target/apache-tuscany-sca-all-2.0-SNAPSHOT-dir/tuscany-sca-2.0-SNAPSHOT/samples/calculator-rmi-reference/target/sample-calculator-rmi-reference.jar
run:
[java] Exception in thread "main" java.lang.ClassNotFoundException: org.apache.tuscany.sca.node.DomainNodeMain
[java] at java.net.URLClassLoader$1.run(URLClassLoader.java:200)
[java] at java.security.AccessController.doPrivileged(Native Method)
[java] at java.net.URLClassLoader.findClass(URLClassLoader.java:188)
[java] at java.lang.ClassLoader.loadClass(ClassLoader.java:306)
[java] at java.lang.ClassLoader.loadClass(ClassLoader.java:251)
[java] at java.lang.ClassLoader.loadClassInternal(ClassLoader.java:319)
[java] at java.lang.Class.forName0(Native Method)
[java] at java.lang.Class.forName(Class.java:242)
[java] at org.apache.tuscany.sca.launcher.LauncherMain.invokeMainMethod(LauncherMain.java:112)
[java] at org.apache.tuscany.sca.launcher.LauncherMain.main(LauncherMain.java:56)
[java] Sep 13, 2009 1:34:53 AM org.apache.tuscany.sca.node.impl.NodeImpl start
[java] INFO: Starting node: http://tuscany.apache.org/sca/1.1/nodes/default0 domain: tuscany.apache.org
[java] 2009-09-13 01:34:54.865::INFO: Logging to STDERR via org.mortbay.log.StdErrLog
[java] Sep 13, 2009 1:34:55 AM org.apache.tuscany.sca.endpoint.wrapper.EndpointRegistryWrapper start
[java] INFO: Using in-VM EndpointRegistry
[java] Sep 13, 2009 1:35:02 AM org.apache.tuscany.sca.node.impl.NodeFactoryImpl loadContributions
[java] INFO: Loading contribution: file:/zonestorage/hudson/home/hudson/hudson/jobs/Tuscany-2.x-JDK1.5/workspace/sca/distribution/all/target/apache-tuscany-sca-all-2.0-SNAPSHOT-dir/tuscany-sca-2.0-SNAPSHOT/samples/calculator-rmi-reference/target/sample-calculator-rmi-reference.jar
[java] Sep 13, 2009 1:35:02 AM org.apache.tuscany.sca.node.impl.NodeFactoryImpl configureNode
[java] INFO: Adding composite: {http://sample}Calculator to domain http://tuscany.apache.org/sca/1.1/domains/default
[java] Sep 13, 2009 1:35:02 AM org.apache.tuscany.sca.endpoint.impl.EndpointRegistryImpl addEndpoint
[java] INFO: Add endpoint - (@20010005)Endpoint: URI = CalculatorServiceComponent#service-binding(CalculatorService/CalculatorService)
[java] Exception in thread "main" java.lang.reflect.InvocationTargetException
[java] at sun.reflect.NativeMethodAccessorImpl.invoke0(Native Method)
[java] at sun.reflect.NativeMethodAccessorImpl.invoke(NativeMethodAccessorImpl.java:39)
[java] at sun.reflect.DelegatingMethodAccessorImpl.invoke(DelegatingMethodAccessorImpl.java:25)
[java] at java.lang.reflect.Method.invoke(Method.java:585)
[java] at org.apache.tuscany.sca.launcher.LauncherMain.invokeMainMethod(LauncherMain.java:115)
[java] at org.apache.tuscany.sca.launcher.LauncherMain.main(LauncherMain.java:56)
[java] Caused by: org.apache.tuscany.sca.host.rmi.RMIHostRuntimeException: Connection refused to host: localhost; nested exception is:
[java] java.net.ConnectException: Connection refused
[java] at sun.rmi.transport.tcp.TCPEndpoint.newSocket(TCPEndpoint.java:574)
[java] at sun.rmi.transport.tcp.TCPChannel.createConnection(TCPChannel.java:185)
[java] at sun.rmi.transport.tcp.TCPChannel.newConnection(TCPChannel.java:171)
[java] at sun.rmi.server.UnicastRef.newCall(UnicastRef.java:306)
[java] at sun.rmi.registry.RegistryImpl_Stub.lookup(Unknown Source)
[java] at org.apache.tuscany.sca.host.rmi.DefaultRMIHost.findService(DefaultRMIHost.java:116)
[java] at org.apache.tuscany.sca.host.rmi.ExtensibleRMIHost.findService(ExtensibleRMIHost.java:56)
[java] at org.apache.tuscany.sca.binding.rmi.provider.RMIBindingInvoker.invokeTarget(RMIBindingInvoker.java:81)
[java] at org.apache.tuscany.sca.binding.rmi.provider.RMIBindingInvoker.invoke(RMIBindingInvoker.java:54)
[java] at org.apache.tuscany.sca.core.invocation.impl.JDKInvocationHandler.invoke(JDKInvocationHandler.java:289)
[java] at org.apache.tuscany.sca.core.invocation.impl.JDKInvocationHandler.invoke(JDKInvocationHandler.java:154)
[java] at $Proxy7.add(Unknown Source)
[java] at calculator.CalculatorServiceImpl.add(CalculatorServiceImpl.java:54)
[java] at sun.reflect.NativeMethodAccessorImpl.invoke0(Native Method)
[java] at sun.reflect.NativeMethodAccessorImpl.invoke(NativeMethodAccessorImpl.java:39)
[java] at sun.reflect.DelegatingMethodAccessorImpl.invoke(DelegatingMethodAccessorImpl.java:25)
[java] at java.lang.reflect.Method.invoke(Method.java:585)
[java] at org.apache.tuscany.sca.implementation.java.invocation.JavaImplementationInvoker.invoke(JavaImplementationInvoker.java:136)
[java] at org.apache.tuscany.sca.core.databinding.wire.PassByValueInterceptor.invoke(PassByValueInterceptor.java:61)
[java] at org.apache.tuscany.sca.binding.sca.provider.SCABindingInvoker.invoke(SCABindingInvoker.java:61)
[java] at org.apache.tuscany.sca.core.databinding.wire.PassByValueInterceptor.invoke(PassByValueInterceptor.java:61)
[java] at org.apache.tuscany.sca.core.invocation.impl.JDKInvocationHandler.invoke(JDKInvocationHandler.java:289)
[java] at org.apache.tuscany.sca.core.invocation.impl.JDKInvocationHandler.invoke(JDKInvocationHandler.java:154)
[java] at $Proxy5.add(Unknown Source)
[java] at calculator.CalculatorClient.main(CalculatorClient.java:40)
[java] ... 6 more
[HUDSON] Archiving http://hudson.zones.apache.org/hudson/job/Tuscany-2.x-JDK1.5/org.apache.tuscany.sca$itest-distribution-calculator-rmi/ws/pom.xml to /export/home/hudson/hudson/jobs/Tuscany-2.x-JDK1.5/modules/org.apache.tuscany.sca$itest-distribution-calculator-rmi/builds/2009-09-13_00-27-00/archive/org.apache.tuscany.sca/itest-distribution-calculator-rmi/2.0-SNAPSHOT/pom.xml
[HUDSON] Archiving http://hudson.zones.apache.org/hudson/job/Tuscany-2.x-JDK1.5/org.apache.tuscany.sca$itest-distribution-calculator-rmi/ws/target/itest-distribution-calculator-rmi-2.0-SNAPSHOT.jar to /export/home/hudson/hudson/jobs/Tuscany-2.x-JDK1.5/modules/org.apache.tuscany.sca$itest-distribution-calculator-rmi/builds/2009-09-13_00-27-00/archive/org.apache.tuscany.sca/itest-distribution-calculator-rmi/2.0-SNAPSHOT/itest-distribution-calculator-rmi-2.0-SNAPSHOT.jar
[INFO] ------------------------------------------------------------------------
[ERROR] BUILD ERROR
[INFO] ------------------------------------------------------------------------
[INFO] An Ant BuildException has occured: The following error occurred while executing this line:
http://hudson.zones.apache.org/hudson/job/Tuscany-2.x-JDK1.5/org.apache.tuscany.sca$itest-distribution-calculator-rmi/ws/build.xml :38:
The following error occurred while executing this line:
/export/home/hudson/hudson/jobs/Tuscany-2.x-JDK1.5/workspace/sca/distribution/all/target/apache-tuscany-sca-all-2.0-SNAPSHOT-dir/tuscany-sca-2.0-SNAPSHOT/samples/calculator-rmi-service/build.xml:56: Java returned: 1
The following error occurred while executing this line:
/export/home/hudson/hudson/jobs/Tuscany-2.x-JDK1.5/workspace/sca/distribution/all/target/apache-tuscany-sca-all-2.0-SNAPSHOT-dir/tuscany-sca-2.0-SNAPSHOT/samples/calculator-rmi-reference/build.xml:59: Java returned: 1
[INFO] ------------------------------------------------------------------------
[INFO] For more information, run Maven with the -e switch
[INFO] ------------------------------------------------------------------------
[INFO] Total time: 68 minutes 7 seconds
[INFO] Finished at: Sun Sep 13 01:35:15 UTC 2009
[INFO] Final Memory: 93M/741M
[INFO] ------------------------------------------------------------------------
Waiting for Hudson to finish collecting data
Build failed in Hudson: Tuscany-2.x-JDK1.5 » Apache Tuscany SCA iTest Distribution calculator-rmi #7
Posted by Apache Hudson Server <hu...@hudson.zones.apache.org>.
See http://hudson.zones.apache.org/hudson/job/Tuscany-2.x-JDK1.5/org.apache.tuscany.sca$itest-distribution-calculator-rmi/7/
------------------------------------------
[INFO] ------------------------------------------------------------------------
[INFO] Building Apache Tuscany SCA iTest Distribution calculator-rmi
[INFO] task-segment: [clean, install]
[INFO] ------------------------------------------------------------------------
[INFO] [clean:clean]
[INFO] Deleting directory http://hudson.zones.apache.org/hudson/job/Tuscany-2.x-JDK1.5/org.apache.tuscany.sca$itest-distribution-calculator-rmi/ws/target
[INFO] [resources:resources]
[INFO] Using default encoding to copy filtered resources.
[INFO] [compiler:compile]
[INFO] No sources to compile
[INFO] [resources:testResources]
[INFO] Using default encoding to copy filtered resources.
[INFO] [compiler:testCompile]
[INFO] No sources to compile
[INFO] [surefire:test]
[INFO] No tests to run.
[HUDSON] Recording test results
[INFO] [jar:jar]
[INFO] Building jar: http://hudson.zones.apache.org/hudson/job/Tuscany-2.x-JDK1.5/org.apache.tuscany.sca$itest-distribution-calculator-rmi/ws/target/itest-distribution-calculator-rmi-2.0-SNAPSHOT.jar
[INFO] [antrun:run {execution: run-samples}]
[INFO] Executing tasks
run:
init:
[mkdir] Created dir: /export/home/hudson/hudson/jobs/Tuscany-2.x-JDK1.5/workspace/sca/distribution/all/target/apache-tuscany-sca-all-2.0-SNAPSHOT-dir/tuscany-sca-2.0-SNAPSHOT/samples/calculator-rmi-service/target/classes
compile:
[javac] Compiling 12 source files to /export/home/hudson/hudson/jobs/Tuscany-2.x-JDK1.5/workspace/sca/distribution/all/target/apache-tuscany-sca-all-2.0-SNAPSHOT-dir/tuscany-sca-2.0-SNAPSHOT/samples/calculator-rmi-service/target/classes
[copy] Copying 2 files to /export/home/hudson/hudson/jobs/Tuscany-2.x-JDK1.5/workspace/sca/distribution/all/target/apache-tuscany-sca-all-2.0-SNAPSHOT-dir/tuscany-sca-2.0-SNAPSHOT/samples/calculator-rmi-service/target/classes
[jar] Building jar: /export/home/hudson/hudson/jobs/Tuscany-2.x-JDK1.5/workspace/sca/distribution/all/target/apache-tuscany-sca-all-2.0-SNAPSHOT-dir/tuscany-sca-2.0-SNAPSHOT/samples/calculator-rmi-service/target/sample-calculator-rmi-service.jar
run:
init:
[mkdir] Created dir: /export/home/hudson/hudson/jobs/Tuscany-2.x-JDK1.5/workspace/sca/distribution/all/target/apache-tuscany-sca-all-2.0-SNAPSHOT-dir/tuscany-sca-2.0-SNAPSHOT/samples/calculator-rmi-reference/target/classes
compile:
[javac] Compiling 7 source files to /export/home/hudson/hudson/jobs/Tuscany-2.x-JDK1.5/workspace/sca/distribution/all/target/apache-tuscany-sca-all-2.0-SNAPSHOT-dir/tuscany-sca-2.0-SNAPSHOT/samples/calculator-rmi-reference/target/classes
[copy] Copying 1 file to /export/home/hudson/hudson/jobs/Tuscany-2.x-JDK1.5/workspace/sca/distribution/all/target/apache-tuscany-sca-all-2.0-SNAPSHOT-dir/tuscany-sca-2.0-SNAPSHOT/samples/calculator-rmi-reference/target/classes
[jar] Building jar: /export/home/hudson/hudson/jobs/Tuscany-2.x-JDK1.5/workspace/sca/distribution/all/target/apache-tuscany-sca-all-2.0-SNAPSHOT-dir/tuscany-sca-2.0-SNAPSHOT/samples/calculator-rmi-reference/target/sample-calculator-rmi-reference.jar
run:
[java] Exception in thread "main" java.lang.ClassNotFoundException: org.apache.tuscany.sca.node.DomainNodeMain
[java] at java.net.URLClassLoader$1.run(URLClassLoader.java:200)
[java] at java.security.AccessController.doPrivileged(Native Method)
[java] at java.net.URLClassLoader.findClass(URLClassLoader.java:188)
[java] at java.lang.ClassLoader.loadClass(ClassLoader.java:306)
[java] at java.lang.ClassLoader.loadClass(ClassLoader.java:251)
[java] at java.lang.ClassLoader.loadClassInternal(ClassLoader.java:319)
[java] at java.lang.Class.forName0(Native Method)
[java] at java.lang.Class.forName(Class.java:242)
[java] at org.apache.tuscany.sca.launcher.LauncherMain.invokeMainMethod(LauncherMain.java:112)
[java] at org.apache.tuscany.sca.launcher.LauncherMain.main(LauncherMain.java:56)
[java] Sep 6, 2009 1:37:30 AM org.apache.tuscany.sca.node.impl.NodeImpl start
[java] INFO: Starting node: http://tuscany.apache.org/sca/1.1/nodes/default0 domain: tuscany.apache.org
[java] 2009-09-06 01:37:31.956::INFO: Logging to STDERR via org.mortbay.log.StdErrLog
[java] Sep 6, 2009 1:37:32 AM org.apache.tuscany.sca.endpoint.wrapper.EndpointRegistryWrapper start
[java] INFO: Using in-VM EndpointRegistry
[java] Sep 6, 2009 1:37:41 AM org.apache.tuscany.sca.node.impl.NodeFactoryImpl loadContributions
[java] INFO: Loading contribution: file:/zonestorage/hudson/home/hudson/hudson/jobs/Tuscany-2.x-JDK1.5/workspace/sca/distribution/all/target/apache-tuscany-sca-all-2.0-SNAPSHOT-dir/tuscany-sca-2.0-SNAPSHOT/samples/calculator-rmi-reference/target/sample-calculator-rmi-reference.jar
[java] Sep 6, 2009 1:37:42 AM org.apache.tuscany.sca.node.impl.NodeFactoryImpl configureNode
[java] INFO: Adding composite: {http://sample}Calculator to domain http://tuscany.apache.org/sca/1.1/domains/default
[java] Sep 6, 2009 1:37:42 AM org.apache.tuscany.sca.endpoint.impl.EndpointRegistryImpl addEndpoint
[java] INFO: Add endpoint - (@31662978)Endpoint: URI = CalculatorServiceComponent#service-binding(CalculatorService/CalculatorService)
[java] Exception in thread "main" java.lang.reflect.InvocationTargetException
[java] at sun.reflect.NativeMethodAccessorImpl.invoke0(Native Method)
[java] at sun.reflect.NativeMethodAccessorImpl.invoke(NativeMethodAccessorImpl.java:39)
[java] at sun.reflect.DelegatingMethodAccessorImpl.invoke(DelegatingMethodAccessorImpl.java:25)
[java] at java.lang.reflect.Method.invoke(Method.java:585)
[java] at org.apache.tuscany.sca.launcher.LauncherMain.invokeMainMethod(LauncherMain.java:115)
[java] at org.apache.tuscany.sca.launcher.LauncherMain.main(LauncherMain.java:56)
[java] Caused by: org.apache.tuscany.sca.host.rmi.RMIHostRuntimeException: Connection refused to host: localhost; nested exception is:
[java] java.net.ConnectException: Connection refused
[java] at sun.rmi.transport.tcp.TCPEndpoint.newSocket(TCPEndpoint.java:574)
[java] at sun.rmi.transport.tcp.TCPChannel.createConnection(TCPChannel.java:185)
[java] at sun.rmi.transport.tcp.TCPChannel.newConnection(TCPChannel.java:171)
[java] at sun.rmi.server.UnicastRef.newCall(UnicastRef.java:306)
[java] at sun.rmi.registry.RegistryImpl_Stub.lookup(Unknown Source)
[java] at org.apache.tuscany.sca.host.rmi.DefaultRMIHost.findService(DefaultRMIHost.java:116)
[java] at org.apache.tuscany.sca.host.rmi.ExtensibleRMIHost.findService(ExtensibleRMIHost.java:56)
[java] at org.apache.tuscany.sca.binding.rmi.provider.RMIBindingInvoker.invokeTarget(RMIBindingInvoker.java:81)
[java] at org.apache.tuscany.sca.binding.rmi.provider.RMIBindingInvoker.invoke(RMIBindingInvoker.java:54)
[java] at org.apache.tuscany.sca.core.invocation.impl.JDKInvocationHandler.invoke(JDKInvocationHandler.java:284)
[java] at org.apache.tuscany.sca.core.invocation.impl.JDKInvocationHandler.invoke(JDKInvocationHandler.java:149)
[java] at $Proxy7.add(Unknown Source)
[java] at calculator.CalculatorServiceImpl.add(CalculatorServiceImpl.java:54)
[java] at sun.reflect.NativeMethodAccessorImpl.invoke0(Native Method)
[java] at sun.reflect.NativeMethodAccessorImpl.invoke(NativeMethodAccessorImpl.java:39)
[java] at sun.reflect.DelegatingMethodAccessorImpl.invoke(DelegatingMethodAccessorImpl.java:25)
[java] at java.lang.reflect.Method.invoke(Method.java:585)
[java] at org.apache.tuscany.sca.implementation.java.invocation.JavaImplementationInvoker.invoke(JavaImplementationInvoker.java:136)
[java] at org.apache.tuscany.sca.core.databinding.wire.PassByValueInterceptor.invoke(PassByValueInterceptor.java:61)
[java] at org.apache.tuscany.sca.binding.sca.provider.SCABindingInvoker.invoke(SCABindingInvoker.java:61)
[java] at org.apache.tuscany.sca.core.databinding.wire.PassByValueInterceptor.invoke(PassByValueInterceptor.java:61)
[java] at org.apache.tuscany.sca.core.invocation.impl.JDKInvocationHandler.invoke(JDKInvocationHandler.java:284)
[java] at org.apache.tuscany.sca.core.invocation.impl.JDKInvocationHandler.invoke(JDKInvocationHandler.java:149)
[java] at $Proxy5.add(Unknown Source)
[java] at calculator.CalculatorClient.main(CalculatorClient.java:40)
[java] ... 6 more
[HUDSON] Archiving http://hudson.zones.apache.org/hudson/job/Tuscany-2.x-JDK1.5/org.apache.tuscany.sca$itest-distribution-calculator-rmi/ws/pom.xml to /export/home/hudson/hudson/jobs/Tuscany-2.x-JDK1.5/modules/org.apache.tuscany.sca$itest-distribution-calculator-rmi/builds/2009-09-06_00-26-41/archive/org.apache.tuscany.sca/itest-distribution-calculator-rmi/2.0-SNAPSHOT/pom.xml
[HUDSON] Archiving http://hudson.zones.apache.org/hudson/job/Tuscany-2.x-JDK1.5/org.apache.tuscany.sca$itest-distribution-calculator-rmi/ws/target/itest-distribution-calculator-rmi-2.0-SNAPSHOT.jar to /export/home/hudson/hudson/jobs/Tuscany-2.x-JDK1.5/modules/org.apache.tuscany.sca$itest-distribution-calculator-rmi/builds/2009-09-06_00-26-41/archive/org.apache.tuscany.sca/itest-distribution-calculator-rmi/2.0-SNAPSHOT/itest-distribution-calculator-rmi-2.0-SNAPSHOT.jar
[INFO] ------------------------------------------------------------------------
[ERROR] BUILD ERROR
[INFO] ------------------------------------------------------------------------
[INFO] An Ant BuildException has occured: The following error occurred while executing this line:
http://hudson.zones.apache.org/hudson/job/Tuscany-2.x-JDK1.5/org.apache.tuscany.sca$itest-distribution-calculator-rmi/ws/build.xml :38:
The following error occurred while executing this line:
/export/home/hudson/hudson/jobs/Tuscany-2.x-JDK1.5/workspace/sca/distribution/all/target/apache-tuscany-sca-all-2.0-SNAPSHOT-dir/tuscany-sca-2.0-SNAPSHOT/samples/calculator-rmi-service/build.xml:56: Java returned: 1
The following error occurred while executing this line:
/export/home/hudson/hudson/jobs/Tuscany-2.x-JDK1.5/workspace/sca/distribution/all/target/apache-tuscany-sca-all-2.0-SNAPSHOT-dir/tuscany-sca-2.0-SNAPSHOT/samples/calculator-rmi-reference/build.xml:59: Java returned: 1
[INFO] ------------------------------------------------------------------------
[INFO] For more information, run Maven with the -e switch
[INFO] ------------------------------------------------------------------------
[INFO] Total time: 71 minutes 4 seconds
[INFO] Finished at: Sun Sep 06 01:37:54 UTC 2009
[INFO] Final Memory: 93M/745M
[INFO] ------------------------------------------------------------------------
Waiting for Hudson to finish collecting data
Build failed in Hudson: Tuscany-2.x-JDK1.5 » Apache Tuscany SCA iTest Distribution calculator-rmi #6
Posted by Apache Hudson Server <hu...@hudson.zones.apache.org>.
See http://hudson.zones.apache.org/hudson/job/Tuscany-2.x-JDK1.5/org.apache.tuscany.sca$itest-distribution-calculator-rmi/6/
------------------------------------------
[INFO] ------------------------------------------------------------------------
[INFO] Building Apache Tuscany SCA iTest Distribution calculator-rmi
[INFO] task-segment: [clean, install]
[INFO] ------------------------------------------------------------------------
[INFO] [clean:clean]
[INFO] Deleting directory http://hudson.zones.apache.org/hudson/job/Tuscany-2.x-JDK1.5/org.apache.tuscany.sca$itest-distribution-calculator-rmi/ws/target
[INFO] [resources:resources]
[INFO] Using default encoding to copy filtered resources.
[INFO] [compiler:compile]
[INFO] No sources to compile
[INFO] [resources:testResources]
[INFO] Using default encoding to copy filtered resources.
[INFO] [compiler:testCompile]
[INFO] No sources to compile
[INFO] [surefire:test]
[INFO] No tests to run.
[HUDSON] Recording test results
[INFO] [jar:jar]
[INFO] Building jar: http://hudson.zones.apache.org/hudson/job/Tuscany-2.x-JDK1.5/org.apache.tuscany.sca$itest-distribution-calculator-rmi/ws/target/itest-distribution-calculator-rmi-2.0-SNAPSHOT.jar
[INFO] [antrun:run {execution: run-samples}]
[INFO] Executing tasks
run:
init:
[mkdir] Created dir: /export/home/hudson/hudson/jobs/Tuscany-2.x-JDK1.5/workspace/sca/distribution/all/target/apache-tuscany-sca-all-2.0-SNAPSHOT-dir/tuscany-sca-2.0-SNAPSHOT/samples/calculator-rmi-service/target/classes
compile:
[javac] Compiling 12 source files to /export/home/hudson/hudson/jobs/Tuscany-2.x-JDK1.5/workspace/sca/distribution/all/target/apache-tuscany-sca-all-2.0-SNAPSHOT-dir/tuscany-sca-2.0-SNAPSHOT/samples/calculator-rmi-service/target/classes
[copy] Copying 2 files to /export/home/hudson/hudson/jobs/Tuscany-2.x-JDK1.5/workspace/sca/distribution/all/target/apache-tuscany-sca-all-2.0-SNAPSHOT-dir/tuscany-sca-2.0-SNAPSHOT/samples/calculator-rmi-service/target/classes
[jar] Building jar: /export/home/hudson/hudson/jobs/Tuscany-2.x-JDK1.5/workspace/sca/distribution/all/target/apache-tuscany-sca-all-2.0-SNAPSHOT-dir/tuscany-sca-2.0-SNAPSHOT/samples/calculator-rmi-service/target/sample-calculator-rmi-service.jar
run:
init:
[mkdir] Created dir: /export/home/hudson/hudson/jobs/Tuscany-2.x-JDK1.5/workspace/sca/distribution/all/target/apache-tuscany-sca-all-2.0-SNAPSHOT-dir/tuscany-sca-2.0-SNAPSHOT/samples/calculator-rmi-reference/target/classes
compile:
[javac] Compiling 7 source files to /export/home/hudson/hudson/jobs/Tuscany-2.x-JDK1.5/workspace/sca/distribution/all/target/apache-tuscany-sca-all-2.0-SNAPSHOT-dir/tuscany-sca-2.0-SNAPSHOT/samples/calculator-rmi-reference/target/classes
[java] Aug 30, 2009 12:52:45 AM org.apache.tuscany.sca.node.impl.NodeImpl start
[java] INFO: Starting node: http://tuscany.apache.org/sca/1.1/nodes/default0 domain: defaultDoamin
[copy] Copying 1 file to /export/home/hudson/hudson/jobs/Tuscany-2.x-JDK1.5/workspace/sca/distribution/all/target/apache-tuscany-sca-all-2.0-SNAPSHOT-dir/tuscany-sca-2.0-SNAPSHOT/samples/calculator-rmi-reference/target/classes
[jar] Building jar: /export/home/hudson/hudson/jobs/Tuscany-2.x-JDK1.5/workspace/sca/distribution/all/target/apache-tuscany-sca-all-2.0-SNAPSHOT-dir/tuscany-sca-2.0-SNAPSHOT/samples/calculator-rmi-reference/target/sample-calculator-rmi-reference.jar
run:
[java] 2009-08-30 00:52:47.304::INFO: Logging to STDERR via org.mortbay.log.StdErrLog
[java] Aug 30, 2009 12:52:47 AM org.apache.tuscany.sca.endpoint.wrapper.EndpointRegistryWrapper start
[java] INFO: Using in-VM EndpointRegistry
[java] Aug 30, 2009 12:52:48 AM org.apache.tuscany.sca.node.impl.NodeImpl start
[java] INFO: Starting node: http://tuscany.apache.org/sca/1.1/nodes/default0 domain: tuscany.apache.org
[java] 2009-08-30 00:52:49.102::INFO: Logging to STDERR via org.mortbay.log.StdErrLog
[java] Aug 30, 2009 12:52:49 AM org.apache.tuscany.sca.endpoint.wrapper.EndpointRegistryWrapper start
[java] INFO: Using in-VM EndpointRegistry
[java] Aug 30, 2009 12:52:52 AM org.apache.tuscany.sca.node.impl.NodeFactoryImpl loadContributions
[java] INFO: Loading contribution: file:/zonestorage/hudson/home/hudson/hudson/jobs/Tuscany-2.x-JDK1.5/workspace/sca/distribution/all/target/apache-tuscany-sca-all-2.0-SNAPSHOT-dir/tuscany-sca-2.0-SNAPSHOT/samples/calculator-rmi-service/target/sample-calculator-rmi-service.jar
[java] Aug 30, 2009 12:52:52 AM org.apache.tuscany.sca.node.impl.NodeFactoryImpl loadContributions
[java] INFO: Loading contribution: file:/zonestorage/hudson/home/hudson/hudson/jobs/Tuscany-2.x-JDK1.5/workspace/sca/distribution/all/target/apache-tuscany-sca-all-2.0-SNAPSHOT-dir/tuscany-sca-2.0-SNAPSHOT/samples/calculator-rmi-reference/target/sample-calculator-rmi-reference.jar
[java] Aug 30, 2009 12:52:53 AM org.apache.tuscany.sca.node.impl.NodeFactoryImpl configureNode
[java] INFO: Adding composite: {http://sample}Calculator to domain
[java] Aug 30, 2009 12:52:53 AM org.apache.tuscany.sca.endpoint.impl.EndpointRegistryImpl addEndpoint
[java] INFO: Add endpoint - (@14672643)Endpoint: URI = CalculatorServiceComponent#service-binding(CalculatorService/CalculatorService)
[java] Aug 30, 2009 12:52:53 AM org.apache.tuscany.sca.endpoint.impl.EndpointRegistryImpl addEndpointReference
[java] INFO: Add endpoint reference - (@11595237)EndpointReference: URI = CalculatorServiceComponent#reference-binding(subtractService/subtractService) RESOLVED_BINDING Target = (@30568553)Endpoint:
[java] Aug 30, 2009 12:52:53 AM org.apache.tuscany.sca.endpoint.impl.EndpointRegistryImpl addEndpointReference
[java] INFO: Add endpoint reference - (@5427620)EndpointReference: URI = CalculatorServiceComponent#reference-binding(addService/addService) RESOLVED_BINDING Target = (@21067408)Endpoint:
[java] Aug 30, 2009 12:52:53 AM org.apache.tuscany.sca.endpoint.impl.EndpointRegistryImpl addEndpointReference
[java] INFO: Add endpoint reference - (@13563633)EndpointReference: URI = CalculatorServiceComponent#reference-binding(multiplyService/multiplyService) RESOLVED_BINDING Target = (@28730188)Endpoint:
[java] Aug 30, 2009 12:52:53 AM org.apache.tuscany.sca.endpoint.impl.EndpointRegistryImpl addEndpointReference
[java] INFO: Add endpoint reference - (@20010005)EndpointReference: URI = CalculatorServiceComponent#reference-binding(divideService/divideService) RESOLVED_BINDING Target = (@25640626)Endpoint:
[java] Aug 30, 2009 12:52:53 AM org.apache.tuscany.sca.endpoint.impl.EndpointRegistryImpl addEndpointReference
[java] INFO: Add endpoint reference - (@26798260)EndpointReference: URI = CalculatorServiceComponent#reference-binding($self$.CalculatorService/CalculatorService) WIRED_TARGET_FOUND_AND_MATCHED Target = (@14672643)Endpoint: URI = CalculatorServiceComponent#service-binding(CalculatorService/CalculatorService)
[java] Aug 30, 2009 12:52:53 AM org.apache.tuscany.sca.endpoint.impl.EndpointRegistryImpl findEndpoint
[java] INFO: Find endpoint for reference - (@26798260)EndpointReference: URI = CalculatorServiceComponent#reference-binding($self$.CalculatorService/CalculatorService) WIRED_TARGET_FOUND_AND_MATCHED Target = (@14672643)Endpoint: URI = CalculatorServiceComponent#service-binding(CalculatorService/CalculatorService)
[java] Aug 30, 2009 12:52:53 AM org.apache.tuscany.sca.endpoint.impl.EndpointRegistryImpl findEndpoint
[java] INFO: Found endpoint with matching service - (@14672643)Endpoint: URI = CalculatorServiceComponent#service-binding(CalculatorService/CalculatorService)
[java] Exception in thread "main" java.lang.reflect.InvocationTargetException
[java] at sun.reflect.NativeMethodAccessorImpl.invoke0(Native Method)
[java] at sun.reflect.NativeMethodAccessorImpl.invoke(NativeMethodAccessorImpl.java:39)
[java] at sun.reflect.DelegatingMethodAccessorImpl.invoke(DelegatingMethodAccessorImpl.java:25)
[java] at java.lang.reflect.Method.invoke(Method.java:585)
[java] at org.apache.tuscany.sca.launcher.LauncherMain.invokeMainMethod(LauncherMain.java:115)
[java] at org.apache.tuscany.sca.launcher.LauncherMain.main(LauncherMain.java:56)
[java] Caused by: org.apache.tuscany.sca.host.rmi.RMIHostRuntimeException: Connection refused to host: localhost; nested exception is:
[java] java.net.ConnectException: Connection refused
[java] at sun.rmi.transport.tcp.TCPEndpoint.newSocket(TCPEndpoint.java:574)
[java] at sun.rmi.transport.tcp.TCPChannel.createConnection(TCPChannel.java:185)
[java] at sun.rmi.transport.tcp.TCPChannel.newConnection(TCPChannel.java:171)
[java] at sun.rmi.server.UnicastRef.newCall(UnicastRef.java:306)
[java] at sun.rmi.registry.RegistryImpl_Stub.lookup(Unknown Source)
[java] at org.apache.tuscany.sca.host.rmi.DefaultRMIHost.findService(DefaultRMIHost.java:116)
[java] at org.apache.tuscany.sca.host.rmi.ExtensibleRMIHost.findService(ExtensibleRMIHost.java:56)
[java] at org.apache.tuscany.sca.binding.rmi.provider.RMIBindingInvoker.invokeTarget(RMIBindingInvoker.java:81)
[java] at org.apache.tuscany.sca.binding.rmi.provider.RMIBindingInvoker.invoke(RMIBindingInvoker.java:54)
[java] at org.apache.tuscany.sca.core.invocation.impl.JDKInvocationHandler.invoke(JDKInvocationHandler.java:284)
[java] at org.apache.tuscany.sca.core.invocation.impl.JDKInvocationHandler.invoke(JDKInvocationHandler.java:149)
[java] at $Proxy7.add(Unknown Source)
[java] at calculator.CalculatorServiceImpl.add(CalculatorServiceImpl.java:54)
[java] at sun.reflect.NativeMethodAccessorImpl.invoke0(Native Method)
[java] at sun.reflect.NativeMethodAccessorImpl.invoke(NativeMethodAccessorImpl.java:39)
[java] at sun.reflect.DelegatingMethodAccessorImpl.invoke(DelegatingMethodAccessorImpl.java:25)
[java] at java.lang.reflect.Method.invoke(Method.java:585)
[java] at org.apache.tuscany.sca.implementation.java.invocation.JavaImplementationInvoker.invoke(JavaImplementationInvoker.java:136)
[java] at org.apache.tuscany.sca.core.databinding.wire.PassByValueInterceptor.invoke(PassByValueInterceptor.java:61)
[java] at org.apache.tuscany.sca.binding.sca.provider.SCABindingInvoker.invoke(SCABindingInvoker.java:61)
[java] at org.apache.tuscany.sca.core.databinding.wire.PassByValueInterceptor.invoke(PassByValueInterceptor.java:61)
[java] at org.apache.tuscany.sca.core.invocation.impl.JDKInvocationHandler.invoke(JDKInvocationHandler.java:284)
[java] at org.apache.tuscany.sca.core.invocation.impl.JDKInvocationHandler.invoke(JDKInvocationHandler.java:149)
[java] at $Proxy5.add(Unknown Source)
[java] at calculator.CalculatorClient.main(CalculatorClient.java:40)
[java] ... 6 more
[java] Aug 30, 2009 12:52:54 AM org.apache.tuscany.sca.node.impl.NodeFactoryImpl configureNode
[java] INFO: Adding composite: {http://sample}Calculator to domain
[java] Aug 30, 2009 12:52:54 AM org.apache.tuscany.sca.host.rmi.DefaultRMIHost registerService
[java] INFO: RMI service registered: rmi://localhost:8099/CalculatorRMIService
[java] Aug 30, 2009 12:52:54 AM org.apache.tuscany.sca.endpoint.impl.EndpointRegistryImpl addEndpoint
[java] INFO: Add endpoint - (@15868406)Endpoint: URI = CalculatorServiceComponent#service-binding(CalculatorService/CalculatorService)
[java] Aug 30, 2009 12:52:54 AM org.apache.tuscany.sca.endpoint.impl.EndpointRegistryImpl addEndpointReference
[java] INFO: Add endpoint reference - (@9684209)EndpointReference: URI = CalculatorServiceComponent#reference(subtractService) WIRED_TARGET_FOUND_READY_FOR_MATCHING Target = (@23511316)Endpoint: URI = SubtractServiceComponent#service(SubtractServiceImpl) [Unresolved]
[java] Aug 30, 2009 12:52:54 AM org.apache.tuscany.sca.endpoint.impl.EndpointRegistryImpl addEndpointReference
[java] INFO: Add endpoint reference - (@25798515)EndpointReference: URI = CalculatorServiceComponent#reference(addService) WIRED_TARGET_FOUND_READY_FOR_MATCHING Target = (@5283320)Endpoint: URI = AddServiceComponent#service(AddServiceImpl) [Unresolved]
[java] Aug 30, 2009 12:52:54 AM org.apache.tuscany.sca.endpoint.impl.EndpointRegistryImpl addEndpointReference
[java] INFO: Add endpoint reference - (@11737724)EndpointReference: URI = CalculatorServiceComponent#reference(multiplyService) WIRED_TARGET_FOUND_READY_FOR_MATCHING Target = (@9423995)Endpoint: URI = MultiplyServiceComponent#service(MultiplyServiceImpl) [Unresolved]
[java] Aug 30, 2009 12:52:54 AM org.apache.tuscany.sca.endpoint.impl.EndpointRegistryImpl addEndpointReference
[java] INFO: Add endpoint reference - (@12170776)EndpointReference: URI = CalculatorServiceComponent#reference(divideService) WIRED_TARGET_FOUND_READY_FOR_MATCHING Target = (@6417481)Endpoint: URI = DivideServiceComponent#service(DivideServiceImpl) [Unresolved]
[java] Aug 30, 2009 12:52:54 AM org.apache.tuscany.sca.endpoint.impl.EndpointRegistryImpl addEndpoint
[java] INFO: Add endpoint - (@14664546)Endpoint: URI = AddServiceComponent#service-binding(AddServiceImpl/AddServiceImpl)
[java] Aug 30, 2009 12:52:54 AM org.apache.tuscany.sca.endpoint.impl.EndpointRegistryImpl addEndpoint
[java] INFO: Add endpoint - (@9732201)Endpoint: URI = SubtractServiceComponent#service-binding(SubtractServiceImpl/SubtractServiceImpl)
[java] Aug 30, 2009 12:52:54 AM org.apache.tuscany.sca.endpoint.impl.EndpointRegistryImpl addEndpoint
[java] INFO: Add endpoint - (@24803078)Endpoint: URI = MultiplyServiceComponent#service-binding(MultiplyServiceImpl/MultiplyServiceImpl)
[java] Aug 30, 2009 12:52:54 AM org.apache.tuscany.sca.endpoint.impl.EndpointRegistryImpl addEndpoint
[java] INFO: Add endpoint - (@18634171)Endpoint: URI = DivideServiceComponent#service-binding(DivideServiceImpl/DivideServiceImpl)
[java] Hit enter to stop node...
[HUDSON] Archiving http://hudson.zones.apache.org/hudson/job/Tuscany-2.x-JDK1.5/org.apache.tuscany.sca$itest-distribution-calculator-rmi/ws/pom.xml to /export/home/hudson/hudson/jobs/Tuscany-2.x-JDK1.5/modules/org.apache.tuscany.sca$itest-distribution-calculator-rmi/builds/2009-08-30_00-21-50/archive/org.apache.tuscany.sca/itest-distribution-calculator-rmi/2.0-SNAPSHOT/pom.xml
[HUDSON] Archiving http://hudson.zones.apache.org/hudson/job/Tuscany-2.x-JDK1.5/org.apache.tuscany.sca$itest-distribution-calculator-rmi/ws/target/itest-distribution-calculator-rmi-2.0-SNAPSHOT.jar to /export/home/hudson/hudson/jobs/Tuscany-2.x-JDK1.5/modules/org.apache.tuscany.sca$itest-distribution-calculator-rmi/builds/2009-08-30_00-21-50/archive/org.apache.tuscany.sca/itest-distribution-calculator-rmi/2.0-SNAPSHOT/itest-distribution-calculator-rmi-2.0-SNAPSHOT.jar
[INFO] ------------------------------------------------------------------------
[ERROR] BUILD ERROR
[INFO] ------------------------------------------------------------------------
[INFO] An Ant BuildException has occured: The following error occurred while executing this line:
http://hudson.zones.apache.org/hudson/job/Tuscany-2.x-JDK1.5/org.apache.tuscany.sca$itest-distribution-calculator-rmi/ws/build.xml :44: The following error occurred while executing this line:
/export/home/hudson/hudson/jobs/Tuscany-2.x-JDK1.5/workspace/sca/distribution/all/target/apache-tuscany-sca-all-2.0-SNAPSHOT-dir/tuscany-sca-2.0-SNAPSHOT/samples/calculator-rmi-reference/build.xml:59: Java returned: 1
[INFO] ------------------------------------------------------------------------
[INFO] For more information, run Maven with the -e switch
[INFO] ------------------------------------------------------------------------
[INFO] Total time: 31 minutes 6 seconds
[INFO] Finished at: Sun Aug 30 00:53:01 UTC 2009
[INFO] Final Memory: 104M/746M
[INFO] ------------------------------------------------------------------------
Waiting for Hudson to finish collecting data