You are viewing a plain text version of this content. The canonical link for it is here.
Posted to dev@mina.apache.org by "Guillaume Nodet (JIRA)" <ji...@apache.org> on 2011/09/08 13:09:08 UTC
[jira] [Created] (SSHD-144) ScpTest sometimes fail
ScpTest sometimes fail
----------------------
Key: SSHD-144
URL: https://issues.apache.org/jira/browse/SSHD-144
Project: MINA SSHD
Issue Type: Bug
Reporter: Guillaume Nodet
-------------------------------------------------------------------------------
Test set: org.apache.sshd.SftpTest
-------------------------------------------------------------------------------
Tests run: 3, Failures: 1, Errors: 0, Skipped: 1, Time elapsed: 0.352 sec
<<< FAILURE!
testReadWriteWithOffset(org.apache.sshd.SftpTest) Time elapsed: 0.124 sec
<<< FAILURE!
java.lang.AssertionError:
at org.junit.Assert.fail(Assert.java:74)
at org.junit.Assert.assertTrue(Assert.java:37)
at org.junit.Assert.assertTrue(Assert.java:46)
at org.apache.sshd.SftpTest.testReadWriteWithOffset(SftpTest.java:158)
Running on Win 7, Java 6, Maven 2.2.1
--
This message is automatically generated by JIRA.
For more information on JIRA, see: http://www.atlassian.com/software/jira
[jira] [Updated] (SSHD-144) ScpTest sometimes fail
Posted by "Guillaume Nodet (JIRA)" <ji...@apache.org>.
[ https://issues.apache.org/jira/browse/SSHD-144?page=com.atlassian.jira.plugin.system.issuetabpanels:all-tabpanel ]
Guillaume Nodet updated SSHD-144:
---------------------------------
Priority: Minor (was: Major)
> ScpTest sometimes fail
> ----------------------
>
> Key: SSHD-144
> URL: https://issues.apache.org/jira/browse/SSHD-144
> Project: MINA SSHD
> Issue Type: Bug
> Reporter: Guillaume Nodet
> Priority: Minor
>
> -------------------------------------------------------------------------------
> Test set: org.apache.sshd.SftpTest
> -------------------------------------------------------------------------------
> Tests run: 3, Failures: 1, Errors: 0, Skipped: 1, Time elapsed: 0.352 sec
> <<< FAILURE!
> testReadWriteWithOffset(org.apache.sshd.SftpTest) Time elapsed: 0.124 sec
> <<< FAILURE!
> java.lang.AssertionError:
> at org.junit.Assert.fail(Assert.java:74)
> at org.junit.Assert.assertTrue(Assert.java:37)
> at org.junit.Assert.assertTrue(Assert.java:46)
> at org.apache.sshd.SftpTest.testReadWriteWithOffset(SftpTest.java:158)
> Running on Win 7, Java 6, Maven 2.2.1
--
This message is automatically generated by JIRA.
If you think it was sent incorrectly, please contact your JIRA administrators: https://issues.apache.org/jira/secure/ContactAdministrators!default.jspa
For more information on JIRA, see: http://www.atlassian.com/software/jira