You are viewing a plain text version of this content. The canonical link for it is here.
Posted to dev@zookeeper.apache.org by Apache Jenkins Server <je...@builds.apache.org> on 2017/02/19 10:13:34 UTC

ZooKeeper_branch35_openjdk7 - Build # 424 - Still Failing

See https://builds.apache.org/job/ZooKeeper_branch35_openjdk7/424/

###################################################################################
########################## LAST 60 LINES OF THE CONSOLE ###########################
[...truncated 61.71 MB...]
    [junit] 	at org.apache.zookeeper.ClientCnxnSocketNIO.doTransport(ClientCnxnSocketNIO.java:357)
    [junit] 	at org.apache.zookeeper.ClientCnxn$SendThread.run(ClientCnxn.java:1214)
    [junit] 2017-02-19 10:13:11,002 [myid:127.0.0.1:11222] - INFO  [main-SendThread(127.0.0.1:11222):ClientCnxn$SendThread@1113] - Opening socket connection to server 127.0.0.1/127.0.0.1:11222. Will not attempt to authenticate using SASL (unknown error)
    [junit] 2017-02-19 10:13:11,002 [myid:127.0.0.1:11222] - WARN  [main-SendThread(127.0.0.1:11222):ClientCnxn$SendThread@1235] - Session 0x215f990fd0000 for server 127.0.0.1/127.0.0.1:11222, unexpected error, closing socket connection and attempting reconnect
    [junit] java.net.ConnectException: Connection refused
    [junit] 	at sun.nio.ch.SocketChannelImpl.checkConnect(Native Method)
    [junit] 	at sun.nio.ch.SocketChannelImpl.finishConnect(SocketChannelImpl.java:739)
    [junit] 	at org.apache.zookeeper.ClientCnxnSocketNIO.doTransport(ClientCnxnSocketNIO.java:357)
    [junit] 	at org.apache.zookeeper.ClientCnxn$SendThread.run(ClientCnxn.java:1214)
    [junit] 2017-02-19 10:13:11,104 [myid:127.0.0.1:11222] - INFO  [main-SendThread(127.0.0.1:11222):ClientCnxn$SendThread@1113] - Opening socket connection to server 127.0.0.1/127.0.0.1:11222. Will not attempt to authenticate using SASL (unknown error)
    [junit] 2017-02-19 10:13:11,105 [myid:127.0.0.1:11222] - WARN  [main-SendThread(127.0.0.1:11222):ClientCnxn$SendThread@1235] - Session 0x215f990fd0001 for server 127.0.0.1/127.0.0.1:11222, unexpected error, closing socket connection and attempting reconnect
    [junit] java.net.ConnectException: Connection refused
    [junit] 	at sun.nio.ch.SocketChannelImpl.checkConnect(Native Method)
    [junit] 	at sun.nio.ch.SocketChannelImpl.finishConnect(SocketChannelImpl.java:739)
    [junit] 	at org.apache.zookeeper.ClientCnxnSocketNIO.doTransport(ClientCnxnSocketNIO.java:357)
    [junit] 	at org.apache.zookeeper.ClientCnxn$SendThread.run(ClientCnxn.java:1214)
    [junit] 2017-02-19 10:13:12,708 [myid:127.0.0.1:11222] - INFO  [main-SendThread(127.0.0.1:11222):ClientCnxn$SendThread@1113] - Opening socket connection to server 127.0.0.1/127.0.0.1:11222. Will not attempt to authenticate using SASL (unknown error)
    [junit] 2017-02-19 10:13:12,709 [myid:127.0.0.1:11222] - WARN  [main-SendThread(127.0.0.1:11222):ClientCnxn$SendThread@1235] - Session 0x215f990fd0001 for server 127.0.0.1/127.0.0.1:11222, unexpected error, closing socket connection and attempting reconnect
    [junit] java.net.ConnectException: Connection refused
    [junit] 	at sun.nio.ch.SocketChannelImpl.checkConnect(Native Method)
    [junit] 	at sun.nio.ch.SocketChannelImpl.finishConnect(SocketChannelImpl.java:739)
    [junit] 	at org.apache.zookeeper.ClientCnxnSocketNIO.doTransport(ClientCnxnSocketNIO.java:357)
    [junit] 	at org.apache.zookeeper.ClientCnxn$SendThread.run(ClientCnxn.java:1214)
    [junit] 2017-02-19 10:13:12,777 [myid:127.0.0.1:11222] - INFO  [main-SendThread(127.0.0.1:11222):ClientCnxn$SendThread@1113] - Opening socket connection to server 127.0.0.1/127.0.0.1:11222. Will not attempt to authenticate using SASL (unknown error)
    [junit] 2017-02-19 10:13:12,777 [myid:127.0.0.1:11222] - WARN  [main-SendThread(127.0.0.1:11222):ClientCnxn$SendThread@1235] - Session 0x215f990fd0000 for server 127.0.0.1/127.0.0.1:11222, unexpected error, closing socket connection and attempting reconnect
    [junit] java.net.ConnectException: Connection refused
    [junit] 	at sun.nio.ch.SocketChannelImpl.checkConnect(Native Method)
    [junit] 	at sun.nio.ch.SocketChannelImpl.finishConnect(SocketChannelImpl.java:739)
    [junit] 	at org.apache.zookeeper.ClientCnxnSocketNIO.doTransport(ClientCnxnSocketNIO.java:357)
    [junit] 	at org.apache.zookeeper.ClientCnxn$SendThread.run(ClientCnxn.java:1214)
    [junit] 2017-02-19 10:13:13,924 [myid:127.0.0.1:11222] - INFO  [main-SendThread(127.0.0.1:11222):ClientCnxn$SendThread@1113] - Opening socket connection to server 127.0.0.1/127.0.0.1:11222. Will not attempt to authenticate using SASL (unknown error)
    [junit] 2017-02-19 10:13:13,925 [myid:127.0.0.1:11222] - WARN  [main-SendThread(127.0.0.1:11222):ClientCnxn$SendThread@1235] - Session 0x215f990fd0000 for server 127.0.0.1/127.0.0.1:11222, unexpected error, closing socket connection and attempting reconnect
    [junit] java.net.ConnectException: Connection refused
    [junit] 	at sun.nio.ch.SocketChannelImpl.checkConnect(Native Method)
    [junit] 	at sun.nio.ch.SocketChannelImpl.finishConnect(SocketChannelImpl.java:739)
    [junit] 	at org.apache.zookeeper.ClientCnxnSocketNIO.doTransport(ClientCnxnSocketNIO.java:357)
    [junit] 	at org.apache.zookeeper.ClientCnxn$SendThread.run(ClientCnxn.java:1214)
    [junit] 2017-02-19 10:13:14,094 [myid:127.0.0.1:11222] - INFO  [main-SendThread(127.0.0.1:11222):ClientCnxn$SendThread@1113] - Opening socket connection to server 127.0.0.1/127.0.0.1:11222. Will not attempt to authenticate using SASL (unknown error)
    [junit] 2017-02-19 10:13:14,095 [myid:127.0.0.1:11222] - WARN  [main-SendThread(127.0.0.1:11222):ClientCnxn$SendThread@1235] - Session 0x215f990fd0001 for server 127.0.0.1/127.0.0.1:11222, unexpected error, closing socket connection and attempting reconnect
    [junit] java.net.ConnectException: Connection refused
    [junit] 	at sun.nio.ch.SocketChannelImpl.checkConnect(Native Method)
    [junit] 	at sun.nio.ch.SocketChannelImpl.finishConnect(SocketChannelImpl.java:739)
    [junit] 	at org.apache.zookeeper.ClientCnxnSocketNIO.doTransport(ClientCnxnSocketNIO.java:357)
    [junit] 	at org.apache.zookeeper.ClientCnxn$SendThread.run(ClientCnxn.java:1214)
    [junit] Running org.apache.zookeeper.server.quorum.StandaloneDisabledTest in thread 1
    [junit] Tests run: 1, Failures: 0, Errors: 1, Skipped: 0, Time elapsed: 0 sec, Thread: 1, Class: org.apache.zookeeper.server.quorum.StandaloneDisabledTest
    [junit] Test org.apache.zookeeper.server.quorum.StandaloneDisabledTest FAILED (timeout)

fail.build.on.test.failure:

BUILD FAILED
/home/jenkins/jenkins-slave/workspace/ZooKeeper_branch35_openjdk7/build.xml:1211: The following error occurred while executing this line:
/home/jenkins/jenkins-slave/workspace/ZooKeeper_branch35_openjdk7/build.xml:1215: Tests failed!

Total time: 16 minutes 32 seconds
Build step 'Invoke Ant' marked build as failure
Recording test results
Email was triggered for: Failure - Any
Sending email for trigger: Failure - Any



###################################################################################
############################## FAILED TESTS (if any) ##############################
1 tests failed.
FAILED:  org.apache.zookeeper.server.quorum.StandaloneDisabledTest.startSingleServerTest

Error Message:
Timeout occurred. Please note the time in the report does not reflect the time until the timeout.

Stack Trace:
junit.framework.AssertionFailedError: Timeout occurred. Please note the time in the report does not reflect the time until the timeout.
	at java.lang.Thread.run(Thread.java:745)



ZooKeeper_branch35_openjdk7 - Build # 426 - Still Failing

Posted by Apache Jenkins Server <je...@builds.apache.org>.
See https://builds.apache.org/job/ZooKeeper_branch35_openjdk7/426/

###################################################################################
########################## LAST 60 LINES OF THE CONSOLE ###########################
[...truncated 233.88 KB...]
    [junit] 2017-02-21 09:57:10,495 [myid:] - INFO  [main:ZKTestCase$1@65] - SUCCEEDED testCreateSequentialCommandWithoutPath
    [junit] 2017-02-21 09:57:10,495 [myid:] - INFO  [main:ZKTestCase$1@60] - FINISHED testCreateSequentialCommandWithoutPath
    [junit] 2017-02-21 09:57:10,496 [myid:] - INFO  [main:PortAssignment@85] - Assigned port 21998 from range 21993 - 24685.
    [junit] 2017-02-21 09:57:10,496 [myid:] - INFO  [main:ZKTestCase$1@55] - STARTING testCreateNodeWithoutData
    [junit] 2017-02-21 09:57:10,496 [myid:] - INFO  [main:ClientBase@448] - Initial fdcount is: 50
    [junit] 2017-02-21 09:57:10,506 [myid:] - INFO  [main:ClientBase@466] - STARTING server
    [junit] 2017-02-21 09:57:10,506 [myid:] - INFO  [main:ClientBase@386] - CREATING server instance 127.0.0.1:21998
    [junit] 2017-02-21 09:57:10,506 [myid:] - INFO  [main:NIOServerCnxnFactory@673] - Configuring NIO connection handler with 10s sessionless connection timeout, 1 selector thread(s), 8 worker threads, and 64 kB direct buffers.
    [junit] 2017-02-21 09:57:10,506 [myid:] - INFO  [main:NIOServerCnxnFactory@686] - binding to port 0.0.0.0/0.0.0.0:21998
    [junit] 2017-02-21 09:57:10,507 [myid:] - INFO  [main:ClientBase@361] - STARTING server instance 127.0.0.1:21998
    [junit] 2017-02-21 09:57:10,507 [myid:] - INFO  [main:ZooKeeperServer@907] - minSessionTimeout set to 6000
    [junit] 2017-02-21 09:57:10,507 [myid:] - INFO  [main:ZooKeeperServer@916] - maxSessionTimeout set to 60000
    [junit] 2017-02-21 09:57:10,507 [myid:] - INFO  [main:ZooKeeperServer@159] - Created server with tickTime 3000 minSessionTimeout 6000 maxSessionTimeout 60000 datadir /home/jenkins/jenkins-slave/workspace/ZooKeeper_branch35_openjdk7/build/test/tmp/test9086588243072711581.junit.dir/version-2 snapdir /home/jenkins/jenkins-slave/workspace/ZooKeeper_branch35_openjdk7/build/test/tmp/test9086588243072711581.junit.dir/version-2
    [junit] 2017-02-21 09:57:10,508 [myid:] - INFO  [main:FileTxnSnapLog@320] - Snapshotting: 0x0 to /home/jenkins/jenkins-slave/workspace/ZooKeeper_branch35_openjdk7/build/test/tmp/test9086588243072711581.junit.dir/version-2/snapshot.0
    [junit] 2017-02-21 09:57:10,508 [myid:] - INFO  [main:FileTxnSnapLog@320] - Snapshotting: 0x0 to /home/jenkins/jenkins-slave/workspace/ZooKeeper_branch35_openjdk7/build/test/tmp/test9086588243072711581.junit.dir/version-2/snapshot.0
    [junit] 2017-02-21 09:57:10,510 [myid:] - ERROR [main:ZooKeeperServer@505] - ZKShutdownHandler is not registered, so ZooKeeper server won't take any action on ERROR or SHUTDOWN server state changes
    [junit] 2017-02-21 09:57:10,510 [myid:] - INFO  [main:FourLetterWordMain@85] - connecting to 127.0.0.1 21998
    [junit] 2017-02-21 09:57:10,510 [myid:] - INFO  [NIOServerCxnFactory.AcceptThread:0.0.0.0/0.0.0.0:21998:NIOServerCnxnFactory$AcceptThread@296] - Accepted socket connection from /127.0.0.1:53051
    [junit] 2017-02-21 09:57:10,505 [myid:] - INFO  [main:PortAssignment@151] - Test process 6/8 using ports from 24686 - 27378.
    [junit] create [-s] [-e] [-c] path [data] [acl]
    [junit] 2017-02-21 09:57:10,542 [myid:] - INFO  [main:PortAssignment@151] - Test process 2/8 using ports from 13914 - 16606.
    [junit] 2017-02-21 09:57:10,563 [myid:] - INFO  [main:PortAssignment@85] - Assigned port 13915 from range 13914 - 16606.
    [junit] 2017-02-21 09:57:10,537 [myid:] - INFO  [NIOWorkerThread-1:NIOServerCnxn@485] - Processing stat command from /127.0.0.1:53051
    [junit] 2017-02-21 09:57:10,537 [myid:] - INFO  [NIOWorkerThread-1:StatCommand@49] - Stat command output
    [junit] 2017-02-21 09:57:10,538 [myid:] - INFO  [NIOWorkerThread-1:NIOServerCnxn@614] - Closed socket connection for client /127.0.0.1:53051 (no session established for client)
    [junit] 2017-02-21 09:57:10,538 [myid:] - INFO  [main:JMXEnv@228] - ensureParent:[InMemoryDataTree, StandaloneServer_port]
    [junit] 2017-02-21 09:57:10,540 [myid:] - INFO  [main:JMXEnv@245] - expect:InMemoryDataTree
    [junit] 2017-02-21 09:57:10,541 [myid:] - INFO  [main:JMXEnv@249] - found:InMemoryDataTree org.apache.ZooKeeperService:name0=StandaloneServer_port21998,name1=InMemoryDataTree
    [junit] 2017-02-21 09:57:10,541 [myid:] - INFO  [main:JMXEnv@245] - expect:StandaloneServer_port
    [junit] 2017-02-21 09:57:10,541 [myid:] - INFO  [main:JMXEnv@249] - found:StandaloneServer_port org.apache.ZooKeeperService:name0=StandaloneServer_port21998
    [junit] 2017-02-21 09:57:10,541 [myid:] - INFO  [main:ClientBase@462] - Client test setup finished
    [junit] 2017-02-21 09:57:10,541 [myid:] - INFO  [main:JUnit4ZKTestRunner$LoggedInvokeMethod@77] - RUNNING TEST METHOD testCreateNodeWithoutData
    [junit] 2017-02-21 09:57:10,542 [myid:] - INFO  [main:ZooKeeper@863] - Initiating client connection, connectString=127.0.0.1:21998 sessionTimeout=30000 watcher=org.apache.zookeeper.test.ClientBase$CountdownWatcher@7de04525
    [junit] 2017-02-21 09:57:10,542 [myid:] - INFO  [main:ClientCnxnSocket@236] - jute.maxbuffer value is 4194304 Bytes
    [junit] 2017-02-21 09:57:10,543 [myid:127.0.0.1:21998] - INFO  [main-SendThread(127.0.0.1:21998):ClientCnxn$SendThread@1113] - Opening socket connection to server 127.0.0.1/127.0.0.1:21998. Will not attempt to authenticate using SASL (unknown error)
    [junit] 2017-02-21 09:57:10,543 [myid:127.0.0.1:21998] - INFO  [main-SendThread(127.0.0.1:21998):ClientCnxn$SendThread@948] - Socket connection established, initiating session, client: /127.0.0.1:53052, server: 127.0.0.1/127.0.0.1:21998
    [junit] 2017-02-21 09:57:10,543 [myid:] - INFO  [NIOServerCxnFactory.AcceptThread:0.0.0.0/0.0.0.0:21998:NIOServerCnxnFactory$AcceptThread@296] - Accepted socket connection from /127.0.0.1:53052
    [junit] 2017-02-21 09:57:10,545 [myid:] - INFO  [NIOWorkerThread-2:ZooKeeperServer@1013] - Client attempting to establish new session at /127.0.0.1:53052
    [junit] 2017-02-21 09:57:10,566 [myid:] - INFO  [SyncThread:0:FileTxnLog@204] - Creating new log file: log.1
    [junit] 2017-02-21 09:57:10,580 [myid:] - INFO  [SyncThread:0:ZooKeeperServer@727] - Established session 0x1022045432c0000 with negotiated timeout 30000 for client /127.0.0.1:53052
    [junit] 2017-02-21 09:57:10,581 [myid:127.0.0.1:21998] - INFO  [main-SendThread(127.0.0.1:21998):ClientCnxn$SendThread@1381] - Session establishment complete on server 127.0.0.1/127.0.0.1:21998, sessionid = 0x1022045432c0000, negotiated timeout = 30000
    [junit] 2017-02-21 09:57:10,585 [myid:] - INFO  [main:JMXEnv@117] - expect:0x1022045432c0000
    [junit] 2017-02-21 09:57:10,585 [myid:] - INFO  [main:JMXEnv@120] - found:0x1022045432c0000 org.apache.ZooKeeperService:name0=StandaloneServer_port21998,name1=Connections,name2=127.0.0.1,name3=0x1022045432c0000
    [junit] Created /node0000000000
    [junit] Created /node
    [junit] Created /node0000000002
    [junit] 2017-02-21 09:57:10,546 [myid:] - INFO  [main:PortAssignment@85] - Assigned port 24687 from range 24686 - 27378.
    [junit] 2017-02-21 09:57:10,564 [myid:] - INFO  [main:ZKTestCase$1@55] - STARTING testElapsedTimeToDate
    [junit] 2017-02-21 09:57:10,609 [myid:] - INFO  [main:ClientBase@448] - Initial fdcount is: 39
Java HotSpot(TM) 64-Bit Server VM warning: INFO: os::commit_memory(0x00000007bff00000, 252706816, 0) failed; error='Cannot allocate memory' (errno=12)
#
# There is insufficient memory for the Java Runtime Environment to continue.
# Native memory allocation (malloc) failed to allocate 252706816 bytes for committing reserved memory.
# An error report file with more information is saved as:
# /home/jenkins/jenkins-slave/workspace/ZooKeeper_branch35_openjdk7/hs_err_pid12637.log
Build step 'Invoke Ant' marked build as failure
Recording test results
Email was triggered for: Failure - Any
Sending email for trigger: Failure - Any



###################################################################################
############################## FAILED TESTS (if any) ##############################
1 tests failed.
FAILED:  TEST-org.apache.zookeeper.RemoveWatchesCmdTest.xml.[failed-to-read]

Error Message:


Stack Trace:
Failed to read test report file /home/jenkins/jenkins-slave/workspace/ZooKeeper_branch35_openjdk7/build/test/logs/TEST-org.apache.zookeeper.RemoveWatchesCmdTest.xml
org.dom4j.DocumentException: Error on line 51 of document file:///home/jenkins/jenkins-slave/workspace/ZooKeeper_branch35_openjdk7/build/test/logs/TEST-org.apache.zookeeper.RemoveWatchesCmdTest.xml : XML document structures must start and end within the same entity. Nested exception: XML document structures must start and end within the same entity.
	at org.dom4j.io.SAXReader.read(SAXReader.java:482)
	at org.dom4j.io.SAXReader.read(SAXReader.java:264)
	at hudson.tasks.junit.SuiteResult.parse(SuiteResult.java:126)
	at hudson.tasks.junit.TestResult.parse(TestResult.java:302)
	at hudson.tasks.junit.TestResult.parsePossiblyEmpty(TestResult.java:244)
	at hudson.tasks.junit.TestResult.parse(TestResult.java:175)
	at hudson.tasks.junit.TestResult.parse(TestResult.java:154)
	at hudson.tasks.junit.TestResult.<init>(TestResult.java:126)
	at hudson.tasks.junit.JUnitParser$ParseResultCallable.invoke(JUnitParser.java:132)
	at hudson.tasks.junit.JUnitParser$ParseResultCallable.invoke(JUnitParser.java:107)
	at hudson.FilePath$FileCallableWrapper.call(FilePath.java:2731)
	at hudson.remoting.UserRequest.perform(UserRequest.java:153)
	at hudson.remoting.UserRequest.perform(UserRequest.java:50)
	at hudson.remoting.Request$2.run(Request.java:336)
	at hudson.remoting.InterceptingExecutorService$1.call(InterceptingExecutorService.java:68)
	at java.util.concurrent.FutureTask.run(FutureTask.java:262)
	at java.util.concurrent.ThreadPoolExecutor.runWorker(ThreadPoolExecutor.java:1145)
	at java.util.concurrent.ThreadPoolExecutor$Worker.run(ThreadPoolExecutor.java:615)
	at java.lang.Thread.run(Thread.java:745)
Caused by: org.xml.sax.SAXParseException; systemId: file:///home/jenkins/jenkins-slave/workspace/ZooKeeper_branch35_openjdk7/build/test/logs/TEST-org.apache.zookeeper.RemoveWatchesCmdTest.xml; lineNumber: 51; columnNumber: 1; XML document structures must start and end within the same entity.
	at com.sun.org.apache.xerces.internal.util.ErrorHandlerWrapper.createSAXParseException(ErrorHandlerWrapper.java:198)
	at com.sun.org.apache.xerces.internal.util.ErrorHandlerWrapper.fatalError(ErrorHandlerWrapper.java:177)
	at com.sun.org.apache.xerces.internal.impl.XMLErrorReporter.reportError(XMLErrorReporter.java:441)
	at com.sun.org.apache.xerces.internal.impl.XMLErrorReporter.reportError(XMLErrorReporter.java:368)
	at com.sun.org.apache.xerces.internal.impl.XMLScanner.reportFatalError(XMLScanner.java:1436)
	at com.sun.org.apache.xerces.internal.impl.XMLDocumentFragmentScannerImpl.endEntity(XMLDocumentFragmentScannerImpl.java:903)
	at com.sun.org.apache.xerces.internal.impl.XMLDocumentScannerImpl.endEntity(XMLDocumentScannerImpl.java:563)
	at com.sun.org.apache.xerces.internal.impl.XMLEntityManager.endEntity(XMLEntityManager.java:1384)
	at com.sun.org.apache.xerces.internal.impl.XMLEntityScanner.load(XMLEntityScanner.java:1774)
	at com.sun.org.apache.xerces.internal.impl.XMLEntityScanner.skipChar(XMLEntityScanner.java:1426)
	at com.sun.org.apache.xerces.internal.impl.XMLDocumentFragmentScannerImpl$FragmentContentDriver.next(XMLDocumentFragmentScannerImpl.java:2807)
	at com.sun.org.apache.xerces.internal.impl.XMLDocumentScannerImpl.next(XMLDocumentScannerImpl.java:606)
	at com.sun.org.apache.xerces.internal.impl.XMLNSDocumentScannerImpl.next(XMLNSDocumentScannerImpl.java:117)
	at com.sun.org.apache.xerces.internal.impl.XMLDocumentFragmentScannerImpl.scanDocument(XMLDocumentFragmentScannerImpl.java:510)
	at com.sun.org.apache.xerces.internal.parsers.XML11Configuration.parse(XML11Configuration.java:848)
	at com.sun.org.apache.xerces.internal.parsers.XML11Configuration.parse(XML11Configuration.java:777)
	at com.sun.org.apache.xerces.internal.parsers.XMLParser.parse(XMLParser.java:141)
	at com.sun.org.apache.xerces.internal.parsers.AbstractSAXParser.parse(AbstractSAXParser.java:1213)
	at com.sun.org.apache.xerces.internal.jaxp.SAXParserImpl$JAXPSAXParser.parse(SAXParserImpl.java:649)
	at org.dom4j.io.SAXReader.read(SAXReader.java:465)
	... 18 more
Nested exception: 
org.xml.sax.SAXParseException; systemId: file:///home/jenkins/jenkins-slave/workspace/ZooKeeper_branch35_openjdk7/build/test/logs/TEST-org.apache.zookeeper.RemoveWatchesCmdTest.xml; lineNumber: 51; columnNumber: 1; XML document structures must start and end within the same entity.
	at com.sun.org.apache.xerces.internal.util.ErrorHandlerWrapper.createSAXParseException(ErrorHandlerWrapper.java:198)
	at com.sun.org.apache.xerces.internal.util.ErrorHandlerWrapper.fatalError(ErrorHandlerWrapper.java:177)
	at com.sun.org.apache.xerces.internal.impl.XMLErrorReporter.reportError(XMLErrorReporter.java:441)
	at com.sun.org.apache.xerces.internal.impl.XMLErrorReporter.reportError(XMLErrorReporter.java:368)
	at com.sun.org.apache.xerces.internal.impl.XMLScanner.reportFatalError(XMLScanner.java:1436)
	at com.sun.org.apache.xerces.internal.impl.XMLDocumentFragmentScannerImpl.endEntity(XMLDocumentFragmentScannerImpl.java:903)
	at com.sun.org.apache.xerces.internal.impl.XMLDocumentScannerImpl.endEntity(XMLDocumentScannerImpl.java:563)
	at com.sun.org.apache.xerces.internal.impl.XMLEntityManager.endEntity(XMLEntityManager.java:1384)
	at com.sun.org.apache.xerces.internal.impl.XMLEntityScanner.load(XMLEntityScanner.java:1774)
	at com.sun.org.apache.xerces.internal.impl.XMLEntityScanner.skipChar(XMLEntityScanner.java:1426)
	at com.sun.org.apache.xerces.internal.impl.XMLDocumentFragmentScannerImpl$FragmentContentDriver.next(XMLDocumentFragmentScannerImpl.java:2807)
	at com.sun.org.apache.xerces.internal.impl.XMLDocumentScannerImpl.next(XMLDocumentScannerImpl.java:606)
	at com.sun.org.apache.xerces.internal.impl.XMLNSDocumentScannerImpl.next(XMLNSDocumentScannerImpl.java:117)
	at com.sun.org.apache.xerces.internal.impl.XMLDocumentFragmentScannerImpl.scanDocument(XMLDocumentFragmentScannerImpl.java:510)
	at com.sun.org.apache.xerces.internal.parsers.XML11Configuration.parse(XML11Configuration.java:848)
	at com.sun.org.apache.xerces.internal.parsers.XML11Configuration.parse(XML11Configuration.java:777)
	at com.sun.org.apache.xerces.internal.parsers.XMLParser.parse(XMLParser.java:141)
	at com.sun.org.apache.xerces.internal.parsers.AbstractSAXParser.parse(AbstractSAXParser.java:1213)
	at com.sun.org.apache.xerces.internal.jaxp.SAXParserImpl$JAXPSAXParser.parse(SAXParserImpl.java:649)
	at org.dom4j.io.SAXReader.read(SAXReader.java:465)
	at org.dom4j.io.SAXReader.read(SAXReader.java:264)
	at hudson.tasks.junit.SuiteResult.parse(SuiteResult.java:126)
	at hudson.tasks.junit.TestResult.parse(TestResult.java:302)
	at hudson.tasks.junit.TestResult.parsePossiblyEmpty(TestResult.java:244)
	at hudson.tasks.junit.TestResult.parse(TestResult.java:175)
	at hudson.tasks.junit.TestResult.parse(TestResult.java:154)
	at hudson.tasks.junit.TestResult.<init>(TestResult.java:126)
	at hudson.tasks.junit.JUnitParser$ParseResultCallable.invoke(JUnitParser.java:132)
	at hudson.tasks.junit.JUnitParser$ParseResultCallable.invoke(JUnitParser.java:107)
	at hudson.FilePath$FileCallableWrapper.call(FilePath.java:2731)
	at hudson.remoting.UserRequest.perform(UserRequest.java:153)
	at hudson.remoting.UserRequest.perform(UserRequest.java:50)
	at hudson.remoting.Request$2.run(Request.java:336)
	at hudson.remoting.InterceptingExecutorService$1.call(InterceptingExecutorService.java:68)
	at java.util.concurrent.FutureTask.run(FutureTask.java:262)
	at java.util.concurrent.ThreadPoolExecutor.runWorker(ThreadPoolExecutor.java:1145)
	at java.util.concurrent.ThreadPoolExecutor$Worker.run(ThreadPoolExecutor.java:615)
	at java.lang.Thread.run(Thread.java:745)



ZooKeeper_branch35_openjdk7 - Build # 425 - Still Failing

Posted by Apache Jenkins Server <je...@builds.apache.org>.
See https://builds.apache.org/job/ZooKeeper_branch35_openjdk7/425/

###################################################################################
########################## LAST 60 LINES OF THE CONSOLE ###########################
[...truncated 62.53 MB...]
    [junit] 2017-02-20 10:09:05,913 [myid:127.0.0.1:19424] - INFO  [main-SendThread(127.0.0.1:19424):ClientCnxn$SendThread@1113] - Opening socket connection to server 127.0.0.1/127.0.0.1:19424. Will not attempt to authenticate using SASL (unknown error)
    [junit] 2017-02-20 10:09:05,914 [myid:127.0.0.1:19424] - WARN  [main-SendThread(127.0.0.1:19424):ClientCnxn$SendThread@1235] - Session 0x1021b2695120000 for server 127.0.0.1/127.0.0.1:19424, unexpected error, closing socket connection and attempting reconnect
    [junit] java.net.ConnectException: Connection refused
    [junit] 	at sun.nio.ch.SocketChannelImpl.checkConnect(Native Method)
    [junit] 	at sun.nio.ch.SocketChannelImpl.finishConnect(SocketChannelImpl.java:739)
    [junit] 	at org.apache.zookeeper.ClientCnxnSocketNIO.doTransport(ClientCnxnSocketNIO.java:357)
    [junit] 	at org.apache.zookeeper.ClientCnxn$SendThread.run(ClientCnxn.java:1214)
    [junit] 2017-02-20 10:09:06,022 [myid:127.0.0.1:19301] - INFO  [main-SendThread(127.0.0.1:19301):ClientCnxn$SendThread@1113] - Opening socket connection to server 127.0.0.1/127.0.0.1:19301. Will not attempt to authenticate using SASL (unknown error)
    [junit] 2017-02-20 10:09:06,023 [myid:127.0.0.1:19301] - WARN  [main-SendThread(127.0.0.1:19301):ClientCnxn$SendThread@1235] - Session 0x1021b22aea40000 for server 127.0.0.1/127.0.0.1:19301, unexpected error, closing socket connection and attempting reconnect
    [junit] java.net.ConnectException: Connection refused
    [junit] 	at sun.nio.ch.SocketChannelImpl.checkConnect(Native Method)
    [junit] 	at sun.nio.ch.SocketChannelImpl.finishConnect(SocketChannelImpl.java:739)
    [junit] 	at org.apache.zookeeper.ClientCnxnSocketNIO.doTransport(ClientCnxnSocketNIO.java:357)
    [junit] 	at org.apache.zookeeper.ClientCnxn$SendThread.run(ClientCnxn.java:1214)
    [junit] 2017-02-20 10:09:06,137 [myid:127.0.0.1:19427] - INFO  [main-SendThread(127.0.0.1:19427):ClientCnxn$SendThread@1113] - Opening socket connection to server 127.0.0.1/127.0.0.1:19427. Will not attempt to authenticate using SASL (unknown error)
    [junit] 2017-02-20 10:09:06,138 [myid:127.0.0.1:19427] - WARN  [main-SendThread(127.0.0.1:19427):ClientCnxn$SendThread@1235] - Session 0x2021b2695120000 for server 127.0.0.1/127.0.0.1:19427, unexpected error, closing socket connection and attempting reconnect
    [junit] java.net.ConnectException: Connection refused
    [junit] 	at sun.nio.ch.SocketChannelImpl.checkConnect(Native Method)
    [junit] 	at sun.nio.ch.SocketChannelImpl.finishConnect(SocketChannelImpl.java:739)
    [junit] 	at org.apache.zookeeper.ClientCnxnSocketNIO.doTransport(ClientCnxnSocketNIO.java:357)
    [junit] 	at org.apache.zookeeper.ClientCnxn$SendThread.run(ClientCnxn.java:1214)
    [junit] 2017-02-20 10:09:06,142 [myid:] - INFO  [ProcessThread(sid:0 cport:19547)::PrepRequestProcessor@655] - Processed session termination for sessionid: 0x1021b29bde00000
    [junit] 2017-02-20 10:09:06,146 [myid:] - INFO  [main:ZooKeeper@1324] - Session: 0x1021b29bde00000 closed
    [junit] 2017-02-20 10:09:06,146 [myid:] - INFO  [main-EventThread:ClientCnxn$EventThread@513] - EventThread shut down for session: 0x1021b29bde00000
    [junit] 2017-02-20 10:09:06,146 [myid:] - INFO  [SyncThread:0:MBeanRegistry@128] - Unregister MBean [org.apache.ZooKeeperService:name0=StandaloneServer_port19547,name1=Connections,name2=127.0.0.1,name3=0x1021b29bde00000]
    [junit] 2017-02-20 10:09:06,146 [myid:] - INFO  [main:JUnit4ZKTestRunner$LoggedInvokeMethod@82] - Memory used 98175
    [junit] 2017-02-20 10:09:06,147 [myid:] - INFO  [main:JUnit4ZKTestRunner$LoggedInvokeMethod@87] - Number of threads 467
    [junit] 2017-02-20 10:09:06,147 [myid:] - INFO  [main:JUnit4ZKTestRunner$LoggedInvokeMethod@102] - FINISHED TEST METHOD testWatcherAutoResetWithLocal
    [junit] 2017-02-20 10:09:06,148 [myid:] - INFO  [main:ClientBase@543] - tearDown starting
    [junit] 2017-02-20 10:09:06,148 [myid:] - INFO  [main:ClientBase@513] - STOPPING server
    [junit] 2017-02-20 10:09:06,148 [myid:] - INFO  [main:NettyServerCnxnFactory@464] - shutdown called 0.0.0.0/0.0.0.0:19547
    [junit] 2017-02-20 10:09:06,152 [myid:] - INFO  [main:ZooKeeperServer@541] - shutting down
    [junit] 2017-02-20 10:09:06,152 [myid:] - ERROR [main:ZooKeeperServer@505] - ZKShutdownHandler is not registered, so ZooKeeper server won't take any action on ERROR or SHUTDOWN server state changes
    [junit] 2017-02-20 10:09:06,152 [myid:] - INFO  [main:SessionTrackerImpl@232] - Shutting down
    [junit] 2017-02-20 10:09:06,153 [myid:] - INFO  [main:PrepRequestProcessor@973] - Shutting down
    [junit] 2017-02-20 10:09:06,153 [myid:] - INFO  [ProcessThread(sid:0 cport:19547)::PrepRequestProcessor@154] - PrepRequestProcessor exited loop!
    [junit] 2017-02-20 10:09:06,153 [myid:] - INFO  [main:SyncRequestProcessor@191] - Shutting down
    [junit] 2017-02-20 10:09:06,153 [myid:] - INFO  [SyncThread:0:SyncRequestProcessor@169] - SyncRequestProcessor exited!
    [junit] 2017-02-20 10:09:06,154 [myid:] - INFO  [main:FinalRequestProcessor@479] - shutdown of request processor complete
    [junit] 2017-02-20 10:09:06,154 [myid:] - INFO  [main:MBeanRegistry@128] - Unregister MBean [org.apache.ZooKeeperService:name0=StandaloneServer_port19547,name1=InMemoryDataTree]
    [junit] 2017-02-20 10:09:06,155 [myid:] - INFO  [main:MBeanRegistry@128] - Unregister MBean [org.apache.ZooKeeperService:name0=StandaloneServer_port19547]
    [junit] 2017-02-20 10:09:06,155 [myid:] - INFO  [main:FourLetterWordMain@85] - connecting to 127.0.0.1 19547
    [junit] 2017-02-20 10:09:06,156 [myid:] - INFO  [main:JMXEnv@146] - ensureOnly:[]
    [junit] 2017-02-20 10:09:06,162 [myid:] - INFO  [main:ClientBase@568] - fdcount after test is: 1383 at start it was 1383
    [junit] 2017-02-20 10:09:06,162 [myid:] - INFO  [main:ZKTestCase$1@65] - SUCCEEDED testWatcherAutoResetWithLocal
    [junit] 2017-02-20 10:09:06,162 [myid:] - INFO  [main:ZKTestCase$1@60] - FINISHED testWatcherAutoResetWithLocal
    [junit] Tests run: 103, Failures: 0, Errors: 0, Skipped: 0, Time elapsed: 470.101 sec, Thread: 4, Class: org.apache.zookeeper.test.NioNettySuiteTest

fail.build.on.test.failure:

BUILD FAILED
/home/jenkins/jenkins-slave/workspace/ZooKeeper_branch35_openjdk7/build.xml:1211: The following error occurred while executing this line:
/home/jenkins/jenkins-slave/workspace/ZooKeeper_branch35_openjdk7/build.xml:1215: Tests failed!

Total time: 12 minutes 14 seconds
Build step 'Invoke Ant' marked build as failure
Recording test results
Email was triggered for: Failure - Any
Sending email for trigger: Failure - Any



###################################################################################
############################## FAILED TESTS (if any) ##############################
4 tests failed.
FAILED:  org.apache.zookeeper.server.quorum.ReconfigRecoveryTest.testCurrentObserverIsParticipantInNewConfig

Error Message:
waiting for server 2 being up

Stack Trace:
junit.framework.AssertionFailedError: waiting for server 2 being up
	at org.apache.zookeeper.server.quorum.ReconfigRecoveryTest.testCurrentObserverIsParticipantInNewConfig(ReconfigRecoveryTest.java:529)
	at org.apache.zookeeper.JUnit4ZKTestRunner$LoggedInvokeMethod.evaluate(JUnit4ZKTestRunner.java:79)


FAILED:  org.apache.zookeeper.test.NettyNettySuiteHammerTest.testObserversHammer

Error Message:
Forked Java VM exited abnormally. Please note the time in the report does not reflect the time until the VM exit.

Stack Trace:
junit.framework.AssertionFailedError: Forked Java VM exited abnormally. Please note the time in the report does not reflect the time until the VM exit.
	at java.lang.Thread.run(Thread.java:745)


FAILED:  org.apache.zookeeper.test.ObserverQuorumHammerTest.testHammerBasic

Error Message:
expected:<1000> but was:<374>

Stack Trace:
junit.framework.AssertionFailedError: expected:<1000> but was:<374>
	at org.apache.zookeeper.test.ClientHammerTest.verifyHammer(ClientHammerTest.java:231)
	at org.apache.zookeeper.test.ClientHammerTest.runHammer(ClientHammerTest.java:142)
	at org.apache.zookeeper.test.ClientHammerTest.testHammerBasic(ClientHammerTest.java:120)
	at org.apache.zookeeper.test.ObserverQuorumHammerTest.testHammerBasic(ObserverQuorumHammerTest.java:37)
	at org.apache.zookeeper.JUnit4ZKTestRunner$LoggedInvokeMethod.evaluate(JUnit4ZKTestRunner.java:79)


FAILED:  org.apache.zookeeper.test.ReconfigTest.testPortChange

Error Message:
null

Stack Trace:
junit.framework.AssertionFailedError
	at org.apache.zookeeper.test.ReconfigTest.testPortChange(ReconfigTest.java:681)
	at org.apache.zookeeper.JUnit4ZKTestRunner$LoggedInvokeMethod.evaluate(JUnit4ZKTestRunner.java:79)