You are viewing a plain text version of this content. The canonical link for it is here.
Posted to yarn-dev@hadoop.apache.org by Apache Jenkins Server <je...@builds.apache.org> on 2016/05/16 05:59:52 UTC
Hadoop-Yarn-trunk-Java8 - Build # 1437 - Still Failing
See https://builds.apache.org/job/Hadoop-Yarn-trunk-Java8/1437/
###################################################################################
########################## LAST 60 LINES OF THE CONSOLE ###########################
[...truncated 4799 lines...]
However, there were other interactions with this mock:
-> at org.apache.hadoop.yarn.server.applicationhistoryservice.TestFileSystemApplicationHistoryStore.initAndStartStore(TestFileSystemApplicationHistoryStore.java:70)
Tests in error:
TestFileSystemApplicationHistoryStore.setup:64->initAndStartStore:70 ยป NullPointer
TestFileSystemApplicationHistoryStore.tearDown:89 NullPointer
Tests run: 202, Failures: 1, Errors: 2, Skipped: 0
[INFO] ------------------------------------------------------------------------
[INFO] Reactor Summary:
[INFO]
[INFO] Apache Hadoop YARN ................................ SUCCESS [ 3.165 s]
[INFO] Apache Hadoop YARN API ............................ SUCCESS [01:20 min]
[INFO] Apache Hadoop YARN Common ......................... SUCCESS [02:36 min]
[INFO] Apache Hadoop YARN Server ......................... SUCCESS [ 0.049 s]
[INFO] Apache Hadoop YARN Server Common .................. SUCCESS [ 31.112 s]
[INFO] Apache Hadoop YARN NodeManager .................... SUCCESS [12:46 min]
[INFO] Apache Hadoop YARN Web Proxy ...................... SUCCESS [ 21.513 s]
[INFO] Apache Hadoop YARN ApplicationHistoryService ...... FAILURE [04:25 min]
[INFO] Apache Hadoop YARN ResourceManager ................ SKIPPED
[INFO] Apache Hadoop YARN Server Tests ................... SKIPPED
[INFO] Apache Hadoop YARN Client ......................... SKIPPED
[INFO] Apache Hadoop YARN SharedCacheManager ............. SKIPPED
[INFO] Apache Hadoop YARN Timeline Plugin Storage ........ SKIPPED
[INFO] Apache Hadoop YARN Applications ................... SKIPPED
[INFO] Apache Hadoop YARN DistributedShell ............... SKIPPED
[INFO] Apache Hadoop YARN Unmanaged Am Launcher .......... SKIPPED
[INFO] Apache Hadoop YARN Site ........................... SKIPPED
[INFO] Apache Hadoop YARN Registry ....................... SKIPPED
[INFO] Apache Hadoop YARN Project ........................ SKIPPED
[INFO] ------------------------------------------------------------------------
[INFO] BUILD FAILURE
[INFO] ------------------------------------------------------------------------
[INFO] Total time: 22:06 min
[INFO] Finished at: 2016-05-16T05:59:48+00:00
[INFO] Final Memory: 93M/1077M
[INFO] ------------------------------------------------------------------------
[ERROR] Failed to execute goal org.apache.maven.plugins:maven-surefire-plugin:2.17:test (default-test) on project hadoop-yarn-server-applicationhistoryservice: There are test failures.
[ERROR]
[ERROR] Please refer to /home/jenkins/jenkins-slave/workspace/Hadoop-Yarn-trunk-Java8/hadoop-yarn-project/hadoop-yarn/hadoop-yarn-server/hadoop-yarn-server-applicationhistoryservice/target/surefire-reports for the individual test results.
[ERROR] -> [Help 1]
[ERROR]
[ERROR] To see the full stack trace of the errors, re-run Maven with the -e switch.
[ERROR] Re-run Maven using the -X switch to enable full debug logging.
[ERROR]
[ERROR] For more information about the errors and possible solutions, please read the following articles:
[ERROR] [Help 1] http://cwiki.apache.org/confluence/display/MAVEN/MojoFailureException
[ERROR]
[ERROR] After correcting the problems, you can resume the build with the command
[ERROR] mvn <goals> -rf :hadoop-yarn-server-applicationhistoryservice
Build step 'Execute shell' marked build as failure
Archiving artifacts
Recording test results
Sending e-mails to: yarn-dev@hadoop.apache.org
Email was triggered for: Failure - Any
Sending email for trigger: Failure - Any
###################################################################################
############################## FAILED TESTS (if any) ##############################
3 tests failed.
FAILED: org.apache.hadoop.yarn.server.applicationhistoryservice.TestFileSystemApplicationHistoryStore.testMissingApplicationAttemptHistoryData
Error Message:
null
Stack Trace:
java.lang.NullPointerException: null
at java.util.TreeMap.getEntry(TreeMap.java:347)
at java.util.TreeMap.get(TreeMap.java:278)
at org.apache.hadoop.fs.GlobalStorageStatistics.put(GlobalStorageStatistics.java:73)
at org.apache.hadoop.fs.FileSystem.getStatistics(FileSystem.java:3598)
at org.apache.hadoop.fs.FileSystem.initialize(FileSystem.java:214)
at org.apache.hadoop.fs.RawLocalFileSystem.initialize(RawLocalFileSystem.java:101)
at org.apache.hadoop.yarn.server.applicationhistoryservice.TestFileSystemApplicationHistoryStore.initAndStartStore(TestFileSystemApplicationHistoryStore.java:70)
at org.apache.hadoop.yarn.server.applicationhistoryservice.TestFileSystemApplicationHistoryStore.setup(TestFileSystemApplicationHistoryStore.java:64)
FAILED: org.apache.hadoop.yarn.server.applicationhistoryservice.TestFileSystemApplicationHistoryStore.testMissingApplicationAttemptHistoryData
Error Message:
null
Stack Trace:
java.lang.NullPointerException: null
at org.apache.hadoop.yarn.server.applicationhistoryservice.TestFileSystemApplicationHistoryStore.tearDown(TestFileSystemApplicationHistoryStore.java:89)
FAILED: org.apache.hadoop.yarn.server.applicationhistoryservice.TestFileSystemApplicationHistoryStore.testInitNonExistingWorkingDirectoryInSafeMode
Error Message:
Wanted but not invoked:
rawLocalFileSystem.isDirectory(<any>);
-> at org.apache.hadoop.yarn.server.applicationhistoryservice.TestFileSystemApplicationHistoryStore.testInitNonExistingWorkingDirectoryInSafeMode(TestFileSystemApplicationHistoryStore.java:304)
However, there were other interactions with this mock:
-> at org.apache.hadoop.yarn.server.applicationhistoryservice.TestFileSystemApplicationHistoryStore.initAndStartStore(TestFileSystemApplicationHistoryStore.java:70)
Stack Trace:
org.mockito.exceptions.verification.WantedButNotInvoked:
Wanted but not invoked:
rawLocalFileSystem.isDirectory(<any>);
-> at org.apache.hadoop.yarn.server.applicationhistoryservice.TestFileSystemApplicationHistoryStore.testInitNonExistingWorkingDirectoryInSafeMode(TestFileSystemApplicationHistoryStore.java:304)
However, there were other interactions with this mock:
-> at org.apache.hadoop.yarn.server.applicationhistoryservice.TestFileSystemApplicationHistoryStore.initAndStartStore(TestFileSystemApplicationHistoryStore.java:70)
at org.apache.hadoop.yarn.server.applicationhistoryservice.TestFileSystemApplicationHistoryStore.testInitNonExistingWorkingDirectoryInSafeMode(TestFileSystemApplicationHistoryStore.java:304)