You are viewing a plain text version of this content. The canonical link for it is here.
Posted to notifications@directory.apache.org by Apache Jenkins Server <je...@builds.apache.org> on 2024/05/17 12:38:08 UTC
Build failed in Jenkins: Directory » dir-kerby-openjdk11 #388
See <https://ci-builds.apache.org/job/Directory/job/dir-kerby-openjdk11/388/display/redirect?page=changes>
Changes:
[github] Bump actions/checkout from 4.1.4 to 4.1.5
[github] Bump ossf/scorecard-action from 2.3.1 to 2.3.3
[github] Bump github/codeql-action from 3.25.3 to 3.25.4
[github] Bump com.nimbusds:nimbus-jose-jwt from 9.37.3 to 9.39.1
------------------------------------------
[...truncated 46.30 KB...]
[INFO] Preparing remote bundle org.apache.apache.resources:apache-jar-resource-bundle:1.5
[INFO] Copying 3 resources from 1 bundle.
[INFO]
[INFO] --- resources:3.3.1:resources (default-resources) @ kerby-asn1 ---
[INFO] skip non existing resourceDirectory <https://ci-builds.apache.org/job/Directory/job/dir-kerby-openjdk11/ws/kerby-common/kerby-asn1/src/main/resources>
[INFO] Copying 3 resources from target/maven-shared-archive-resources to target/classes
[INFO]
[INFO] --- compiler:3.13.0:compile (default-compile) @ kerby-asn1 ---
[INFO] Recompiling the module because of changed source code.
[INFO] Compiling 69 source files with javac [debug release 7] to target/classes
[INFO] <https://ci-builds.apache.org/job/Directory/job/dir-kerby-openjdk11/ws/kerby-common/kerby-asn1/src/main/java/org/apache/kerby/asn1/type/Asn1Any.java>: Some input files use unchecked or unsafe operations.
[INFO] <https://ci-builds.apache.org/job/Directory/job/dir-kerby-openjdk11/ws/kerby-common/kerby-asn1/src/main/java/org/apache/kerby/asn1/type/Asn1Any.java>: Recompile with -Xlint:unchecked for details.
[INFO]
[INFO] --- resources:3.3.1:testResources (default-testResources) @ kerby-asn1 ---
[INFO] Copying 5 resources from src/test/resources to target/test-classes
[INFO] Copying 3 resources from target/maven-shared-archive-resources to target/test-classes
[INFO]
[INFO] --- compiler:3.13.0:testCompile (default-testCompile) @ kerby-asn1 ---
[INFO] Recompiling the module because of changed dependency.
[INFO] Compiling 15 source files with javac [debug release 7] to target/test-classes
[INFO] -------------------------------------------------------------
[ERROR] COMPILATION ERROR :
[INFO] -------------------------------------------------------------
[ERROR] <https://ci-builds.apache.org/job/Directory/job/dir-kerby-openjdk11/ws/kerby-common/kerby-asn1/src/test/java/org/apache/kerby/asn1/Asn1BooleanTest.java>:[48,9] cannot access java.util.function.Predicate
class file for java.util.function.Predicate not found
[ERROR] <https://ci-builds.apache.org/job/Directory/job/dir-kerby-openjdk11/ws/kerby-common/kerby-asn1/src/test/java/org/apache/kerby/asn1/Asn1BooleanTest.java>:[68,9] cannot access java.util.function.IntPredicate
class file for java.util.function.IntPredicate not found
[ERROR] <https://ci-builds.apache.org/job/Directory/job/dir-kerby-openjdk11/ws/kerby-common/kerby-asn1/src/test/java/org/apache/kerby/asn1/Asn1CollectionTest.java>:[46,9] cannot access java.util.function.LongPredicate
class file for java.util.function.LongPredicate not found
[ERROR] <https://ci-builds.apache.org/job/Directory/job/dir-kerby-openjdk11/ws/kerby-common/kerby-asn1/src/test/java/org/apache/kerby/asn1/Asn1CollectionTest.java>:[55,9] cannot access java.util.function.DoublePredicate
class file for java.util.function.DoublePredicate not found
[ERROR] <https://ci-builds.apache.org/job/Directory/job/dir-kerby-openjdk11/ws/kerby-common/kerby-asn1/src/test/java/org/apache/kerby/asn1/Asn1CollectionTest.java>:[58,9] cannot access java.util.concurrent.CompletableFuture
class file for java.util.concurrent.CompletableFuture not found
[ERROR] <https://ci-builds.apache.org/job/Directory/job/dir-kerby-openjdk11/ws/kerby-common/kerby-asn1/src/test/java/org/apache/kerby/asn1/Asn1DumpTest.java>:[39,23] cannot access java.util.function.Supplier
class file for java.util.function.Supplier not found
[ERROR] <https://ci-builds.apache.org/job/Directory/job/dir-kerby-openjdk11/ws/kerby-common/kerby-asn1/src/test/java/org/apache/kerby/asn1/Asn1FlagsTest.java>:[106,5] cannot access java.util.function.BooleanSupplier
class file for java.util.function.BooleanSupplier not found
[ERROR] <https://ci-builds.apache.org/job/Directory/job/dir-kerby-openjdk11/ws/kerby-common/kerby-asn1/src/test/java/org/apache/kerby/asn1/Asn1GeneralizedTimeTest.java>:[66,9] cannot access java.util.concurrent.CompletionStage
class file for java.util.concurrent.CompletionStage not found
[ERROR] <https://ci-builds.apache.org/job/Directory/job/dir-kerby-openjdk11/ws/kerby-common/kerby-asn1/src/test/java/org/apache/kerby/asn1/Asn1IntegerTest.java>:[50,9] cannot access java.util.Optional
class file for java.util.Optional not found
[ERROR] <https://ci-builds.apache.org/job/Directory/job/dir-kerby-openjdk11/ws/kerby-common/kerby-asn1/src/test/java/org/apache/kerby/asn1/Asn1IntegerTest.java>:[70,9] cannot access java.util.OptionalDouble
class file for java.util.OptionalDouble not found
[ERROR] <https://ci-builds.apache.org/job/Directory/job/dir-kerby-openjdk11/ws/kerby-common/kerby-asn1/src/test/java/org/apache/kerby/asn1/Asn1ObjectIdentifierTest.java>:[51,9] cannot access java.util.OptionalInt
class file for java.util.OptionalInt not found
[ERROR] <https://ci-builds.apache.org/job/Directory/job/dir-kerby-openjdk11/ws/kerby-common/kerby-asn1/src/test/java/org/apache/kerby/asn1/Asn1ObjectIdentifierTest.java>:[64,9] cannot access java.util.OptionalLong
class file for java.util.OptionalLong not found
[ERROR] <https://ci-builds.apache.org/job/Directory/job/dir-kerby-openjdk11/ws/kerby-common/kerby-asn1/src/test/java/org/apache/kerby/asn1/Asn1UtcTimeTest.java>:[76,9] cannot access java.time.ZonedDateTime
class file for java.time.ZonedDateTime not found
[ERROR] <https://ci-builds.apache.org/job/Directory/job/dir-kerby-openjdk11/ws/kerby-common/kerby-asn1/src/test/java/org/apache/kerby/asn1/Asn1UtcTimeTest.java>:[92,9] cannot access java.time.LocalDateTime
class file for java.time.LocalDateTime not found
[ERROR] <https://ci-builds.apache.org/job/Directory/job/dir-kerby-openjdk11/ws/kerby-common/kerby-asn1/src/test/java/org/apache/kerby/asn1/Asn1Utf8StringTest.java>:[43,9] cannot access java.time.OffsetDateTime
class file for java.time.OffsetDateTime not found
[ERROR] <https://ci-builds.apache.org/job/Directory/job/dir-kerby-openjdk11/ws/kerby-common/kerby-asn1/src/test/java/org/apache/kerby/asn1/Asn1Utf8StringTest.java>:[44,9] cannot access java.time.OffsetTime
class file for java.time.OffsetTime not found
[ERROR] <https://ci-builds.apache.org/job/Directory/job/dir-kerby-openjdk11/ws/kerby-common/kerby-asn1/src/test/java/org/apache/kerby/asn1/Asn1Utf8StringTest.java>:[57,9] cannot access java.time.LocalTime
class file for java.time.LocalTime not found
[ERROR] <https://ci-builds.apache.org/job/Directory/job/dir-kerby-openjdk11/ws/kerby-common/kerby-asn1/src/test/java/org/apache/kerby/asn1/Asn1Utf8StringTest.java>:[58,9] cannot access java.time.LocalDate
class file for java.time.LocalDate not found
[ERROR] <https://ci-builds.apache.org/job/Directory/job/dir-kerby-openjdk11/ws/kerby-common/kerby-asn1/src/test/java/org/apache/kerby/asn1/PersonnelRecordTest.java>:[72,9] cannot access java.time.Instant
class file for java.time.Instant not found
[ERROR] <https://ci-builds.apache.org/job/Directory/job/dir-kerby-openjdk11/ws/kerby-common/kerby-asn1/src/test/java/org/apache/kerby/asn1/PersonnelRecordTest.java>:[84,9] cannot access java.time.Duration
class file for java.time.Duration not found
[ERROR] <https://ci-builds.apache.org/job/Directory/job/dir-kerby-openjdk11/ws/kerby-common/kerby-asn1/src/test/java/org/apache/kerby/asn1/PersonnelRecordTest.java>:[86,9] cannot access java.time.Period
class file for java.time.Period not found
[ERROR] <https://ci-builds.apache.org/job/Directory/job/dir-kerby-openjdk11/ws/kerby-common/kerby-asn1/src/test/java/org/apache/kerby/asn1/PersonnelRecordTest.java>:[88,9] cannot access java.util.concurrent.atomic.LongAdder
class file for java.util.concurrent.atomic.LongAdder not found
[ERROR] <https://ci-builds.apache.org/job/Directory/job/dir-kerby-openjdk11/ws/kerby-common/kerby-asn1/src/test/java/org/apache/kerby/asn1/PersonnelRecordTest.java>:[90,9] cannot access java.util.stream.Stream
class file for java.util.stream.Stream not found
[ERROR] <https://ci-builds.apache.org/job/Directory/job/dir-kerby-openjdk11/ws/kerby-common/kerby-asn1/src/test/java/org/apache/kerby/asn1/PersonnelRecordTest.java>:[92,9] cannot access java.util.stream.DoubleStream
class file for java.util.stream.DoubleStream not found
[ERROR] <https://ci-builds.apache.org/job/Directory/job/dir-kerby-openjdk11/ws/kerby-common/kerby-asn1/src/test/java/org/apache/kerby/asn1/PersonnelRecordTest.java>:[94,9] cannot access java.util.stream.LongStream
class file for java.util.stream.LongStream not found
[ERROR] <https://ci-builds.apache.org/job/Directory/job/dir-kerby-openjdk11/ws/kerby-common/kerby-asn1/src/test/java/org/apache/kerby/asn1/PersonnelRecordTest.java>:[96,9] cannot access java.util.stream.IntStream
class file for java.util.stream.IntStream not found
[ERROR] <https://ci-builds.apache.org/job/Directory/job/dir-kerby-openjdk11/ws/kerby-common/kerby-asn1/src/test/java/org/apache/kerby/asn1/PersonnelRecordTest.java>:[98,9] cannot access java.util.Spliterator
class file for java.util.Spliterator not found
[INFO] 27 errors
[INFO] -------------------------------------------------------------
[INFO] ------------------------------------------------------------------------
[INFO] Reactor Summary for Apache Kerby Project 2.1.0-SNAPSHOT:
[INFO]
[INFO] Apache Kerby Project ............................... SUCCESS [01:36 min]
[INFO] Apache Kerby BOM ................................... SUCCESS [ 7.150 s]
[INFO] Apache Directory Kerby Parent pom .................. SUCCESS [ 7.075 s]
[INFO] Kerby-common Project ............................... SUCCESS [ 6.916 s]
[INFO] Kerby ASN1 Project ................................. FAILURE [ 13.383 s]
[INFO] Kerby Config ....................................... SKIPPED
[INFO] Kerby Util ......................................... SKIPPED
[INFO] Kerby XDR Project .................................. SKIPPED
[INFO] Kerby PKIX Project ................................. SKIPPED
[INFO] Kerby-kerb Project ................................. SKIPPED
[INFO] Kerby-kerb core .................................... SKIPPED
[INFO] Kerby-kerb Crypto .................................. SKIPPED
[INFO] Kerby-kerb Common .................................. SKIPPED
[INFO] Kerby-kerb Util .................................... SKIPPED
[INFO] Kerby-kerb Identity ................................ SKIPPED
[INFO] Kerby-kerb Identity Test ........................... SKIPPED
[INFO] Kerby providers .................................... SKIPPED
[INFO] Token provider ..................................... SKIPPED
[INFO] Kerby-kerb Client .................................. SKIPPED
[INFO] Kerby-kerb Server .................................. SKIPPED
[INFO] Kerby-kerb Admin ................................... SKIPPED
[INFO] Kerb Simple Kdc .................................... SKIPPED
[INFO] Kerby-kerb server all .............................. SKIPPED
[INFO] Kerby KDC Server ................................... SKIPPED
[INFO] Kerb Kdc Test ...................................... SKIPPED
[INFO] Kerby-kerb GssAPI .................................. SKIPPED
[INFO] Kerb Integration Test .............................. SKIPPED
[INFO] Kerby Backend ...................................... SKIPPED
[INFO] Zookeeper identity backend ......................... SKIPPED
[INFO] Kerby-kerb Admin Server ............................ SKIPPED
[INFO] Kerby-kerb client api all .......................... SKIPPED
[INFO] Json identity backend .............................. SKIPPED
[INFO] Kerby Kdc Test ..................................... SKIPPED
[INFO] Ldap identity backend .............................. SKIPPED
[INFO] Mavibot based backend .............................. SKIPPED
[INFO] MySQL identity backend ............................. SKIPPED
[INFO] Kerby benchmark .................................... SKIPPED
[INFO] Kdc Tool Project ................................... SKIPPED
[INFO] Client Tool ........................................ SKIPPED
[INFO] KDC Tool ........................................... SKIPPED
[INFO] Kerby Distribution ................................. SKIPPED
[INFO] KDC Dist ........................................... SKIPPED
[INFO] Tool Dist .......................................... SKIPPED
[INFO] ------------------------------------------------------------------------
[INFO] BUILD FAILURE
[INFO] ------------------------------------------------------------------------
[INFO] Total time: 03:15 min
[INFO] Finished at: 2024-05-17T12:37:04Z
[INFO] ------------------------------------------------------------------------
Waiting for Jenkins to finish collecting data
[ERROR] Failed to execute goal org.apache.maven.plugins:maven-compiler-plugin:3.13.0:testCompile (default-testCompile) on project kerby-asn1: Compilation failure: Compilation failure:
[ERROR] <https://ci-builds.apache.org/job/Directory/job/dir-kerby-openjdk11/ws/kerby-common/kerby-asn1/src/test/java/org/apache/kerby/asn1/Asn1BooleanTest.java>:[48,9] cannot access java.util.function.Predicate
[ERROR] class file for java.util.function.Predicate not found
[ERROR] <https://ci-builds.apache.org/job/Directory/job/dir-kerby-openjdk11/ws/kerby-common/kerby-asn1/src/test/java/org/apache/kerby/asn1/Asn1BooleanTest.java>:[68,9] cannot access java.util.function.IntPredicate
[ERROR] class file for java.util.function.IntPredicate not found
[ERROR] <https://ci-builds.apache.org/job/Directory/job/dir-kerby-openjdk11/ws/kerby-common/kerby-asn1/src/test/java/org/apache/kerby/asn1/Asn1CollectionTest.java>:[46,9] cannot access java.util.function.LongPredicate
[ERROR] class file for java.util.function.LongPredicate not found
[ERROR] <https://ci-builds.apache.org/job/Directory/job/dir-kerby-openjdk11/ws/kerby-common/kerby-asn1/src/test/java/org/apache/kerby/asn1/Asn1CollectionTest.java>:[55,9] cannot access java.util.function.DoublePredicate
[ERROR] class file for java.util.function.DoublePredicate not found
[ERROR] <https://ci-builds.apache.org/job/Directory/job/dir-kerby-openjdk11/ws/kerby-common/kerby-asn1/src/test/java/org/apache/kerby/asn1/Asn1CollectionTest.java>:[58,9] cannot access java.util.concurrent.CompletableFuture
[ERROR] class file for java.util.concurrent.CompletableFuture not found
[ERROR] <https://ci-builds.apache.org/job/Directory/job/dir-kerby-openjdk11/ws/kerby-common/kerby-asn1/src/test/java/org/apache/kerby/asn1/Asn1DumpTest.java>:[39,23] cannot access java.util.function.Supplier
[ERROR] class file for java.util.function.Supplier not found
[ERROR] <https://ci-builds.apache.org/job/Directory/job/dir-kerby-openjdk11/ws/kerby-common/kerby-asn1/src/test/java/org/apache/kerby/asn1/Asn1FlagsTest.java>:[106,5] cannot access java.util.function.BooleanSupplier
[ERROR] class file for java.util.function.BooleanSupplier not found
[ERROR] <https://ci-builds.apache.org/job/Directory/job/dir-kerby-openjdk11/ws/kerby-common/kerby-asn1/src/test/java/org/apache/kerby/asn1/Asn1GeneralizedTimeTest.java>:[66,9] cannot access java.util.concurrent.CompletionStage
[ERROR] class file for java.util.concurrent.CompletionStage not found
[ERROR] <https://ci-builds.apache.org/job/Directory/job/dir-kerby-openjdk11/ws/kerby-common/kerby-asn1/src/test/java/org/apache/kerby/asn1/Asn1IntegerTest.java>:[50,9] cannot access java.util.Optional
[ERROR] class file for java.util.Optional not found
[ERROR] <https://ci-builds.apache.org/job/Directory/job/dir-kerby-openjdk11/ws/kerby-common/kerby-asn1/src/test/java/org/apache/kerby/asn1/Asn1IntegerTest.java>:[70,9] cannot access java.util.OptionalDouble
[ERROR] class file for java.util.OptionalDouble not found
[ERROR] <https://ci-builds.apache.org/job/Directory/job/dir-kerby-openjdk11/ws/kerby-common/kerby-asn1/src/test/java/org/apache/kerby/asn1/Asn1ObjectIdentifierTest.java>:[51,9] cannot access java.util.OptionalInt
[ERROR] class file for java.util.OptionalInt not found
[ERROR] <https://ci-builds.apache.org/job/Directory/job/dir-kerby-openjdk11/ws/kerby-common/kerby-asn1/src/test/java/org/apache/kerby/asn1/Asn1ObjectIdentifierTest.java>:[64,9] cannot access java.util.OptionalLong
[ERROR] class file for java.util.OptionalLong not found
[ERROR] <https://ci-builds.apache.org/job/Directory/job/dir-kerby-openjdk11/ws/kerby-common/kerby-asn1/src/test/java/org/apache/kerby/asn1/Asn1UtcTimeTest.java>:[76,9] cannot access java.time.ZonedDateTime
[ERROR] class file for java.time.ZonedDateTime not found
[ERROR] <https://ci-builds.apache.org/job/Directory/job/dir-kerby-openjdk11/ws/kerby-common/kerby-asn1/src/test/java/org/apache/kerby/asn1/Asn1UtcTimeTest.java>:[92,9] cannot access java.time.LocalDateTime
[ERROR] class file for java.time.LocalDateTime not found
[ERROR] <https://ci-builds.apache.org/job/Directory/job/dir-kerby-openjdk11/ws/kerby-common/kerby-asn1/src/test/java/org/apache/kerby/asn1/Asn1Utf8StringTest.java>:[43,9] cannot access java.time.OffsetDateTime
[ERROR] class file for java.time.OffsetDateTime not found
[ERROR] <https://ci-builds.apache.org/job/Directory/job/dir-kerby-openjdk11/ws/kerby-common/kerby-asn1/src/test/java/org/apache/kerby/asn1/Asn1Utf8StringTest.java>:[44,9] cannot access java.time.OffsetTime
[ERROR] class file for java.time.OffsetTime not found
[ERROR] <https://ci-builds.apache.org/job/Directory/job/dir-kerby-openjdk11/ws/kerby-common/kerby-asn1/src/test/java/org/apache/kerby/asn1/Asn1Utf8StringTest.java>:[57,9] cannot access java.time.LocalTime
[ERROR] class file for java.time.LocalTime not found
[ERROR] <https://ci-builds.apache.org/job/Directory/job/dir-kerby-openjdk11/ws/kerby-common/kerby-asn1/src/test/java/org/apache/kerby/asn1/Asn1Utf8StringTest.java>:[58,9] cannot access java.time.LocalDate
[ERROR] class file for java.time.LocalDate not found
[ERROR] <https://ci-builds.apache.org/job/Directory/job/dir-kerby-openjdk11/ws/kerby-common/kerby-asn1/src/test/java/org/apache/kerby/asn1/PersonnelRecordTest.java>:[72,9] cannot access java.time.Instant
[ERROR] class file for java.time.Instant not found
[ERROR] <https://ci-builds.apache.org/job/Directory/job/dir-kerby-openjdk11/ws/kerby-common/kerby-asn1/src/test/java/org/apache/kerby/asn1/PersonnelRecordTest.java>:[84,9] cannot access java.time.Duration
[ERROR] class file for java.time.Duration not found
[ERROR] <https://ci-builds.apache.org/job/Directory/job/dir-kerby-openjdk11/ws/kerby-common/kerby-asn1/src/test/java/org/apache/kerby/asn1/PersonnelRecordTest.java>:[86,9] cannot access java.time.Period
[ERROR] class file for java.time.Period not found
[ERROR] <https://ci-builds.apache.org/job/Directory/job/dir-kerby-openjdk11/ws/kerby-common/kerby-asn1/src/test/java/org/apache/kerby/asn1/PersonnelRecordTest.java>:[88,9] cannot access java.util.concurrent.atomic.LongAdder
[ERROR] class file for java.util.concurrent.atomic.LongAdder not found
[ERROR] <https://ci-builds.apache.org/job/Directory/job/dir-kerby-openjdk11/ws/kerby-common/kerby-asn1/src/test/java/org/apache/kerby/asn1/PersonnelRecordTest.java>:[90,9] cannot access java.util.stream.Stream
[ERROR] class file for java.util.stream.Stream not found
[ERROR] <https://ci-builds.apache.org/job/Directory/job/dir-kerby-openjdk11/ws/kerby-common/kerby-asn1/src/test/java/org/apache/kerby/asn1/PersonnelRecordTest.java>:[92,9] cannot access java.util.stream.DoubleStream
[ERROR] class file for java.util.stream.DoubleStream not found
[ERROR] <https://ci-builds.apache.org/job/Directory/job/dir-kerby-openjdk11/ws/kerby-common/kerby-asn1/src/test/java/org/apache/kerby/asn1/PersonnelRecordTest.java>:[94,9] cannot access java.util.stream.LongStream
[ERROR] class file for java.util.stream.LongStream not found
[ERROR] <https://ci-builds.apache.org/job/Directory/job/dir-kerby-openjdk11/ws/kerby-common/kerby-asn1/src/test/java/org/apache/kerby/asn1/PersonnelRecordTest.java>:[96,9] cannot access java.util.stream.IntStream
[ERROR] class file for java.util.stream.IntStream not found
[ERROR] <https://ci-builds.apache.org/job/Directory/job/dir-kerby-openjdk11/ws/kerby-common/kerby-asn1/src/test/java/org/apache/kerby/asn1/PersonnelRecordTest.java>:[98,9] cannot access java.util.Spliterator
[ERROR] class file for java.util.Spliterator not found
[ERROR] -> [Help 1]
[ERROR]
[ERROR] To see the full stack trace of the errors, re-run Maven with the -e switch.
[ERROR] Re-run Maven using the -X switch to enable full debug logging.
[ERROR]
[ERROR] For more information about the errors and possible solutions, please read the following articles:
[ERROR] [Help 1] http://cwiki.apache.org/confluence/display/MAVEN/MojoFailureException
[ERROR]
[ERROR] After correcting the problems, you can resume the build with the command
[ERROR] mvn <goals> -rf :kerby-asn1
[JENKINS] Archiving <https://ci-builds.apache.org/job/Directory/job/dir-kerby-openjdk11/ws/kerby-backend/mysql-backend/pom.xml> to org.apache.kerby/mysql-backend/2.1.0-SNAPSHOT/mysql-backend-2.1.0-SNAPSHOT.pom
[JENKINS] Archiving <https://ci-builds.apache.org/job/Directory/job/dir-kerby-openjdk11/ws/kerby-backend/json-backend/pom.xml> to org.apache.kerby/json-backend/2.1.0-SNAPSHOT/json-backend-2.1.0-SNAPSHOT.pom
[JENKINS] Archiving <https://ci-builds.apache.org/job/Directory/job/dir-kerby-openjdk11/ws/kerby-backend/ldap-backend/pom.xml> to org.apache.kerby/ldap-backend/2.1.0-SNAPSHOT/ldap-backend-2.1.0-SNAPSHOT.pom
[JENKINS] Archiving <https://ci-builds.apache.org/job/Directory/job/dir-kerby-openjdk11/ws/kerby-pkix/pom.xml> to org.apache.kerby/kerby-pkix/2.1.0-SNAPSHOT/kerby-pkix-2.1.0-SNAPSHOT.pom
[JENKINS] Archiving <https://ci-builds.apache.org/job/Directory/job/dir-kerby-openjdk11/ws/kerby-kdc-test/pom.xml> to org.apache.kerby/kerby-kdc-test/2.1.0-SNAPSHOT/kerby-kdc-test-2.1.0-SNAPSHOT.pom
[JENKINS] Archiving <https://ci-builds.apache.org/job/Directory/job/dir-kerby-openjdk11/ws/kerby-kerb/kerb-util/pom.xml> to org.apache.kerby/kerb-util/2.1.0-SNAPSHOT/kerb-util-2.1.0-SNAPSHOT.pom
[JENKINS] Archiving <https://ci-builds.apache.org/job/Directory/job/dir-kerby-openjdk11/ws/kerby-kerb/kerb-crypto/pom.xml> to org.apache.kerby/kerb-crypto/2.1.0-SNAPSHOT/kerb-crypto-2.1.0-SNAPSHOT.pom
[JENKINS] Archiving <https://ci-builds.apache.org/job/Directory/job/dir-kerby-openjdk11/ws/kerby-provider/token-provider/pom.xml> to org.apache.kerby/token-provider/2.1.0-SNAPSHOT/token-provider-2.1.0-SNAPSHOT.pom
[JENKINS] Archiving <https://ci-builds.apache.org/job/Directory/job/dir-kerby-openjdk11/ws/kerby-kerb/kerb-client-api-all/pom.xml> to org.apache.kerby/kerb-client-api-all/2.1.0-SNAPSHOT/kerb-client-api-all-2.1.0-SNAPSHOT.pom
[JENKINS] Archiving <https://ci-builds.apache.org/job/Directory/job/dir-kerby-openjdk11/ws/kerby-tool/client-tool/pom.xml> to org.apache.kerby/client-tool/2.1.0-SNAPSHOT/client-tool-2.1.0-SNAPSHOT.pom
[JENKINS] Archiving <https://ci-builds.apache.org/job/Directory/job/dir-kerby-openjdk11/ws/kerby-dist/pom.xml> to org.apache.kerby/kerby-dist/2.1.0-SNAPSHOT/kerby-dist-2.1.0-SNAPSHOT.pom
[JENKINS] Archiving <https://ci-builds.apache.org/job/Directory/job/dir-kerby-openjdk11/ws/bom/pom.xml> to org.apache.kerby/kerby-bom/2.1.0-SNAPSHOT/kerby-bom-2.1.0-SNAPSHOT.pom
[JENKINS] Archiving <https://ci-builds.apache.org/job/Directory/job/dir-kerby-openjdk11/ws/bom/target/kerby-bom-2.1.0-SNAPSHOT-bom.xml> to org.apache.kerby/kerby-bom/2.1.0-SNAPSHOT/kerby-bom-2.1.0-SNAPSHOT-cyclonedx.xml
[JENKINS] Archiving <https://ci-builds.apache.org/job/Directory/job/dir-kerby-openjdk11/ws/bom/target/kerby-bom-2.1.0-SNAPSHOT-bom.json> to org.apache.kerby/kerby-bom/2.1.0-SNAPSHOT/kerby-bom-2.1.0-SNAPSHOT-cyclonedx.json
[JENKINS] Archiving <https://ci-builds.apache.org/job/Directory/job/dir-kerby-openjdk11/ws/kerby-kerb/kerb-server/pom.xml> to org.apache.kerby/kerb-server/2.1.0-SNAPSHOT/kerb-server-2.1.0-SNAPSHOT.pom
[JENKINS] Archiving <https://ci-builds.apache.org/job/Directory/job/dir-kerby-openjdk11/ws/kerby-common/kerby-xdr/pom.xml> to org.apache.kerby/kerby-xdr/2.1.0-SNAPSHOT/kerby-xdr-2.1.0-SNAPSHOT.pom
[JENKINS] Archiving <https://ci-builds.apache.org/job/Directory/job/dir-kerby-openjdk11/ws/kerby-kerb/kerb-gssapi/pom.xml> to org.apache.kerby/kerb-gssapi/2.1.0-SNAPSHOT/kerb-gssapi-2.1.0-SNAPSHOT.pom
[JENKINS] Archiving <https://ci-builds.apache.org/job/Directory/job/dir-kerby-openjdk11/ws/kerby-tool/kdc-tool/pom.xml> to org.apache.kerby/kdc-tool/2.1.0-SNAPSHOT/kdc-tool-2.1.0-SNAPSHOT.pom
[JENKINS] Archiving <https://ci-builds.apache.org/job/Directory/job/dir-kerby-openjdk11/ws/kerby-kerb/kerb-admin-server/pom.xml> to org.apache.kerby/kerb-admin-server/2.1.0-SNAPSHOT/kerb-admin-server-2.1.0-SNAPSHOT.pom
[JENKINS] Archiving <https://ci-builds.apache.org/job/Directory/job/dir-kerby-openjdk11/ws/kerby-dist/kdc-dist/pom.xml> to org.apache.kerby/kdc-dist/2.1.0-SNAPSHOT/kdc-dist-2.1.0-SNAPSHOT.pom
[JENKINS] Archiving <https://ci-builds.apache.org/job/Directory/job/dir-kerby-openjdk11/ws/kerby-common/kerby-asn1/pom.xml> to org.apache.kerby/kerby-asn1/2.1.0-SNAPSHOT/kerby-asn1-2.1.0-SNAPSHOT.pom
[JENKINS] Archiving <https://ci-builds.apache.org/job/Directory/job/dir-kerby-openjdk11/ws/benchmark/pom.xml> to org.apache.kerby/benchmark/2.1.0-SNAPSHOT/benchmark-2.1.0-SNAPSHOT.pom
[JENKINS] Archiving <https://ci-builds.apache.org/job/Directory/job/dir-kerby-openjdk11/ws/kerby-common/pom.xml> to org.apache.kerby/kerby-common/2.1.0-SNAPSHOT/kerby-common-2.1.0-SNAPSHOT.pom
[JENKINS] Archiving <https://ci-builds.apache.org/job/Directory/job/dir-kerby-openjdk11/ws/kerby-common/target/kerby-common-2.1.0-SNAPSHOT-bom.xml> to org.apache.kerby/kerby-common/2.1.0-SNAPSHOT/kerby-common-2.1.0-SNAPSHOT-cyclonedx.xml
[JENKINS] Archiving <https://ci-builds.apache.org/job/Directory/job/dir-kerby-openjdk11/ws/kerby-common/target/kerby-common-2.1.0-SNAPSHOT-bom.json> to org.apache.kerby/kerby-common/2.1.0-SNAPSHOT/kerby-common-2.1.0-SNAPSHOT-cyclonedx.json
[JENKINS] Archiving <https://ci-builds.apache.org/job/Directory/job/dir-kerby-openjdk11/ws/kerby-provider/pom.xml> to org.apache.kerby/kerby-provider/2.1.0-SNAPSHOT/kerby-provider-2.1.0-SNAPSHOT.pom
[JENKINS] Archiving <https://ci-builds.apache.org/job/Directory/job/dir-kerby-openjdk11/ws/kerby-kerb/kerb-admin/pom.xml> to org.apache.kerby/kerb-admin/2.1.0-SNAPSHOT/kerb-admin-2.1.0-SNAPSHOT.pom
[JENKINS] Archiving <https://ci-builds.apache.org/job/Directory/job/dir-kerby-openjdk11/ws/kerby-kerb/integration-test/pom.xml> to org.apache.kerby/integration-test/2.1.0-SNAPSHOT/integration-test-2.1.0-SNAPSHOT.pom
[JENKINS] Archiving <https://ci-builds.apache.org/job/Directory/job/dir-kerby-openjdk11/ws/kerby-kerb/kerb-simplekdc/pom.xml> to org.apache.kerby/kerb-simplekdc/2.1.0-SNAPSHOT/kerb-simplekdc-2.1.0-SNAPSHOT.pom
[JENKINS] Archiving <https://ci-builds.apache.org/job/Directory/job/dir-kerby-openjdk11/ws/kerby-kerb/kerb-client/pom.xml> to org.apache.kerby/kerb-client/2.1.0-SNAPSHOT/kerb-client-2.1.0-SNAPSHOT.pom
[JENKINS] Archiving <https://ci-builds.apache.org/job/Directory/job/dir-kerby-openjdk11/ws/kerby-kerb/pom.xml> to org.apache.kerby/kerby-kerb/2.1.0-SNAPSHOT/kerby-kerb-2.1.0-SNAPSHOT.pom
[JENKINS] Archiving <https://ci-builds.apache.org/job/Directory/job/dir-kerby-openjdk11/ws/kerby-backend/mavibot-backend/pom.xml> to org.apache.kerby/mavibot-backend/2.1.0-SNAPSHOT/mavibot-backend-2.1.0-SNAPSHOT.pom
[JENKINS] Archiving <https://ci-builds.apache.org/job/Directory/job/dir-kerby-openjdk11/ws/kerby-backend/zookeeper-backend/pom.xml> to org.apache.kerby/zookeeper-backend/2.1.0-SNAPSHOT/zookeeper-backend-2.1.0-SNAPSHOT.pom
[JENKINS] Archiving <https://ci-builds.apache.org/job/Directory/job/dir-kerby-openjdk11/ws/kerby-common/kerby-config/pom.xml> to org.apache.kerby/kerby-config/2.1.0-SNAPSHOT/kerby-config-2.1.0-SNAPSHOT.pom
[JENKINS] Archiving <https://ci-builds.apache.org/job/Directory/job/dir-kerby-openjdk11/ws/kerby-common/kerby-util/pom.xml> to org.apache.kerby/kerby-util/2.1.0-SNAPSHOT/kerby-util-2.1.0-SNAPSHOT.pom
[JENKINS] Archiving <https://ci-builds.apache.org/job/Directory/job/dir-kerby-openjdk11/ws/kerby-kerb/kerb-common/pom.xml> to org.apache.kerby/kerb-common/2.1.0-SNAPSHOT/kerb-common-2.1.0-SNAPSHOT.pom
[JENKINS] Archiving <https://ci-builds.apache.org/job/Directory/job/dir-kerby-openjdk11/ws/kerby-kerb/kerb-core/pom.xml> to org.apache.kerby/kerb-core/2.1.0-SNAPSHOT/kerb-core-2.1.0-SNAPSHOT.pom
[JENKINS] Archiving <https://ci-builds.apache.org/job/Directory/job/dir-kerby-openjdk11/ws/kerby-kdc/pom.xml> to org.apache.kerby/kerby-kdc/2.1.0-SNAPSHOT/kerby-kdc-2.1.0-SNAPSHOT.pom
[JENKINS] Archiving <https://ci-builds.apache.org/job/Directory/job/dir-kerby-openjdk11/ws/kerby-kerb/kerb-identity/pom.xml> to org.apache.kerby/kerb-identity/2.1.0-SNAPSHOT/kerb-identity-2.1.0-SNAPSHOT.pom
[JENKINS] Archiving <https://ci-builds.apache.org/job/Directory/job/dir-kerby-openjdk11/ws/kerby-backend/pom.xml> to org.apache.kerby/kerby-backend/2.1.0-SNAPSHOT/kerby-backend-2.1.0-SNAPSHOT.pom
[JENKINS] Archiving <https://ci-builds.apache.org/job/Directory/job/dir-kerby-openjdk11/ws/kerby-tool/pom.xml> to org.apache.kerby/kerby-tool/2.1.0-SNAPSHOT/kerby-tool-2.1.0-SNAPSHOT.pom
[JENKINS] Archiving <https://ci-builds.apache.org/job/Directory/job/dir-kerby-openjdk11/ws/pom.xml> to org.apache.kerby/kerby-all/2.1.0-SNAPSHOT/kerby-all-2.1.0-SNAPSHOT.pom
[JENKINS] Archiving <https://ci-builds.apache.org/job/Directory/job/dir-kerby-openjdk11/ws/target/kerby-all-2.1.0-SNAPSHOT-bom.xml> to org.apache.kerby/kerby-all/2.1.0-SNAPSHOT/kerby-all-2.1.0-SNAPSHOT-cyclonedx.xml
[JENKINS] Archiving <https://ci-builds.apache.org/job/Directory/job/dir-kerby-openjdk11/ws/target/kerby-all-2.1.0-SNAPSHOT-bom.json> to org.apache.kerby/kerby-all/2.1.0-SNAPSHOT/kerby-all-2.1.0-SNAPSHOT-cyclonedx.json
[JENKINS] Archiving <https://ci-builds.apache.org/job/Directory/job/dir-kerby-openjdk11/ws/parent/pom.xml> to org.apache.kerby/kerby-parent/2.1.0-SNAPSHOT/kerby-parent-2.1.0-SNAPSHOT.pom
[JENKINS] Archiving <https://ci-builds.apache.org/job/Directory/job/dir-kerby-openjdk11/ws/parent/target/kerby-parent-2.1.0-SNAPSHOT-bom.xml> to org.apache.kerby/kerby-parent/2.1.0-SNAPSHOT/kerby-parent-2.1.0-SNAPSHOT-cyclonedx.xml
[JENKINS] Archiving <https://ci-builds.apache.org/job/Directory/job/dir-kerby-openjdk11/ws/parent/target/kerby-parent-2.1.0-SNAPSHOT-bom.json> to org.apache.kerby/kerby-parent/2.1.0-SNAPSHOT/kerby-parent-2.1.0-SNAPSHOT-cyclonedx.json
[JENKINS] Archiving <https://ci-builds.apache.org/job/Directory/job/dir-kerby-openjdk11/ws/kerby-kerb/kerb-kdc-test/pom.xml> to org.apache.kerby/kerb-kdc-test/2.1.0-SNAPSHOT/kerb-kdc-test-2.1.0-SNAPSHOT.pom
[JENKINS] Archiving <https://ci-builds.apache.org/job/Directory/job/dir-kerby-openjdk11/ws/kerby-dist/tool-dist/pom.xml> to org.apache.kerby/tool-dist/2.1.0-SNAPSHOT/tool-dist-2.1.0-SNAPSHOT.pom
[JENKINS] Archiving <https://ci-builds.apache.org/job/Directory/job/dir-kerby-openjdk11/ws/kerby-kerb/kerb-identity-test/pom.xml> to org.apache.kerby/kerb-identity-test/2.1.0-SNAPSHOT/kerb-identity-test-2.1.0-SNAPSHOT.pom
[JENKINS] Archiving <https://ci-builds.apache.org/job/Directory/job/dir-kerby-openjdk11/ws/kerby-kerb/kerb-server-api-all/pom.xml> to org.apache.kerby/kerb-server-api-all/2.1.0-SNAPSHOT/kerb-server-api-all-2.1.0-SNAPSHOT.pom
channel stopped
Build failed in Jenkins: Directory » dir-kerby-openjdk11 #391
Posted by Apache Jenkins Server <je...@builds.apache.org>.
See <https://ci-builds.apache.org/job/Directory/job/dir-kerby-openjdk11/391/display/redirect?page=changes>
Changes:
[github] Bump org.gaul:modernizer-maven-plugin from 2.7.0 to 2.9.0
[github] Bump org.codehaus.mojo:exec-maven-plugin from 3.2.0 to 3.3.0
[github] Bump github/codeql-action from 3.25.5 to 3.25.6
[github] Bump org.jboss.xnio:xnio-api from 3.8.14.Final to 3.8.15.Final
------------------------------------------
[...truncated 48.71 KB...]
[INFO] Preparing remote bundle org.apache.apache.resources:apache-jar-resource-bundle:1.5
[INFO] Copying 3 resources from 1 bundle.
[INFO]
[INFO] --- resources:3.3.1:resources (default-resources) @ kerby-asn1 ---
[INFO] skip non existing resourceDirectory <https://ci-builds.apache.org/job/Directory/job/dir-kerby-openjdk11/ws/kerby-common/kerby-asn1/src/main/resources>
[INFO] Copying 3 resources from target/maven-shared-archive-resources to target/classes
[INFO]
[INFO] --- compiler:3.13.0:compile (default-compile) @ kerby-asn1 ---
[INFO] Recompiling the module because of changed source code.
[INFO] Compiling 69 source files with javac [debug release 7] to target/classes
[INFO] <https://ci-builds.apache.org/job/Directory/job/dir-kerby-openjdk11/ws/kerby-common/kerby-asn1/src/main/java/org/apache/kerby/asn1/type/Asn1Any.java>: Some input files use unchecked or unsafe operations.
[INFO] <https://ci-builds.apache.org/job/Directory/job/dir-kerby-openjdk11/ws/kerby-common/kerby-asn1/src/main/java/org/apache/kerby/asn1/type/Asn1Any.java>: Recompile with -Xlint:unchecked for details.
[INFO]
[INFO] --- resources:3.3.1:testResources (default-testResources) @ kerby-asn1 ---
[INFO] Copying 5 resources from src/test/resources to target/test-classes
[INFO] Copying 3 resources from target/maven-shared-archive-resources to target/test-classes
[INFO]
[INFO] --- compiler:3.13.0:testCompile (default-testCompile) @ kerby-asn1 ---
[INFO] Recompiling the module because of changed dependency.
[INFO] Compiling 15 source files with javac [debug release 7] to target/test-classes
[INFO] -------------------------------------------------------------
[ERROR] COMPILATION ERROR :
[INFO] -------------------------------------------------------------
[ERROR] <https://ci-builds.apache.org/job/Directory/job/dir-kerby-openjdk11/ws/kerby-common/kerby-asn1/src/test/java/org/apache/kerby/asn1/Asn1BooleanTest.java>:[48,9] cannot access java.util.function.Predicate
class file for java.util.function.Predicate not found
[ERROR] <https://ci-builds.apache.org/job/Directory/job/dir-kerby-openjdk11/ws/kerby-common/kerby-asn1/src/test/java/org/apache/kerby/asn1/Asn1BooleanTest.java>:[68,9] cannot access java.util.function.IntPredicate
class file for java.util.function.IntPredicate not found
[ERROR] <https://ci-builds.apache.org/job/Directory/job/dir-kerby-openjdk11/ws/kerby-common/kerby-asn1/src/test/java/org/apache/kerby/asn1/Asn1CollectionTest.java>:[46,9] cannot access java.util.function.LongPredicate
class file for java.util.function.LongPredicate not found
[ERROR] <https://ci-builds.apache.org/job/Directory/job/dir-kerby-openjdk11/ws/kerby-common/kerby-asn1/src/test/java/org/apache/kerby/asn1/Asn1CollectionTest.java>:[55,9] cannot access java.util.function.DoublePredicate
class file for java.util.function.DoublePredicate not found
[ERROR] <https://ci-builds.apache.org/job/Directory/job/dir-kerby-openjdk11/ws/kerby-common/kerby-asn1/src/test/java/org/apache/kerby/asn1/Asn1CollectionTest.java>:[58,9] cannot access java.util.concurrent.CompletableFuture
class file for java.util.concurrent.CompletableFuture not found
[ERROR] <https://ci-builds.apache.org/job/Directory/job/dir-kerby-openjdk11/ws/kerby-common/kerby-asn1/src/test/java/org/apache/kerby/asn1/Asn1DumpTest.java>:[39,23] cannot access java.util.function.Supplier
class file for java.util.function.Supplier not found
[ERROR] <https://ci-builds.apache.org/job/Directory/job/dir-kerby-openjdk11/ws/kerby-common/kerby-asn1/src/test/java/org/apache/kerby/asn1/Asn1FlagsTest.java>:[106,5] cannot access java.util.function.BooleanSupplier
class file for java.util.function.BooleanSupplier not found
[ERROR] <https://ci-builds.apache.org/job/Directory/job/dir-kerby-openjdk11/ws/kerby-common/kerby-asn1/src/test/java/org/apache/kerby/asn1/Asn1GeneralizedTimeTest.java>:[66,9] cannot access java.util.concurrent.CompletionStage
class file for java.util.concurrent.CompletionStage not found
[ERROR] <https://ci-builds.apache.org/job/Directory/job/dir-kerby-openjdk11/ws/kerby-common/kerby-asn1/src/test/java/org/apache/kerby/asn1/Asn1IntegerTest.java>:[50,9] cannot access java.util.Optional
class file for java.util.Optional not found
[ERROR] <https://ci-builds.apache.org/job/Directory/job/dir-kerby-openjdk11/ws/kerby-common/kerby-asn1/src/test/java/org/apache/kerby/asn1/Asn1IntegerTest.java>:[70,9] cannot access java.util.OptionalDouble
class file for java.util.OptionalDouble not found
[ERROR] <https://ci-builds.apache.org/job/Directory/job/dir-kerby-openjdk11/ws/kerby-common/kerby-asn1/src/test/java/org/apache/kerby/asn1/Asn1ObjectIdentifierTest.java>:[51,9] cannot access java.util.OptionalInt
class file for java.util.OptionalInt not found
[ERROR] <https://ci-builds.apache.org/job/Directory/job/dir-kerby-openjdk11/ws/kerby-common/kerby-asn1/src/test/java/org/apache/kerby/asn1/Asn1ObjectIdentifierTest.java>:[64,9] cannot access java.util.OptionalLong
class file for java.util.OptionalLong not found
[ERROR] <https://ci-builds.apache.org/job/Directory/job/dir-kerby-openjdk11/ws/kerby-common/kerby-asn1/src/test/java/org/apache/kerby/asn1/Asn1UtcTimeTest.java>:[76,9] cannot access java.time.ZonedDateTime
class file for java.time.ZonedDateTime not found
[ERROR] <https://ci-builds.apache.org/job/Directory/job/dir-kerby-openjdk11/ws/kerby-common/kerby-asn1/src/test/java/org/apache/kerby/asn1/Asn1UtcTimeTest.java>:[92,9] cannot access java.time.LocalDateTime
class file for java.time.LocalDateTime not found
[ERROR] <https://ci-builds.apache.org/job/Directory/job/dir-kerby-openjdk11/ws/kerby-common/kerby-asn1/src/test/java/org/apache/kerby/asn1/Asn1Utf8StringTest.java>:[43,9] cannot access java.time.OffsetDateTime
class file for java.time.OffsetDateTime not found
[ERROR] <https://ci-builds.apache.org/job/Directory/job/dir-kerby-openjdk11/ws/kerby-common/kerby-asn1/src/test/java/org/apache/kerby/asn1/Asn1Utf8StringTest.java>:[44,9] cannot access java.time.OffsetTime
class file for java.time.OffsetTime not found
[ERROR] <https://ci-builds.apache.org/job/Directory/job/dir-kerby-openjdk11/ws/kerby-common/kerby-asn1/src/test/java/org/apache/kerby/asn1/Asn1Utf8StringTest.java>:[57,9] cannot access java.time.LocalTime
class file for java.time.LocalTime not found
[ERROR] <https://ci-builds.apache.org/job/Directory/job/dir-kerby-openjdk11/ws/kerby-common/kerby-asn1/src/test/java/org/apache/kerby/asn1/Asn1Utf8StringTest.java>:[58,9] cannot access java.time.LocalDate
class file for java.time.LocalDate not found
[ERROR] <https://ci-builds.apache.org/job/Directory/job/dir-kerby-openjdk11/ws/kerby-common/kerby-asn1/src/test/java/org/apache/kerby/asn1/PersonnelRecordTest.java>:[72,9] cannot access java.time.Instant
class file for java.time.Instant not found
[ERROR] <https://ci-builds.apache.org/job/Directory/job/dir-kerby-openjdk11/ws/kerby-common/kerby-asn1/src/test/java/org/apache/kerby/asn1/PersonnelRecordTest.java>:[84,9] cannot access java.time.Duration
class file for java.time.Duration not found
[ERROR] <https://ci-builds.apache.org/job/Directory/job/dir-kerby-openjdk11/ws/kerby-common/kerby-asn1/src/test/java/org/apache/kerby/asn1/PersonnelRecordTest.java>:[86,9] cannot access java.time.Period
class file for java.time.Period not found
[ERROR] <https://ci-builds.apache.org/job/Directory/job/dir-kerby-openjdk11/ws/kerby-common/kerby-asn1/src/test/java/org/apache/kerby/asn1/PersonnelRecordTest.java>:[88,9] cannot access java.util.concurrent.atomic.LongAdder
class file for java.util.concurrent.atomic.LongAdder not found
[ERROR] <https://ci-builds.apache.org/job/Directory/job/dir-kerby-openjdk11/ws/kerby-common/kerby-asn1/src/test/java/org/apache/kerby/asn1/PersonnelRecordTest.java>:[90,9] cannot access java.util.stream.Stream
class file for java.util.stream.Stream not found
[ERROR] <https://ci-builds.apache.org/job/Directory/job/dir-kerby-openjdk11/ws/kerby-common/kerby-asn1/src/test/java/org/apache/kerby/asn1/PersonnelRecordTest.java>:[92,9] cannot access java.util.stream.DoubleStream
class file for java.util.stream.DoubleStream not found
[ERROR] <https://ci-builds.apache.org/job/Directory/job/dir-kerby-openjdk11/ws/kerby-common/kerby-asn1/src/test/java/org/apache/kerby/asn1/PersonnelRecordTest.java>:[94,9] cannot access java.util.stream.LongStream
class file for java.util.stream.LongStream not found
[ERROR] <https://ci-builds.apache.org/job/Directory/job/dir-kerby-openjdk11/ws/kerby-common/kerby-asn1/src/test/java/org/apache/kerby/asn1/PersonnelRecordTest.java>:[96,9] cannot access java.util.stream.IntStream
class file for java.util.stream.IntStream not found
[ERROR] <https://ci-builds.apache.org/job/Directory/job/dir-kerby-openjdk11/ws/kerby-common/kerby-asn1/src/test/java/org/apache/kerby/asn1/PersonnelRecordTest.java>:[98,9] cannot access java.util.Spliterator
class file for java.util.Spliterator not found
[INFO] 27 errors
[INFO] -------------------------------------------------------------
[INFO] ------------------------------------------------------------------------
[INFO] Reactor Summary for Apache Kerby Project 2.1.0-SNAPSHOT:
[INFO]
[INFO] Apache Kerby Project ............................... SUCCESS [ 53.998 s]
[INFO] Apache Kerby BOM ................................... SUCCESS [ 7.211 s]
[INFO] Apache Directory Kerby Parent pom .................. SUCCESS [ 6.875 s]
[INFO] Kerby-common Project ............................... SUCCESS [ 6.838 s]
[INFO] Kerby ASN1 Project ................................. FAILURE [ 13.881 s]
[INFO] Kerby Config ....................................... SKIPPED
[INFO] Kerby Util ......................................... SKIPPED
[INFO] Kerby XDR Project .................................. SKIPPED
[INFO] Kerby PKIX Project ................................. SKIPPED
[INFO] Kerby-kerb Project ................................. SKIPPED
[INFO] Kerby-kerb core .................................... SKIPPED
[INFO] Kerby-kerb Crypto .................................. SKIPPED
[INFO] Kerby-kerb Common .................................. SKIPPED
[INFO] Kerby-kerb Util .................................... SKIPPED
[INFO] Kerby-kerb Identity ................................ SKIPPED
[INFO] Kerby-kerb Identity Test ........................... SKIPPED
[INFO] Kerby providers .................................... SKIPPED
[INFO] Token provider ..................................... SKIPPED
[INFO] Kerby-kerb Client .................................. SKIPPED
[INFO] Kerby-kerb Server .................................. SKIPPED
[INFO] Kerby-kerb Admin ................................... SKIPPED
[INFO] Kerb Simple Kdc .................................... SKIPPED
[INFO] Kerby-kerb server all .............................. SKIPPED
[INFO] Kerby KDC Server ................................... SKIPPED
[INFO] Kerb Kdc Test ...................................... SKIPPED
[INFO] Kerby-kerb GssAPI .................................. SKIPPED
[INFO] Kerb Integration Test .............................. SKIPPED
[INFO] Kerby Backend ...................................... SKIPPED
[INFO] Zookeeper identity backend ......................... SKIPPED
[INFO] Kerby-kerb Admin Server ............................ SKIPPED
[INFO] Kerby-kerb client api all .......................... SKIPPED
[INFO] Json identity backend .............................. SKIPPED
[INFO] Kerby Kdc Test ..................................... SKIPPED
[INFO] Ldap identity backend .............................. SKIPPED
[INFO] Mavibot based backend .............................. SKIPPED
[INFO] MySQL identity backend ............................. SKIPPED
[INFO] Kerby benchmark .................................... SKIPPED
[INFO] Kdc Tool Project ................................... SKIPPED
[INFO] Client Tool ........................................ SKIPPED
[INFO] KDC Tool ........................................... SKIPPED
[INFO] Kerby Distribution ................................. SKIPPED
[INFO] KDC Dist ........................................... SKIPPED
[INFO] Tool Dist .......................................... SKIPPED
[INFO] ------------------------------------------------------------------------
[INFO] BUILD FAILURE
[INFO] ------------------------------------------------------------------------
[INFO] Total time: 02:30 min
[INFO] Finished at: 2024-05-28T13:25:31Z
[INFO] ------------------------------------------------------------------------
Waiting for Jenkins to finish collecting data
[ERROR] Failed to execute goal org.apache.maven.plugins:maven-compiler-plugin:3.13.0:testCompile (default-testCompile) on project kerby-asn1: Compilation failure: Compilation failure:
[ERROR] <https://ci-builds.apache.org/job/Directory/job/dir-kerby-openjdk11/ws/kerby-common/kerby-asn1/src/test/java/org/apache/kerby/asn1/Asn1BooleanTest.java>:[48,9] cannot access java.util.function.Predicate
[ERROR] class file for java.util.function.Predicate not found
[ERROR] <https://ci-builds.apache.org/job/Directory/job/dir-kerby-openjdk11/ws/kerby-common/kerby-asn1/src/test/java/org/apache/kerby/asn1/Asn1BooleanTest.java>:[68,9] cannot access java.util.function.IntPredicate
[ERROR] class file for java.util.function.IntPredicate not found
[ERROR] <https://ci-builds.apache.org/job/Directory/job/dir-kerby-openjdk11/ws/kerby-common/kerby-asn1/src/test/java/org/apache/kerby/asn1/Asn1CollectionTest.java>:[46,9] cannot access java.util.function.LongPredicate
[ERROR] class file for java.util.function.LongPredicate not found
[ERROR] <https://ci-builds.apache.org/job/Directory/job/dir-kerby-openjdk11/ws/kerby-common/kerby-asn1/src/test/java/org/apache/kerby/asn1/Asn1CollectionTest.java>:[55,9] cannot access java.util.function.DoublePredicate
[ERROR] class file for java.util.function.DoublePredicate not found
[ERROR] <https://ci-builds.apache.org/job/Directory/job/dir-kerby-openjdk11/ws/kerby-common/kerby-asn1/src/test/java/org/apache/kerby/asn1/Asn1CollectionTest.java>:[58,9] cannot access java.util.concurrent.CompletableFuture
[ERROR] class file for java.util.concurrent.CompletableFuture not found
[ERROR] <https://ci-builds.apache.org/job/Directory/job/dir-kerby-openjdk11/ws/kerby-common/kerby-asn1/src/test/java/org/apache/kerby/asn1/Asn1DumpTest.java>:[39,23] cannot access java.util.function.Supplier
[ERROR] class file for java.util.function.Supplier not found
[ERROR] <https://ci-builds.apache.org/job/Directory/job/dir-kerby-openjdk11/ws/kerby-common/kerby-asn1/src/test/java/org/apache/kerby/asn1/Asn1FlagsTest.java>:[106,5] cannot access java.util.function.BooleanSupplier
[ERROR] class file for java.util.function.BooleanSupplier not found
[ERROR] <https://ci-builds.apache.org/job/Directory/job/dir-kerby-openjdk11/ws/kerby-common/kerby-asn1/src/test/java/org/apache/kerby/asn1/Asn1GeneralizedTimeTest.java>:[66,9] cannot access java.util.concurrent.CompletionStage
[ERROR] class file for java.util.concurrent.CompletionStage not found
[ERROR] <https://ci-builds.apache.org/job/Directory/job/dir-kerby-openjdk11/ws/kerby-common/kerby-asn1/src/test/java/org/apache/kerby/asn1/Asn1IntegerTest.java>:[50,9] cannot access java.util.Optional
[ERROR] class file for java.util.Optional not found
[ERROR] <https://ci-builds.apache.org/job/Directory/job/dir-kerby-openjdk11/ws/kerby-common/kerby-asn1/src/test/java/org/apache/kerby/asn1/Asn1IntegerTest.java>:[70,9] cannot access java.util.OptionalDouble
[ERROR] class file for java.util.OptionalDouble not found
[ERROR] <https://ci-builds.apache.org/job/Directory/job/dir-kerby-openjdk11/ws/kerby-common/kerby-asn1/src/test/java/org/apache/kerby/asn1/Asn1ObjectIdentifierTest.java>:[51,9] cannot access java.util.OptionalInt
[ERROR] class file for java.util.OptionalInt not found
[ERROR] <https://ci-builds.apache.org/job/Directory/job/dir-kerby-openjdk11/ws/kerby-common/kerby-asn1/src/test/java/org/apache/kerby/asn1/Asn1ObjectIdentifierTest.java>:[64,9] cannot access java.util.OptionalLong
[ERROR] class file for java.util.OptionalLong not found
[ERROR] <https://ci-builds.apache.org/job/Directory/job/dir-kerby-openjdk11/ws/kerby-common/kerby-asn1/src/test/java/org/apache/kerby/asn1/Asn1UtcTimeTest.java>:[76,9] cannot access java.time.ZonedDateTime
[ERROR] class file for java.time.ZonedDateTime not found
[ERROR] <https://ci-builds.apache.org/job/Directory/job/dir-kerby-openjdk11/ws/kerby-common/kerby-asn1/src/test/java/org/apache/kerby/asn1/Asn1UtcTimeTest.java>:[92,9] cannot access java.time.LocalDateTime
[ERROR] class file for java.time.LocalDateTime not found
[ERROR] <https://ci-builds.apache.org/job/Directory/job/dir-kerby-openjdk11/ws/kerby-common/kerby-asn1/src/test/java/org/apache/kerby/asn1/Asn1Utf8StringTest.java>:[43,9] cannot access java.time.OffsetDateTime
[ERROR] class file for java.time.OffsetDateTime not found
[ERROR] <https://ci-builds.apache.org/job/Directory/job/dir-kerby-openjdk11/ws/kerby-common/kerby-asn1/src/test/java/org/apache/kerby/asn1/Asn1Utf8StringTest.java>:[44,9] cannot access java.time.OffsetTime
[ERROR] class file for java.time.OffsetTime not found
[ERROR] <https://ci-builds.apache.org/job/Directory/job/dir-kerby-openjdk11/ws/kerby-common/kerby-asn1/src/test/java/org/apache/kerby/asn1/Asn1Utf8StringTest.java>:[57,9] cannot access java.time.LocalTime
[ERROR] class file for java.time.LocalTime not found
[ERROR] <https://ci-builds.apache.org/job/Directory/job/dir-kerby-openjdk11/ws/kerby-common/kerby-asn1/src/test/java/org/apache/kerby/asn1/Asn1Utf8StringTest.java>:[58,9] cannot access java.time.LocalDate
[ERROR] class file for java.time.LocalDate not found
[ERROR] <https://ci-builds.apache.org/job/Directory/job/dir-kerby-openjdk11/ws/kerby-common/kerby-asn1/src/test/java/org/apache/kerby/asn1/PersonnelRecordTest.java>:[72,9] cannot access java.time.Instant
[ERROR] class file for java.time.Instant not found
[ERROR] <https://ci-builds.apache.org/job/Directory/job/dir-kerby-openjdk11/ws/kerby-common/kerby-asn1/src/test/java/org/apache/kerby/asn1/PersonnelRecordTest.java>:[84,9] cannot access java.time.Duration
[ERROR] class file for java.time.Duration not found
[ERROR] <https://ci-builds.apache.org/job/Directory/job/dir-kerby-openjdk11/ws/kerby-common/kerby-asn1/src/test/java/org/apache/kerby/asn1/PersonnelRecordTest.java>:[86,9] cannot access java.time.Period
[ERROR] class file for java.time.Period not found
[ERROR] <https://ci-builds.apache.org/job/Directory/job/dir-kerby-openjdk11/ws/kerby-common/kerby-asn1/src/test/java/org/apache/kerby/asn1/PersonnelRecordTest.java>:[88,9] cannot access java.util.concurrent.atomic.LongAdder
[ERROR] class file for java.util.concurrent.atomic.LongAdder not found
[ERROR] <https://ci-builds.apache.org/job/Directory/job/dir-kerby-openjdk11/ws/kerby-common/kerby-asn1/src/test/java/org/apache/kerby/asn1/PersonnelRecordTest.java>:[90,9] cannot access java.util.stream.Stream
[ERROR] class file for java.util.stream.Stream not found
[ERROR] <https://ci-builds.apache.org/job/Directory/job/dir-kerby-openjdk11/ws/kerby-common/kerby-asn1/src/test/java/org/apache/kerby/asn1/PersonnelRecordTest.java>:[92,9] cannot access java.util.stream.DoubleStream
[ERROR] class file for java.util.stream.DoubleStream not found
[ERROR] <https://ci-builds.apache.org/job/Directory/job/dir-kerby-openjdk11/ws/kerby-common/kerby-asn1/src/test/java/org/apache/kerby/asn1/PersonnelRecordTest.java>:[94,9] cannot access java.util.stream.LongStream
[ERROR] class file for java.util.stream.LongStream not found
[ERROR] <https://ci-builds.apache.org/job/Directory/job/dir-kerby-openjdk11/ws/kerby-common/kerby-asn1/src/test/java/org/apache/kerby/asn1/PersonnelRecordTest.java>:[96,9] cannot access java.util.stream.IntStream
[ERROR] class file for java.util.stream.IntStream not found
[ERROR] <https://ci-builds.apache.org/job/Directory/job/dir-kerby-openjdk11/ws/kerby-common/kerby-asn1/src/test/java/org/apache/kerby/asn1/PersonnelRecordTest.java>:[98,9] cannot access java.util.Spliterator
[ERROR] class file for java.util.Spliterator not found
[ERROR] -> [Help 1]
[ERROR]
[ERROR] To see the full stack trace of the errors, re-run Maven with the -e switch.
[ERROR] Re-run Maven using the -X switch to enable full debug logging.
[ERROR]
[ERROR] For more information about the errors and possible solutions, please read the following articles:
[ERROR] [Help 1] http://cwiki.apache.org/confluence/display/MAVEN/MojoFailureException
[ERROR]
[ERROR] After correcting the problems, you can resume the build with the command
[ERROR] mvn <goals> -rf :kerby-asn1
[JENKINS] Archiving <https://ci-builds.apache.org/job/Directory/job/dir-kerby-openjdk11/ws/kerby-backend/mysql-backend/pom.xml> to org.apache.kerby/mysql-backend/2.1.0-SNAPSHOT/mysql-backend-2.1.0-SNAPSHOT.pom
[JENKINS] Archiving <https://ci-builds.apache.org/job/Directory/job/dir-kerby-openjdk11/ws/kerby-backend/json-backend/pom.xml> to org.apache.kerby/json-backend/2.1.0-SNAPSHOT/json-backend-2.1.0-SNAPSHOT.pom
[JENKINS] Archiving <https://ci-builds.apache.org/job/Directory/job/dir-kerby-openjdk11/ws/kerby-backend/ldap-backend/pom.xml> to org.apache.kerby/ldap-backend/2.1.0-SNAPSHOT/ldap-backend-2.1.0-SNAPSHOT.pom
[JENKINS] Archiving <https://ci-builds.apache.org/job/Directory/job/dir-kerby-openjdk11/ws/kerby-pkix/pom.xml> to org.apache.kerby/kerby-pkix/2.1.0-SNAPSHOT/kerby-pkix-2.1.0-SNAPSHOT.pom
[JENKINS] Archiving <https://ci-builds.apache.org/job/Directory/job/dir-kerby-openjdk11/ws/kerby-kdc-test/pom.xml> to org.apache.kerby/kerby-kdc-test/2.1.0-SNAPSHOT/kerby-kdc-test-2.1.0-SNAPSHOT.pom
[JENKINS] Archiving <https://ci-builds.apache.org/job/Directory/job/dir-kerby-openjdk11/ws/kerby-kerb/kerb-util/pom.xml> to org.apache.kerby/kerb-util/2.1.0-SNAPSHOT/kerb-util-2.1.0-SNAPSHOT.pom
[JENKINS] Archiving <https://ci-builds.apache.org/job/Directory/job/dir-kerby-openjdk11/ws/kerby-kerb/kerb-crypto/pom.xml> to org.apache.kerby/kerb-crypto/2.1.0-SNAPSHOT/kerb-crypto-2.1.0-SNAPSHOT.pom
[JENKINS] Archiving <https://ci-builds.apache.org/job/Directory/job/dir-kerby-openjdk11/ws/kerby-provider/token-provider/pom.xml> to org.apache.kerby/token-provider/2.1.0-SNAPSHOT/token-provider-2.1.0-SNAPSHOT.pom
[JENKINS] Archiving <https://ci-builds.apache.org/job/Directory/job/dir-kerby-openjdk11/ws/kerby-kerb/kerb-client-api-all/pom.xml> to org.apache.kerby/kerb-client-api-all/2.1.0-SNAPSHOT/kerb-client-api-all-2.1.0-SNAPSHOT.pom
[JENKINS] Archiving <https://ci-builds.apache.org/job/Directory/job/dir-kerby-openjdk11/ws/kerby-tool/client-tool/pom.xml> to org.apache.kerby/client-tool/2.1.0-SNAPSHOT/client-tool-2.1.0-SNAPSHOT.pom
[JENKINS] Archiving <https://ci-builds.apache.org/job/Directory/job/dir-kerby-openjdk11/ws/kerby-dist/pom.xml> to org.apache.kerby/kerby-dist/2.1.0-SNAPSHOT/kerby-dist-2.1.0-SNAPSHOT.pom
[JENKINS] Archiving <https://ci-builds.apache.org/job/Directory/job/dir-kerby-openjdk11/ws/bom/pom.xml> to org.apache.kerby/kerby-bom/2.1.0-SNAPSHOT/kerby-bom-2.1.0-SNAPSHOT.pom
[JENKINS] Archiving <https://ci-builds.apache.org/job/Directory/job/dir-kerby-openjdk11/ws/bom/target/kerby-bom-2.1.0-SNAPSHOT-bom.xml> to org.apache.kerby/kerby-bom/2.1.0-SNAPSHOT/kerby-bom-2.1.0-SNAPSHOT-cyclonedx.xml
[JENKINS] Archiving <https://ci-builds.apache.org/job/Directory/job/dir-kerby-openjdk11/ws/bom/target/kerby-bom-2.1.0-SNAPSHOT-bom.json> to org.apache.kerby/kerby-bom/2.1.0-SNAPSHOT/kerby-bom-2.1.0-SNAPSHOT-cyclonedx.json
[JENKINS] Archiving <https://ci-builds.apache.org/job/Directory/job/dir-kerby-openjdk11/ws/kerby-kerb/kerb-server/pom.xml> to org.apache.kerby/kerb-server/2.1.0-SNAPSHOT/kerb-server-2.1.0-SNAPSHOT.pom
[JENKINS] Archiving <https://ci-builds.apache.org/job/Directory/job/dir-kerby-openjdk11/ws/kerby-common/kerby-xdr/pom.xml> to org.apache.kerby/kerby-xdr/2.1.0-SNAPSHOT/kerby-xdr-2.1.0-SNAPSHOT.pom
[JENKINS] Archiving <https://ci-builds.apache.org/job/Directory/job/dir-kerby-openjdk11/ws/kerby-kerb/kerb-gssapi/pom.xml> to org.apache.kerby/kerb-gssapi/2.1.0-SNAPSHOT/kerb-gssapi-2.1.0-SNAPSHOT.pom
[JENKINS] Archiving <https://ci-builds.apache.org/job/Directory/job/dir-kerby-openjdk11/ws/kerby-tool/kdc-tool/pom.xml> to org.apache.kerby/kdc-tool/2.1.0-SNAPSHOT/kdc-tool-2.1.0-SNAPSHOT.pom
[JENKINS] Archiving <https://ci-builds.apache.org/job/Directory/job/dir-kerby-openjdk11/ws/kerby-kerb/kerb-admin-server/pom.xml> to org.apache.kerby/kerb-admin-server/2.1.0-SNAPSHOT/kerb-admin-server-2.1.0-SNAPSHOT.pom
[JENKINS] Archiving <https://ci-builds.apache.org/job/Directory/job/dir-kerby-openjdk11/ws/kerby-dist/kdc-dist/pom.xml> to org.apache.kerby/kdc-dist/2.1.0-SNAPSHOT/kdc-dist-2.1.0-SNAPSHOT.pom
[JENKINS] Archiving <https://ci-builds.apache.org/job/Directory/job/dir-kerby-openjdk11/ws/kerby-common/kerby-asn1/pom.xml> to org.apache.kerby/kerby-asn1/2.1.0-SNAPSHOT/kerby-asn1-2.1.0-SNAPSHOT.pom
[JENKINS] Archiving <https://ci-builds.apache.org/job/Directory/job/dir-kerby-openjdk11/ws/benchmark/pom.xml> to org.apache.kerby/benchmark/2.1.0-SNAPSHOT/benchmark-2.1.0-SNAPSHOT.pom
[JENKINS] Archiving <https://ci-builds.apache.org/job/Directory/job/dir-kerby-openjdk11/ws/kerby-common/pom.xml> to org.apache.kerby/kerby-common/2.1.0-SNAPSHOT/kerby-common-2.1.0-SNAPSHOT.pom
[JENKINS] Archiving <https://ci-builds.apache.org/job/Directory/job/dir-kerby-openjdk11/ws/kerby-common/target/kerby-common-2.1.0-SNAPSHOT-bom.xml> to org.apache.kerby/kerby-common/2.1.0-SNAPSHOT/kerby-common-2.1.0-SNAPSHOT-cyclonedx.xml
[JENKINS] Archiving <https://ci-builds.apache.org/job/Directory/job/dir-kerby-openjdk11/ws/kerby-common/target/kerby-common-2.1.0-SNAPSHOT-bom.json> to org.apache.kerby/kerby-common/2.1.0-SNAPSHOT/kerby-common-2.1.0-SNAPSHOT-cyclonedx.json
[JENKINS] Archiving <https://ci-builds.apache.org/job/Directory/job/dir-kerby-openjdk11/ws/kerby-provider/pom.xml> to org.apache.kerby/kerby-provider/2.1.0-SNAPSHOT/kerby-provider-2.1.0-SNAPSHOT.pom
[JENKINS] Archiving <https://ci-builds.apache.org/job/Directory/job/dir-kerby-openjdk11/ws/kerby-kerb/kerb-admin/pom.xml> to org.apache.kerby/kerb-admin/2.1.0-SNAPSHOT/kerb-admin-2.1.0-SNAPSHOT.pom
[JENKINS] Archiving <https://ci-builds.apache.org/job/Directory/job/dir-kerby-openjdk11/ws/kerby-kerb/integration-test/pom.xml> to org.apache.kerby/integration-test/2.1.0-SNAPSHOT/integration-test-2.1.0-SNAPSHOT.pom
[JENKINS] Archiving <https://ci-builds.apache.org/job/Directory/job/dir-kerby-openjdk11/ws/kerby-kerb/kerb-simplekdc/pom.xml> to org.apache.kerby/kerb-simplekdc/2.1.0-SNAPSHOT/kerb-simplekdc-2.1.0-SNAPSHOT.pom
[JENKINS] Archiving <https://ci-builds.apache.org/job/Directory/job/dir-kerby-openjdk11/ws/kerby-kerb/kerb-client/pom.xml> to org.apache.kerby/kerb-client/2.1.0-SNAPSHOT/kerb-client-2.1.0-SNAPSHOT.pom
[JENKINS] Archiving <https://ci-builds.apache.org/job/Directory/job/dir-kerby-openjdk11/ws/kerby-kerb/pom.xml> to org.apache.kerby/kerby-kerb/2.1.0-SNAPSHOT/kerby-kerb-2.1.0-SNAPSHOT.pom
[JENKINS] Archiving <https://ci-builds.apache.org/job/Directory/job/dir-kerby-openjdk11/ws/kerby-backend/mavibot-backend/pom.xml> to org.apache.kerby/mavibot-backend/2.1.0-SNAPSHOT/mavibot-backend-2.1.0-SNAPSHOT.pom
[JENKINS] Archiving <https://ci-builds.apache.org/job/Directory/job/dir-kerby-openjdk11/ws/kerby-backend/zookeeper-backend/pom.xml> to org.apache.kerby/zookeeper-backend/2.1.0-SNAPSHOT/zookeeper-backend-2.1.0-SNAPSHOT.pom
[JENKINS] Archiving <https://ci-builds.apache.org/job/Directory/job/dir-kerby-openjdk11/ws/kerby-common/kerby-config/pom.xml> to org.apache.kerby/kerby-config/2.1.0-SNAPSHOT/kerby-config-2.1.0-SNAPSHOT.pom
[JENKINS] Archiving <https://ci-builds.apache.org/job/Directory/job/dir-kerby-openjdk11/ws/kerby-common/kerby-util/pom.xml> to org.apache.kerby/kerby-util/2.1.0-SNAPSHOT/kerby-util-2.1.0-SNAPSHOT.pom
[JENKINS] Archiving <https://ci-builds.apache.org/job/Directory/job/dir-kerby-openjdk11/ws/kerby-kerb/kerb-common/pom.xml> to org.apache.kerby/kerb-common/2.1.0-SNAPSHOT/kerb-common-2.1.0-SNAPSHOT.pom
[JENKINS] Archiving <https://ci-builds.apache.org/job/Directory/job/dir-kerby-openjdk11/ws/kerby-kerb/kerb-core/pom.xml> to org.apache.kerby/kerb-core/2.1.0-SNAPSHOT/kerb-core-2.1.0-SNAPSHOT.pom
[JENKINS] Archiving <https://ci-builds.apache.org/job/Directory/job/dir-kerby-openjdk11/ws/kerby-kdc/pom.xml> to org.apache.kerby/kerby-kdc/2.1.0-SNAPSHOT/kerby-kdc-2.1.0-SNAPSHOT.pom
[JENKINS] Archiving <https://ci-builds.apache.org/job/Directory/job/dir-kerby-openjdk11/ws/kerby-kerb/kerb-identity/pom.xml> to org.apache.kerby/kerb-identity/2.1.0-SNAPSHOT/kerb-identity-2.1.0-SNAPSHOT.pom
[JENKINS] Archiving <https://ci-builds.apache.org/job/Directory/job/dir-kerby-openjdk11/ws/kerby-backend/pom.xml> to org.apache.kerby/kerby-backend/2.1.0-SNAPSHOT/kerby-backend-2.1.0-SNAPSHOT.pom
[JENKINS] Archiving <https://ci-builds.apache.org/job/Directory/job/dir-kerby-openjdk11/ws/kerby-tool/pom.xml> to org.apache.kerby/kerby-tool/2.1.0-SNAPSHOT/kerby-tool-2.1.0-SNAPSHOT.pom
[JENKINS] Archiving <https://ci-builds.apache.org/job/Directory/job/dir-kerby-openjdk11/ws/pom.xml> to org.apache.kerby/kerby-all/2.1.0-SNAPSHOT/kerby-all-2.1.0-SNAPSHOT.pom
[JENKINS] Archiving <https://ci-builds.apache.org/job/Directory/job/dir-kerby-openjdk11/ws/target/kerby-all-2.1.0-SNAPSHOT-bom.xml> to org.apache.kerby/kerby-all/2.1.0-SNAPSHOT/kerby-all-2.1.0-SNAPSHOT-cyclonedx.xml
[JENKINS] Archiving <https://ci-builds.apache.org/job/Directory/job/dir-kerby-openjdk11/ws/target/kerby-all-2.1.0-SNAPSHOT-bom.json> to org.apache.kerby/kerby-all/2.1.0-SNAPSHOT/kerby-all-2.1.0-SNAPSHOT-cyclonedx.json
[JENKINS] Archiving <https://ci-builds.apache.org/job/Directory/job/dir-kerby-openjdk11/ws/parent/pom.xml> to org.apache.kerby/kerby-parent/2.1.0-SNAPSHOT/kerby-parent-2.1.0-SNAPSHOT.pom
[JENKINS] Archiving <https://ci-builds.apache.org/job/Directory/job/dir-kerby-openjdk11/ws/parent/target/kerby-parent-2.1.0-SNAPSHOT-bom.xml> to org.apache.kerby/kerby-parent/2.1.0-SNAPSHOT/kerby-parent-2.1.0-SNAPSHOT-cyclonedx.xml
[JENKINS] Archiving <https://ci-builds.apache.org/job/Directory/job/dir-kerby-openjdk11/ws/parent/target/kerby-parent-2.1.0-SNAPSHOT-bom.json> to org.apache.kerby/kerby-parent/2.1.0-SNAPSHOT/kerby-parent-2.1.0-SNAPSHOT-cyclonedx.json
[JENKINS] Archiving <https://ci-builds.apache.org/job/Directory/job/dir-kerby-openjdk11/ws/kerby-kerb/kerb-kdc-test/pom.xml> to org.apache.kerby/kerb-kdc-test/2.1.0-SNAPSHOT/kerb-kdc-test-2.1.0-SNAPSHOT.pom
[JENKINS] Archiving <https://ci-builds.apache.org/job/Directory/job/dir-kerby-openjdk11/ws/kerby-dist/tool-dist/pom.xml> to org.apache.kerby/tool-dist/2.1.0-SNAPSHOT/tool-dist-2.1.0-SNAPSHOT.pom
[JENKINS] Archiving <https://ci-builds.apache.org/job/Directory/job/dir-kerby-openjdk11/ws/kerby-kerb/kerb-identity-test/pom.xml> to org.apache.kerby/kerb-identity-test/2.1.0-SNAPSHOT/kerb-identity-test-2.1.0-SNAPSHOT.pom
[JENKINS] Archiving <https://ci-builds.apache.org/job/Directory/job/dir-kerby-openjdk11/ws/kerby-kerb/kerb-server-api-all/pom.xml> to org.apache.kerby/kerb-server-api-all/2.1.0-SNAPSHOT/kerb-server-api-all-2.1.0-SNAPSHOT.pom
channel stopped
Build failed in Jenkins: Directory » dir-kerby-openjdk11 #390
Posted by Apache Jenkins Server <je...@builds.apache.org>.
See <https://ci-builds.apache.org/job/Directory/job/dir-kerby-openjdk11/390/display/redirect?page=changes>
Changes:
[github] Bump github/codeql-action from 3.25.4 to 3.25.5
[github] Bump actions/checkout from 4.1.5 to 4.1.6
[github] Bump org.codehaus.mojo:build-helper-maven-plugin from 3.5.0 to 3.6.0
[github]
------------------------------------------
[...truncated 237.78 KB...]
[INFO] Downloading from central: https://repo.maven.apache.org/maven2/org/codehaus/plexus/plexus-compiler-manager/2.15.0/plexus-compiler-manager-2.15.0.jar
[INFO] Downloading from central: https://repo.maven.apache.org/maven2/org/codehaus/plexus/plexus-compiler-api/2.15.0/plexus-compiler-api-2.15.0.jar
[INFO] Downloading from central: https://repo.maven.apache.org/maven2/org/codehaus/plexus/plexus-compiler-javac/2.15.0/plexus-compiler-javac-2.15.0.jar
[INFO] Downloaded from central: https://repo.maven.apache.org/maven2/org/codehaus/plexus/plexus-java/1.2.0/plexus-java-1.2.0.jar (58 kB at 9.6 MB/s)
[INFO] Downloaded from central: https://repo.maven.apache.org/maven2/org/ow2/asm/asm/9.6/asm-9.6.jar (124 kB at 15 MB/s)
[INFO] Downloaded from central: https://repo.maven.apache.org/maven2/org/codehaus/plexus/plexus-compiler-manager/2.15.0/plexus-compiler-manager-2.15.0.jar (5.2 kB at 654 kB/s)
[INFO] Downloaded from central: https://repo.maven.apache.org/maven2/org/codehaus/plexus/plexus-compiler-javac/2.15.0/plexus-compiler-javac-2.15.0.jar (26 kB at 3.2 MB/s)
[INFO] Downloaded from central: https://repo.maven.apache.org/maven2/org/codehaus/plexus/plexus-compiler-api/2.15.0/plexus-compiler-api-2.15.0.jar (29 kB at 2.2 MB/s)
[INFO] Recompiling the module because of changed source code.
[INFO] Compiling 69 source files with javac [debug release 7] to target/classes
[INFO] <https://ci-builds.apache.org/job/Directory/job/dir-kerby-openjdk11/ws/kerby-common/kerby-asn1/src/main/java/org/apache/kerby/asn1/type/Asn1Any.java>: Some input files use unchecked or unsafe operations.
[INFO] <https://ci-builds.apache.org/job/Directory/job/dir-kerby-openjdk11/ws/kerby-common/kerby-asn1/src/main/java/org/apache/kerby/asn1/type/Asn1Any.java>: Recompile with -Xlint:unchecked for details.
[INFO]
[INFO] --- resources:3.3.1:testResources (default-testResources) @ kerby-asn1 ---
[INFO] Copying 5 resources from src/test/resources to target/test-classes
[INFO] Copying 3 resources from target/maven-shared-archive-resources to target/test-classes
[INFO]
[INFO] --- compiler:3.13.0:testCompile (default-testCompile) @ kerby-asn1 ---
[INFO] Recompiling the module because of changed dependency.
[INFO] Compiling 15 source files with javac [debug release 7] to target/test-classes
[INFO] -------------------------------------------------------------
[ERROR] COMPILATION ERROR :
[INFO] -------------------------------------------------------------
[ERROR] <https://ci-builds.apache.org/job/Directory/job/dir-kerby-openjdk11/ws/kerby-common/kerby-asn1/src/test/java/org/apache/kerby/asn1/Asn1BooleanTest.java>:[48,9] cannot access java.util.function.Predicate
class file for java.util.function.Predicate not found
[ERROR] <https://ci-builds.apache.org/job/Directory/job/dir-kerby-openjdk11/ws/kerby-common/kerby-asn1/src/test/java/org/apache/kerby/asn1/Asn1BooleanTest.java>:[68,9] cannot access java.util.function.IntPredicate
class file for java.util.function.IntPredicate not found
[ERROR] <https://ci-builds.apache.org/job/Directory/job/dir-kerby-openjdk11/ws/kerby-common/kerby-asn1/src/test/java/org/apache/kerby/asn1/Asn1CollectionTest.java>:[46,9] cannot access java.util.function.LongPredicate
class file for java.util.function.LongPredicate not found
[ERROR] <https://ci-builds.apache.org/job/Directory/job/dir-kerby-openjdk11/ws/kerby-common/kerby-asn1/src/test/java/org/apache/kerby/asn1/Asn1CollectionTest.java>:[55,9] cannot access java.util.function.DoublePredicate
class file for java.util.function.DoublePredicate not found
[ERROR] <https://ci-builds.apache.org/job/Directory/job/dir-kerby-openjdk11/ws/kerby-common/kerby-asn1/src/test/java/org/apache/kerby/asn1/Asn1CollectionTest.java>:[58,9] cannot access java.util.concurrent.CompletableFuture
class file for java.util.concurrent.CompletableFuture not found
[ERROR] <https://ci-builds.apache.org/job/Directory/job/dir-kerby-openjdk11/ws/kerby-common/kerby-asn1/src/test/java/org/apache/kerby/asn1/Asn1DumpTest.java>:[39,23] cannot access java.util.function.Supplier
class file for java.util.function.Supplier not found
[ERROR] <https://ci-builds.apache.org/job/Directory/job/dir-kerby-openjdk11/ws/kerby-common/kerby-asn1/src/test/java/org/apache/kerby/asn1/Asn1FlagsTest.java>:[106,5] cannot access java.util.function.BooleanSupplier
class file for java.util.function.BooleanSupplier not found
[ERROR] <https://ci-builds.apache.org/job/Directory/job/dir-kerby-openjdk11/ws/kerby-common/kerby-asn1/src/test/java/org/apache/kerby/asn1/Asn1GeneralizedTimeTest.java>:[66,9] cannot access java.util.concurrent.CompletionStage
class file for java.util.concurrent.CompletionStage not found
[ERROR] <https://ci-builds.apache.org/job/Directory/job/dir-kerby-openjdk11/ws/kerby-common/kerby-asn1/src/test/java/org/apache/kerby/asn1/Asn1IntegerTest.java>:[50,9] cannot access java.util.Optional
class file for java.util.Optional not found
[ERROR] <https://ci-builds.apache.org/job/Directory/job/dir-kerby-openjdk11/ws/kerby-common/kerby-asn1/src/test/java/org/apache/kerby/asn1/Asn1IntegerTest.java>:[70,9] cannot access java.util.OptionalDouble
class file for java.util.OptionalDouble not found
[ERROR] <https://ci-builds.apache.org/job/Directory/job/dir-kerby-openjdk11/ws/kerby-common/kerby-asn1/src/test/java/org/apache/kerby/asn1/Asn1ObjectIdentifierTest.java>:[51,9] cannot access java.util.OptionalInt
class file for java.util.OptionalInt not found
[ERROR] <https://ci-builds.apache.org/job/Directory/job/dir-kerby-openjdk11/ws/kerby-common/kerby-asn1/src/test/java/org/apache/kerby/asn1/Asn1ObjectIdentifierTest.java>:[64,9] cannot access java.util.OptionalLong
class file for java.util.OptionalLong not found
[ERROR] <https://ci-builds.apache.org/job/Directory/job/dir-kerby-openjdk11/ws/kerby-common/kerby-asn1/src/test/java/org/apache/kerby/asn1/Asn1UtcTimeTest.java>:[76,9] cannot access java.time.ZonedDateTime
class file for java.time.ZonedDateTime not found
[ERROR] <https://ci-builds.apache.org/job/Directory/job/dir-kerby-openjdk11/ws/kerby-common/kerby-asn1/src/test/java/org/apache/kerby/asn1/Asn1UtcTimeTest.java>:[92,9] cannot access java.time.LocalDateTime
class file for java.time.LocalDateTime not found
[ERROR] <https://ci-builds.apache.org/job/Directory/job/dir-kerby-openjdk11/ws/kerby-common/kerby-asn1/src/test/java/org/apache/kerby/asn1/Asn1Utf8StringTest.java>:[43,9] cannot access java.time.OffsetDateTime
class file for java.time.OffsetDateTime not found
[ERROR] <https://ci-builds.apache.org/job/Directory/job/dir-kerby-openjdk11/ws/kerby-common/kerby-asn1/src/test/java/org/apache/kerby/asn1/Asn1Utf8StringTest.java>:[44,9] cannot access java.time.OffsetTime
class file for java.time.OffsetTime not found
[ERROR] <https://ci-builds.apache.org/job/Directory/job/dir-kerby-openjdk11/ws/kerby-common/kerby-asn1/src/test/java/org/apache/kerby/asn1/Asn1Utf8StringTest.java>:[57,9] cannot access java.time.LocalTime
class file for java.time.LocalTime not found
[ERROR] <https://ci-builds.apache.org/job/Directory/job/dir-kerby-openjdk11/ws/kerby-common/kerby-asn1/src/test/java/org/apache/kerby/asn1/Asn1Utf8StringTest.java>:[58,9] cannot access java.time.LocalDate
class file for java.time.LocalDate not found
[ERROR] <https://ci-builds.apache.org/job/Directory/job/dir-kerby-openjdk11/ws/kerby-common/kerby-asn1/src/test/java/org/apache/kerby/asn1/PersonnelRecordTest.java>:[72,9] cannot access java.time.Instant
class file for java.time.Instant not found
[ERROR] <https://ci-builds.apache.org/job/Directory/job/dir-kerby-openjdk11/ws/kerby-common/kerby-asn1/src/test/java/org/apache/kerby/asn1/PersonnelRecordTest.java>:[84,9] cannot access java.time.Duration
class file for java.time.Duration not found
[ERROR] <https://ci-builds.apache.org/job/Directory/job/dir-kerby-openjdk11/ws/kerby-common/kerby-asn1/src/test/java/org/apache/kerby/asn1/PersonnelRecordTest.java>:[86,9] cannot access java.time.Period
class file for java.time.Period not found
[ERROR] <https://ci-builds.apache.org/job/Directory/job/dir-kerby-openjdk11/ws/kerby-common/kerby-asn1/src/test/java/org/apache/kerby/asn1/PersonnelRecordTest.java>:[88,9] cannot access java.util.concurrent.atomic.LongAdder
class file for java.util.concurrent.atomic.LongAdder not found
[ERROR] <https://ci-builds.apache.org/job/Directory/job/dir-kerby-openjdk11/ws/kerby-common/kerby-asn1/src/test/java/org/apache/kerby/asn1/PersonnelRecordTest.java>:[90,9] cannot access java.util.stream.Stream
class file for java.util.stream.Stream not found
[ERROR] <https://ci-builds.apache.org/job/Directory/job/dir-kerby-openjdk11/ws/kerby-common/kerby-asn1/src/test/java/org/apache/kerby/asn1/PersonnelRecordTest.java>:[92,9] cannot access java.util.stream.DoubleStream
class file for java.util.stream.DoubleStream not found
[ERROR] <https://ci-builds.apache.org/job/Directory/job/dir-kerby-openjdk11/ws/kerby-common/kerby-asn1/src/test/java/org/apache/kerby/asn1/PersonnelRecordTest.java>:[94,9] cannot access java.util.stream.LongStream
class file for java.util.stream.LongStream not found
[ERROR] <https://ci-builds.apache.org/job/Directory/job/dir-kerby-openjdk11/ws/kerby-common/kerby-asn1/src/test/java/org/apache/kerby/asn1/PersonnelRecordTest.java>:[96,9] cannot access java.util.stream.IntStream
class file for java.util.stream.IntStream not found
[ERROR] <https://ci-builds.apache.org/job/Directory/job/dir-kerby-openjdk11/ws/kerby-common/kerby-asn1/src/test/java/org/apache/kerby/asn1/PersonnelRecordTest.java>:[98,9] cannot access java.util.Spliterator
class file for java.util.Spliterator not found
[INFO] 27 errors
[INFO] -------------------------------------------------------------
[INFO] ------------------------------------------------------------------------
[INFO] Reactor Summary for Apache Kerby Project 2.1.0-SNAPSHOT:
[INFO]
[INFO] Apache Kerby Project ............................... SUCCESS [ 44.625 s]
[INFO] Apache Kerby BOM ................................... SUCCESS [ 2.087 s]
[INFO] Apache Directory Kerby Parent pom .................. SUCCESS [ 2.184 s]
[INFO] Kerby-common Project ............................... SUCCESS [ 1.809 s]
[INFO] Kerby ASN1 Project ................................. FAILURE [ 10.232 s]
[INFO] Kerby Config ....................................... SKIPPED
[INFO] Kerby Util ......................................... SKIPPED
[INFO] Kerby XDR Project .................................. SKIPPED
[INFO] Kerby PKIX Project ................................. SKIPPED
[INFO] Kerby-kerb Project ................................. SKIPPED
[INFO] Kerby-kerb core .................................... SKIPPED
[INFO] Kerby-kerb Crypto .................................. SKIPPED
[INFO] Kerby-kerb Common .................................. SKIPPED
[INFO] Kerby-kerb Util .................................... SKIPPED
[INFO] Kerby-kerb Identity ................................ SKIPPED
[INFO] Kerby-kerb Identity Test ........................... SKIPPED
[INFO] Kerby providers .................................... SKIPPED
[INFO] Token provider ..................................... SKIPPED
[INFO] Kerby-kerb Client .................................. SKIPPED
[INFO] Kerby-kerb Server .................................. SKIPPED
[INFO] Kerby-kerb Admin ................................... SKIPPED
[INFO] Kerb Simple Kdc .................................... SKIPPED
[INFO] Kerby-kerb server all .............................. SKIPPED
[INFO] Kerby KDC Server ................................... SKIPPED
[INFO] Kerb Kdc Test ...................................... SKIPPED
[INFO] Kerby-kerb GssAPI .................................. SKIPPED
[INFO] Kerb Integration Test .............................. SKIPPED
[INFO] Kerby Backend ...................................... SKIPPED
[INFO] Zookeeper identity backend ......................... SKIPPED
[INFO] Kerby-kerb Admin Server ............................ SKIPPED
[INFO] Kerby-kerb client api all .......................... SKIPPED
[INFO] Json identity backend .............................. SKIPPED
[INFO] Kerby Kdc Test ..................................... SKIPPED
[INFO] Ldap identity backend .............................. SKIPPED
[INFO] Mavibot based backend .............................. SKIPPED
[INFO] MySQL identity backend ............................. SKIPPED
[INFO] Kerby benchmark .................................... SKIPPED
[INFO] Kdc Tool Project ................................... SKIPPED
[INFO] Client Tool ........................................ SKIPPED
[INFO] KDC Tool ........................................... SKIPPED
[INFO] Kerby Distribution ................................. SKIPPED
[INFO] KDC Dist ........................................... SKIPPED
[INFO] Tool Dist .......................................... SKIPPED
[INFO] ------------------------------------------------------------------------
[INFO] BUILD FAILURE
[INFO] ------------------------------------------------------------------------
[INFO] Total time: 01:23 min
[INFO] Finished at: 2024-05-24T12:34:51Z
[INFO] ------------------------------------------------------------------------
Waiting for Jenkins to finish collecting data
[ERROR] Failed to execute goal org.apache.maven.plugins:maven-compiler-plugin:3.13.0:testCompile (default-testCompile) on project kerby-asn1: Compilation failure: Compilation failure:
[ERROR] <https://ci-builds.apache.org/job/Directory/job/dir-kerby-openjdk11/ws/kerby-common/kerby-asn1/src/test/java/org/apache/kerby/asn1/Asn1BooleanTest.java>:[48,9] cannot access java.util.function.Predicate
[ERROR] class file for java.util.function.Predicate not found
[ERROR] <https://ci-builds.apache.org/job/Directory/job/dir-kerby-openjdk11/ws/kerby-common/kerby-asn1/src/test/java/org/apache/kerby/asn1/Asn1BooleanTest.java>:[68,9] cannot access java.util.function.IntPredicate
[ERROR] class file for java.util.function.IntPredicate not found
[ERROR] <https://ci-builds.apache.org/job/Directory/job/dir-kerby-openjdk11/ws/kerby-common/kerby-asn1/src/test/java/org/apache/kerby/asn1/Asn1CollectionTest.java>:[46,9] cannot access java.util.function.LongPredicate
[ERROR] class file for java.util.function.LongPredicate not found
[ERROR] <https://ci-builds.apache.org/job/Directory/job/dir-kerby-openjdk11/ws/kerby-common/kerby-asn1/src/test/java/org/apache/kerby/asn1/Asn1CollectionTest.java>:[55,9] cannot access java.util.function.DoublePredicate
[ERROR] class file for java.util.function.DoublePredicate not found
[ERROR] <https://ci-builds.apache.org/job/Directory/job/dir-kerby-openjdk11/ws/kerby-common/kerby-asn1/src/test/java/org/apache/kerby/asn1/Asn1CollectionTest.java>:[58,9] cannot access java.util.concurrent.CompletableFuture
[ERROR] class file for java.util.concurrent.CompletableFuture not found
[ERROR] <https://ci-builds.apache.org/job/Directory/job/dir-kerby-openjdk11/ws/kerby-common/kerby-asn1/src/test/java/org/apache/kerby/asn1/Asn1DumpTest.java>:[39,23] cannot access java.util.function.Supplier
[ERROR] class file for java.util.function.Supplier not found
[ERROR] <https://ci-builds.apache.org/job/Directory/job/dir-kerby-openjdk11/ws/kerby-common/kerby-asn1/src/test/java/org/apache/kerby/asn1/Asn1FlagsTest.java>:[106,5] cannot access java.util.function.BooleanSupplier
[ERROR] class file for java.util.function.BooleanSupplier not found
[ERROR] <https://ci-builds.apache.org/job/Directory/job/dir-kerby-openjdk11/ws/kerby-common/kerby-asn1/src/test/java/org/apache/kerby/asn1/Asn1GeneralizedTimeTest.java>:[66,9] cannot access java.util.concurrent.CompletionStage
[ERROR] class file for java.util.concurrent.CompletionStage not found
[ERROR] <https://ci-builds.apache.org/job/Directory/job/dir-kerby-openjdk11/ws/kerby-common/kerby-asn1/src/test/java/org/apache/kerby/asn1/Asn1IntegerTest.java>:[50,9] cannot access java.util.Optional
[ERROR] class file for java.util.Optional not found
[ERROR] <https://ci-builds.apache.org/job/Directory/job/dir-kerby-openjdk11/ws/kerby-common/kerby-asn1/src/test/java/org/apache/kerby/asn1/Asn1IntegerTest.java>:[70,9] cannot access java.util.OptionalDouble
[ERROR] class file for java.util.OptionalDouble not found
[ERROR] <https://ci-builds.apache.org/job/Directory/job/dir-kerby-openjdk11/ws/kerby-common/kerby-asn1/src/test/java/org/apache/kerby/asn1/Asn1ObjectIdentifierTest.java>:[51,9] cannot access java.util.OptionalInt
[ERROR] class file for java.util.OptionalInt not found
[ERROR] <https://ci-builds.apache.org/job/Directory/job/dir-kerby-openjdk11/ws/kerby-common/kerby-asn1/src/test/java/org/apache/kerby/asn1/Asn1ObjectIdentifierTest.java>:[64,9] cannot access java.util.OptionalLong
[ERROR] class file for java.util.OptionalLong not found
[ERROR] <https://ci-builds.apache.org/job/Directory/job/dir-kerby-openjdk11/ws/kerby-common/kerby-asn1/src/test/java/org/apache/kerby/asn1/Asn1UtcTimeTest.java>:[76,9] cannot access java.time.ZonedDateTime
[ERROR] class file for java.time.ZonedDateTime not found
[ERROR] <https://ci-builds.apache.org/job/Directory/job/dir-kerby-openjdk11/ws/kerby-common/kerby-asn1/src/test/java/org/apache/kerby/asn1/Asn1UtcTimeTest.java>:[92,9] cannot access java.time.LocalDateTime
[ERROR] class file for java.time.LocalDateTime not found
[ERROR] <https://ci-builds.apache.org/job/Directory/job/dir-kerby-openjdk11/ws/kerby-common/kerby-asn1/src/test/java/org/apache/kerby/asn1/Asn1Utf8StringTest.java>:[43,9] cannot access java.time.OffsetDateTime
[ERROR] class file for java.time.OffsetDateTime not found
[ERROR] <https://ci-builds.apache.org/job/Directory/job/dir-kerby-openjdk11/ws/kerby-common/kerby-asn1/src/test/java/org/apache/kerby/asn1/Asn1Utf8StringTest.java>:[44,9] cannot access java.time.OffsetTime
[ERROR] class file for java.time.OffsetTime not found
[ERROR] <https://ci-builds.apache.org/job/Directory/job/dir-kerby-openjdk11/ws/kerby-common/kerby-asn1/src/test/java/org/apache/kerby/asn1/Asn1Utf8StringTest.java>:[57,9] cannot access java.time.LocalTime
[ERROR] class file for java.time.LocalTime not found
[ERROR] <https://ci-builds.apache.org/job/Directory/job/dir-kerby-openjdk11/ws/kerby-common/kerby-asn1/src/test/java/org/apache/kerby/asn1/Asn1Utf8StringTest.java>:[58,9] cannot access java.time.LocalDate
[ERROR] class file for java.time.LocalDate not found
[ERROR] <https://ci-builds.apache.org/job/Directory/job/dir-kerby-openjdk11/ws/kerby-common/kerby-asn1/src/test/java/org/apache/kerby/asn1/PersonnelRecordTest.java>:[72,9] cannot access java.time.Instant
[ERROR] class file for java.time.Instant not found
[ERROR] <https://ci-builds.apache.org/job/Directory/job/dir-kerby-openjdk11/ws/kerby-common/kerby-asn1/src/test/java/org/apache/kerby/asn1/PersonnelRecordTest.java>:[84,9] cannot access java.time.Duration
[ERROR] class file for java.time.Duration not found
[ERROR] <https://ci-builds.apache.org/job/Directory/job/dir-kerby-openjdk11/ws/kerby-common/kerby-asn1/src/test/java/org/apache/kerby/asn1/PersonnelRecordTest.java>:[86,9] cannot access java.time.Period
[ERROR] class file for java.time.Period not found
[ERROR] <https://ci-builds.apache.org/job/Directory/job/dir-kerby-openjdk11/ws/kerby-common/kerby-asn1/src/test/java/org/apache/kerby/asn1/PersonnelRecordTest.java>:[88,9] cannot access java.util.concurrent.atomic.LongAdder
[ERROR] class file for java.util.concurrent.atomic.LongAdder not found
[ERROR] <https://ci-builds.apache.org/job/Directory/job/dir-kerby-openjdk11/ws/kerby-common/kerby-asn1/src/test/java/org/apache/kerby/asn1/PersonnelRecordTest.java>:[90,9] cannot access java.util.stream.Stream
[ERROR] class file for java.util.stream.Stream not found
[ERROR] <https://ci-builds.apache.org/job/Directory/job/dir-kerby-openjdk11/ws/kerby-common/kerby-asn1/src/test/java/org/apache/kerby/asn1/PersonnelRecordTest.java>:[92,9] cannot access java.util.stream.DoubleStream
[ERROR] class file for java.util.stream.DoubleStream not found
[ERROR] <https://ci-builds.apache.org/job/Directory/job/dir-kerby-openjdk11/ws/kerby-common/kerby-asn1/src/test/java/org/apache/kerby/asn1/PersonnelRecordTest.java>:[94,9] cannot access java.util.stream.LongStream
[ERROR] class file for java.util.stream.LongStream not found
[ERROR] <https://ci-builds.apache.org/job/Directory/job/dir-kerby-openjdk11/ws/kerby-common/kerby-asn1/src/test/java/org/apache/kerby/asn1/PersonnelRecordTest.java>:[96,9] cannot access java.util.stream.IntStream
[ERROR] class file for java.util.stream.IntStream not found
[ERROR] <https://ci-builds.apache.org/job/Directory/job/dir-kerby-openjdk11/ws/kerby-common/kerby-asn1/src/test/java/org/apache/kerby/asn1/PersonnelRecordTest.java>:[98,9] cannot access java.util.Spliterator
[ERROR] class file for java.util.Spliterator not found
[ERROR] -> [Help 1]
[ERROR]
[ERROR] To see the full stack trace of the errors, re-run Maven with the -e switch.
[ERROR] Re-run Maven using the -X switch to enable full debug logging.
[ERROR]
[ERROR] For more information about the errors and possible solutions, please read the following articles:
[ERROR] [Help 1] http://cwiki.apache.org/confluence/display/MAVEN/MojoFailureException
[ERROR]
[ERROR] After correcting the problems, you can resume the build with the command
[ERROR] mvn <goals> -rf :kerby-asn1
[JENKINS] Archiving <https://ci-builds.apache.org/job/Directory/job/dir-kerby-openjdk11/ws/kerby-backend/mysql-backend/pom.xml> to org.apache.kerby/mysql-backend/2.1.0-SNAPSHOT/mysql-backend-2.1.0-SNAPSHOT.pom
[JENKINS] Archiving <https://ci-builds.apache.org/job/Directory/job/dir-kerby-openjdk11/ws/kerby-backend/json-backend/pom.xml> to org.apache.kerby/json-backend/2.1.0-SNAPSHOT/json-backend-2.1.0-SNAPSHOT.pom
[JENKINS] Archiving <https://ci-builds.apache.org/job/Directory/job/dir-kerby-openjdk11/ws/kerby-backend/ldap-backend/pom.xml> to org.apache.kerby/ldap-backend/2.1.0-SNAPSHOT/ldap-backend-2.1.0-SNAPSHOT.pom
[JENKINS] Archiving <https://ci-builds.apache.org/job/Directory/job/dir-kerby-openjdk11/ws/kerby-pkix/pom.xml> to org.apache.kerby/kerby-pkix/2.1.0-SNAPSHOT/kerby-pkix-2.1.0-SNAPSHOT.pom
[JENKINS] Archiving <https://ci-builds.apache.org/job/Directory/job/dir-kerby-openjdk11/ws/kerby-kdc-test/pom.xml> to org.apache.kerby/kerby-kdc-test/2.1.0-SNAPSHOT/kerby-kdc-test-2.1.0-SNAPSHOT.pom
[JENKINS] Archiving <https://ci-builds.apache.org/job/Directory/job/dir-kerby-openjdk11/ws/kerby-kerb/kerb-util/pom.xml> to org.apache.kerby/kerb-util/2.1.0-SNAPSHOT/kerb-util-2.1.0-SNAPSHOT.pom
[JENKINS] Archiving <https://ci-builds.apache.org/job/Directory/job/dir-kerby-openjdk11/ws/kerby-kerb/kerb-crypto/pom.xml> to org.apache.kerby/kerb-crypto/2.1.0-SNAPSHOT/kerb-crypto-2.1.0-SNAPSHOT.pom
[JENKINS] Archiving <https://ci-builds.apache.org/job/Directory/job/dir-kerby-openjdk11/ws/kerby-provider/token-provider/pom.xml> to org.apache.kerby/token-provider/2.1.0-SNAPSHOT/token-provider-2.1.0-SNAPSHOT.pom
[JENKINS] Archiving <https://ci-builds.apache.org/job/Directory/job/dir-kerby-openjdk11/ws/kerby-kerb/kerb-client-api-all/pom.xml> to org.apache.kerby/kerb-client-api-all/2.1.0-SNAPSHOT/kerb-client-api-all-2.1.0-SNAPSHOT.pom
[JENKINS] Archiving <https://ci-builds.apache.org/job/Directory/job/dir-kerby-openjdk11/ws/kerby-tool/client-tool/pom.xml> to org.apache.kerby/client-tool/2.1.0-SNAPSHOT/client-tool-2.1.0-SNAPSHOT.pom
[JENKINS] Archiving <https://ci-builds.apache.org/job/Directory/job/dir-kerby-openjdk11/ws/kerby-dist/pom.xml> to org.apache.kerby/kerby-dist/2.1.0-SNAPSHOT/kerby-dist-2.1.0-SNAPSHOT.pom
[JENKINS] Archiving <https://ci-builds.apache.org/job/Directory/job/dir-kerby-openjdk11/ws/bom/pom.xml> to org.apache.kerby/kerby-bom/2.1.0-SNAPSHOT/kerby-bom-2.1.0-SNAPSHOT.pom
[JENKINS] Archiving <https://ci-builds.apache.org/job/Directory/job/dir-kerby-openjdk11/ws/bom/target/kerby-bom-2.1.0-SNAPSHOT-bom.xml> to org.apache.kerby/kerby-bom/2.1.0-SNAPSHOT/kerby-bom-2.1.0-SNAPSHOT-cyclonedx.xml
[JENKINS] Archiving <https://ci-builds.apache.org/job/Directory/job/dir-kerby-openjdk11/ws/bom/target/kerby-bom-2.1.0-SNAPSHOT-bom.json> to org.apache.kerby/kerby-bom/2.1.0-SNAPSHOT/kerby-bom-2.1.0-SNAPSHOT-cyclonedx.json
[JENKINS] Archiving <https://ci-builds.apache.org/job/Directory/job/dir-kerby-openjdk11/ws/kerby-kerb/kerb-server/pom.xml> to org.apache.kerby/kerb-server/2.1.0-SNAPSHOT/kerb-server-2.1.0-SNAPSHOT.pom
[JENKINS] Archiving <https://ci-builds.apache.org/job/Directory/job/dir-kerby-openjdk11/ws/kerby-common/kerby-xdr/pom.xml> to org.apache.kerby/kerby-xdr/2.1.0-SNAPSHOT/kerby-xdr-2.1.0-SNAPSHOT.pom
[JENKINS] Archiving <https://ci-builds.apache.org/job/Directory/job/dir-kerby-openjdk11/ws/kerby-kerb/kerb-gssapi/pom.xml> to org.apache.kerby/kerb-gssapi/2.1.0-SNAPSHOT/kerb-gssapi-2.1.0-SNAPSHOT.pom
[JENKINS] Archiving <https://ci-builds.apache.org/job/Directory/job/dir-kerby-openjdk11/ws/kerby-tool/kdc-tool/pom.xml> to org.apache.kerby/kdc-tool/2.1.0-SNAPSHOT/kdc-tool-2.1.0-SNAPSHOT.pom
[JENKINS] Archiving <https://ci-builds.apache.org/job/Directory/job/dir-kerby-openjdk11/ws/kerby-kerb/kerb-admin-server/pom.xml> to org.apache.kerby/kerb-admin-server/2.1.0-SNAPSHOT/kerb-admin-server-2.1.0-SNAPSHOT.pom
[JENKINS] Archiving <https://ci-builds.apache.org/job/Directory/job/dir-kerby-openjdk11/ws/kerby-dist/kdc-dist/pom.xml> to org.apache.kerby/kdc-dist/2.1.0-SNAPSHOT/kdc-dist-2.1.0-SNAPSHOT.pom
[JENKINS] Archiving <https://ci-builds.apache.org/job/Directory/job/dir-kerby-openjdk11/ws/kerby-common/kerby-asn1/pom.xml> to org.apache.kerby/kerby-asn1/2.1.0-SNAPSHOT/kerby-asn1-2.1.0-SNAPSHOT.pom
[JENKINS] Archiving <https://ci-builds.apache.org/job/Directory/job/dir-kerby-openjdk11/ws/benchmark/pom.xml> to org.apache.kerby/benchmark/2.1.0-SNAPSHOT/benchmark-2.1.0-SNAPSHOT.pom
[JENKINS] Archiving <https://ci-builds.apache.org/job/Directory/job/dir-kerby-openjdk11/ws/kerby-common/pom.xml> to org.apache.kerby/kerby-common/2.1.0-SNAPSHOT/kerby-common-2.1.0-SNAPSHOT.pom
[JENKINS] Archiving <https://ci-builds.apache.org/job/Directory/job/dir-kerby-openjdk11/ws/kerby-common/target/kerby-common-2.1.0-SNAPSHOT-bom.xml> to org.apache.kerby/kerby-common/2.1.0-SNAPSHOT/kerby-common-2.1.0-SNAPSHOT-cyclonedx.xml
[JENKINS] Archiving <https://ci-builds.apache.org/job/Directory/job/dir-kerby-openjdk11/ws/kerby-common/target/kerby-common-2.1.0-SNAPSHOT-bom.json> to org.apache.kerby/kerby-common/2.1.0-SNAPSHOT/kerby-common-2.1.0-SNAPSHOT-cyclonedx.json
[JENKINS] Archiving <https://ci-builds.apache.org/job/Directory/job/dir-kerby-openjdk11/ws/kerby-provider/pom.xml> to org.apache.kerby/kerby-provider/2.1.0-SNAPSHOT/kerby-provider-2.1.0-SNAPSHOT.pom
[JENKINS] Archiving <https://ci-builds.apache.org/job/Directory/job/dir-kerby-openjdk11/ws/kerby-kerb/kerb-admin/pom.xml> to org.apache.kerby/kerb-admin/2.1.0-SNAPSHOT/kerb-admin-2.1.0-SNAPSHOT.pom
[JENKINS] Archiving <https://ci-builds.apache.org/job/Directory/job/dir-kerby-openjdk11/ws/kerby-kerb/integration-test/pom.xml> to org.apache.kerby/integration-test/2.1.0-SNAPSHOT/integration-test-2.1.0-SNAPSHOT.pom
[JENKINS] Archiving <https://ci-builds.apache.org/job/Directory/job/dir-kerby-openjdk11/ws/kerby-kerb/kerb-simplekdc/pom.xml> to org.apache.kerby/kerb-simplekdc/2.1.0-SNAPSHOT/kerb-simplekdc-2.1.0-SNAPSHOT.pom
[JENKINS] Archiving <https://ci-builds.apache.org/job/Directory/job/dir-kerby-openjdk11/ws/kerby-kerb/kerb-client/pom.xml> to org.apache.kerby/kerb-client/2.1.0-SNAPSHOT/kerb-client-2.1.0-SNAPSHOT.pom
[JENKINS] Archiving <https://ci-builds.apache.org/job/Directory/job/dir-kerby-openjdk11/ws/kerby-kerb/pom.xml> to org.apache.kerby/kerby-kerb/2.1.0-SNAPSHOT/kerby-kerb-2.1.0-SNAPSHOT.pom
[JENKINS] Archiving <https://ci-builds.apache.org/job/Directory/job/dir-kerby-openjdk11/ws/kerby-backend/mavibot-backend/pom.xml> to org.apache.kerby/mavibot-backend/2.1.0-SNAPSHOT/mavibot-backend-2.1.0-SNAPSHOT.pom
[JENKINS] Archiving <https://ci-builds.apache.org/job/Directory/job/dir-kerby-openjdk11/ws/kerby-backend/zookeeper-backend/pom.xml> to org.apache.kerby/zookeeper-backend/2.1.0-SNAPSHOT/zookeeper-backend-2.1.0-SNAPSHOT.pom
[JENKINS] Archiving <https://ci-builds.apache.org/job/Directory/job/dir-kerby-openjdk11/ws/kerby-common/kerby-config/pom.xml> to org.apache.kerby/kerby-config/2.1.0-SNAPSHOT/kerby-config-2.1.0-SNAPSHOT.pom
[JENKINS] Archiving <https://ci-builds.apache.org/job/Directory/job/dir-kerby-openjdk11/ws/kerby-common/kerby-util/pom.xml> to org.apache.kerby/kerby-util/2.1.0-SNAPSHOT/kerby-util-2.1.0-SNAPSHOT.pom
[JENKINS] Archiving <https://ci-builds.apache.org/job/Directory/job/dir-kerby-openjdk11/ws/kerby-kerb/kerb-common/pom.xml> to org.apache.kerby/kerb-common/2.1.0-SNAPSHOT/kerb-common-2.1.0-SNAPSHOT.pom
[JENKINS] Archiving <https://ci-builds.apache.org/job/Directory/job/dir-kerby-openjdk11/ws/kerby-kerb/kerb-core/pom.xml> to org.apache.kerby/kerb-core/2.1.0-SNAPSHOT/kerb-core-2.1.0-SNAPSHOT.pom
[JENKINS] Archiving <https://ci-builds.apache.org/job/Directory/job/dir-kerby-openjdk11/ws/kerby-kdc/pom.xml> to org.apache.kerby/kerby-kdc/2.1.0-SNAPSHOT/kerby-kdc-2.1.0-SNAPSHOT.pom
[JENKINS] Archiving <https://ci-builds.apache.org/job/Directory/job/dir-kerby-openjdk11/ws/kerby-kerb/kerb-identity/pom.xml> to org.apache.kerby/kerb-identity/2.1.0-SNAPSHOT/kerb-identity-2.1.0-SNAPSHOT.pom
[JENKINS] Archiving <https://ci-builds.apache.org/job/Directory/job/dir-kerby-openjdk11/ws/kerby-backend/pom.xml> to org.apache.kerby/kerby-backend/2.1.0-SNAPSHOT/kerby-backend-2.1.0-SNAPSHOT.pom
[JENKINS] Archiving <https://ci-builds.apache.org/job/Directory/job/dir-kerby-openjdk11/ws/kerby-tool/pom.xml> to org.apache.kerby/kerby-tool/2.1.0-SNAPSHOT/kerby-tool-2.1.0-SNAPSHOT.pom
[JENKINS] Archiving <https://ci-builds.apache.org/job/Directory/job/dir-kerby-openjdk11/ws/pom.xml> to org.apache.kerby/kerby-all/2.1.0-SNAPSHOT/kerby-all-2.1.0-SNAPSHOT.pom
[JENKINS] Archiving <https://ci-builds.apache.org/job/Directory/job/dir-kerby-openjdk11/ws/target/kerby-all-2.1.0-SNAPSHOT-bom.xml> to org.apache.kerby/kerby-all/2.1.0-SNAPSHOT/kerby-all-2.1.0-SNAPSHOT-cyclonedx.xml
[JENKINS] Archiving <https://ci-builds.apache.org/job/Directory/job/dir-kerby-openjdk11/ws/target/kerby-all-2.1.0-SNAPSHOT-bom.json> to org.apache.kerby/kerby-all/2.1.0-SNAPSHOT/kerby-all-2.1.0-SNAPSHOT-cyclonedx.json
[JENKINS] Archiving <https://ci-builds.apache.org/job/Directory/job/dir-kerby-openjdk11/ws/parent/pom.xml> to org.apache.kerby/kerby-parent/2.1.0-SNAPSHOT/kerby-parent-2.1.0-SNAPSHOT.pom
[JENKINS] Archiving <https://ci-builds.apache.org/job/Directory/job/dir-kerby-openjdk11/ws/parent/target/kerby-parent-2.1.0-SNAPSHOT-bom.xml> to org.apache.kerby/kerby-parent/2.1.0-SNAPSHOT/kerby-parent-2.1.0-SNAPSHOT-cyclonedx.xml
[JENKINS] Archiving <https://ci-builds.apache.org/job/Directory/job/dir-kerby-openjdk11/ws/parent/target/kerby-parent-2.1.0-SNAPSHOT-bom.json> to org.apache.kerby/kerby-parent/2.1.0-SNAPSHOT/kerby-parent-2.1.0-SNAPSHOT-cyclonedx.json
[JENKINS] Archiving <https://ci-builds.apache.org/job/Directory/job/dir-kerby-openjdk11/ws/kerby-kerb/kerb-kdc-test/pom.xml> to org.apache.kerby/kerb-kdc-test/2.1.0-SNAPSHOT/kerb-kdc-test-2.1.0-SNAPSHOT.pom
[JENKINS] Archiving <https://ci-builds.apache.org/job/Directory/job/dir-kerby-openjdk11/ws/kerby-dist/tool-dist/pom.xml> to org.apache.kerby/tool-dist/2.1.0-SNAPSHOT/tool-dist-2.1.0-SNAPSHOT.pom
[JENKINS] Archiving <https://ci-builds.apache.org/job/Directory/job/dir-kerby-openjdk11/ws/kerby-kerb/kerb-identity-test/pom.xml> to org.apache.kerby/kerb-identity-test/2.1.0-SNAPSHOT/kerb-identity-test-2.1.0-SNAPSHOT.pom
[JENKINS] Archiving <https://ci-builds.apache.org/job/Directory/job/dir-kerby-openjdk11/ws/kerby-kerb/kerb-server-api-all/pom.xml> to org.apache.kerby/kerb-server-api-all/2.1.0-SNAPSHOT/kerb-server-api-all-2.1.0-SNAPSHOT.pom
channel stopped
Build failed in Jenkins: Directory » dir-kerby-openjdk11 #389
Posted by Apache Jenkins Server <je...@builds.apache.org>.
See <https://ci-builds.apache.org/job/Directory/job/dir-kerby-openjdk11/389/display/redirect>
Changes:
------------------------------------------
[...truncated 46.97 KB...]
[INFO] Preparing remote bundle org.apache.apache.resources:apache-jar-resource-bundle:1.5
[INFO] Copying 3 resources from 1 bundle.
[INFO]
[INFO] --- resources:3.3.1:resources (default-resources) @ kerby-asn1 ---
[INFO] skip non existing resourceDirectory <https://ci-builds.apache.org/job/Directory/job/dir-kerby-openjdk11/ws/kerby-common/kerby-asn1/src/main/resources>
[INFO] Copying 3 resources from target/maven-shared-archive-resources to target/classes
[INFO]
[INFO] --- compiler:3.13.0:compile (default-compile) @ kerby-asn1 ---
[INFO] Recompiling the module because of changed source code.
[INFO] Compiling 69 source files with javac [debug release 7] to target/classes
[INFO] <https://ci-builds.apache.org/job/Directory/job/dir-kerby-openjdk11/ws/kerby-common/kerby-asn1/src/main/java/org/apache/kerby/asn1/type/Asn1Any.java>: Some input files use unchecked or unsafe operations.
[INFO] <https://ci-builds.apache.org/job/Directory/job/dir-kerby-openjdk11/ws/kerby-common/kerby-asn1/src/main/java/org/apache/kerby/asn1/type/Asn1Any.java>: Recompile with -Xlint:unchecked for details.
[INFO]
[INFO] --- resources:3.3.1:testResources (default-testResources) @ kerby-asn1 ---
[INFO] Copying 5 resources from src/test/resources to target/test-classes
[INFO] Copying 3 resources from target/maven-shared-archive-resources to target/test-classes
[INFO]
[INFO] --- compiler:3.13.0:testCompile (default-testCompile) @ kerby-asn1 ---
[INFO] Recompiling the module because of changed dependency.
[INFO] Compiling 15 source files with javac [debug release 7] to target/test-classes
[INFO] -------------------------------------------------------------
[ERROR] COMPILATION ERROR :
[INFO] -------------------------------------------------------------
[ERROR] <https://ci-builds.apache.org/job/Directory/job/dir-kerby-openjdk11/ws/kerby-common/kerby-asn1/src/test/java/org/apache/kerby/asn1/Asn1BooleanTest.java>:[48,9] cannot access java.util.function.Predicate
class file for java.util.function.Predicate not found
[ERROR] <https://ci-builds.apache.org/job/Directory/job/dir-kerby-openjdk11/ws/kerby-common/kerby-asn1/src/test/java/org/apache/kerby/asn1/Asn1BooleanTest.java>:[68,9] cannot access java.util.function.IntPredicate
class file for java.util.function.IntPredicate not found
[ERROR] <https://ci-builds.apache.org/job/Directory/job/dir-kerby-openjdk11/ws/kerby-common/kerby-asn1/src/test/java/org/apache/kerby/asn1/Asn1CollectionTest.java>:[46,9] cannot access java.util.function.LongPredicate
class file for java.util.function.LongPredicate not found
[ERROR] <https://ci-builds.apache.org/job/Directory/job/dir-kerby-openjdk11/ws/kerby-common/kerby-asn1/src/test/java/org/apache/kerby/asn1/Asn1CollectionTest.java>:[55,9] cannot access java.util.function.DoublePredicate
class file for java.util.function.DoublePredicate not found
[ERROR] <https://ci-builds.apache.org/job/Directory/job/dir-kerby-openjdk11/ws/kerby-common/kerby-asn1/src/test/java/org/apache/kerby/asn1/Asn1CollectionTest.java>:[58,9] cannot access java.util.concurrent.CompletableFuture
class file for java.util.concurrent.CompletableFuture not found
[ERROR] <https://ci-builds.apache.org/job/Directory/job/dir-kerby-openjdk11/ws/kerby-common/kerby-asn1/src/test/java/org/apache/kerby/asn1/Asn1DumpTest.java>:[39,23] cannot access java.util.function.Supplier
class file for java.util.function.Supplier not found
[ERROR] <https://ci-builds.apache.org/job/Directory/job/dir-kerby-openjdk11/ws/kerby-common/kerby-asn1/src/test/java/org/apache/kerby/asn1/Asn1FlagsTest.java>:[106,5] cannot access java.util.function.BooleanSupplier
class file for java.util.function.BooleanSupplier not found
[ERROR] <https://ci-builds.apache.org/job/Directory/job/dir-kerby-openjdk11/ws/kerby-common/kerby-asn1/src/test/java/org/apache/kerby/asn1/Asn1GeneralizedTimeTest.java>:[66,9] cannot access java.util.concurrent.CompletionStage
class file for java.util.concurrent.CompletionStage not found
[ERROR] <https://ci-builds.apache.org/job/Directory/job/dir-kerby-openjdk11/ws/kerby-common/kerby-asn1/src/test/java/org/apache/kerby/asn1/Asn1IntegerTest.java>:[50,9] cannot access java.util.Optional
class file for java.util.Optional not found
[ERROR] <https://ci-builds.apache.org/job/Directory/job/dir-kerby-openjdk11/ws/kerby-common/kerby-asn1/src/test/java/org/apache/kerby/asn1/Asn1IntegerTest.java>:[70,9] cannot access java.util.OptionalDouble
class file for java.util.OptionalDouble not found
[ERROR] <https://ci-builds.apache.org/job/Directory/job/dir-kerby-openjdk11/ws/kerby-common/kerby-asn1/src/test/java/org/apache/kerby/asn1/Asn1ObjectIdentifierTest.java>:[51,9] cannot access java.util.OptionalInt
class file for java.util.OptionalInt not found
[ERROR] <https://ci-builds.apache.org/job/Directory/job/dir-kerby-openjdk11/ws/kerby-common/kerby-asn1/src/test/java/org/apache/kerby/asn1/Asn1ObjectIdentifierTest.java>:[64,9] cannot access java.util.OptionalLong
class file for java.util.OptionalLong not found
[ERROR] <https://ci-builds.apache.org/job/Directory/job/dir-kerby-openjdk11/ws/kerby-common/kerby-asn1/src/test/java/org/apache/kerby/asn1/Asn1UtcTimeTest.java>:[76,9] cannot access java.time.ZonedDateTime
class file for java.time.ZonedDateTime not found
[ERROR] <https://ci-builds.apache.org/job/Directory/job/dir-kerby-openjdk11/ws/kerby-common/kerby-asn1/src/test/java/org/apache/kerby/asn1/Asn1UtcTimeTest.java>:[92,9] cannot access java.time.LocalDateTime
class file for java.time.LocalDateTime not found
[ERROR] <https://ci-builds.apache.org/job/Directory/job/dir-kerby-openjdk11/ws/kerby-common/kerby-asn1/src/test/java/org/apache/kerby/asn1/Asn1Utf8StringTest.java>:[43,9] cannot access java.time.OffsetDateTime
class file for java.time.OffsetDateTime not found
[ERROR] <https://ci-builds.apache.org/job/Directory/job/dir-kerby-openjdk11/ws/kerby-common/kerby-asn1/src/test/java/org/apache/kerby/asn1/Asn1Utf8StringTest.java>:[44,9] cannot access java.time.OffsetTime
class file for java.time.OffsetTime not found
[ERROR] <https://ci-builds.apache.org/job/Directory/job/dir-kerby-openjdk11/ws/kerby-common/kerby-asn1/src/test/java/org/apache/kerby/asn1/Asn1Utf8StringTest.java>:[57,9] cannot access java.time.LocalTime
class file for java.time.LocalTime not found
[ERROR] <https://ci-builds.apache.org/job/Directory/job/dir-kerby-openjdk11/ws/kerby-common/kerby-asn1/src/test/java/org/apache/kerby/asn1/Asn1Utf8StringTest.java>:[58,9] cannot access java.time.LocalDate
class file for java.time.LocalDate not found
[ERROR] <https://ci-builds.apache.org/job/Directory/job/dir-kerby-openjdk11/ws/kerby-common/kerby-asn1/src/test/java/org/apache/kerby/asn1/PersonnelRecordTest.java>:[72,9] cannot access java.time.Instant
class file for java.time.Instant not found
[ERROR] <https://ci-builds.apache.org/job/Directory/job/dir-kerby-openjdk11/ws/kerby-common/kerby-asn1/src/test/java/org/apache/kerby/asn1/PersonnelRecordTest.java>:[84,9] cannot access java.time.Duration
class file for java.time.Duration not found
[ERROR] <https://ci-builds.apache.org/job/Directory/job/dir-kerby-openjdk11/ws/kerby-common/kerby-asn1/src/test/java/org/apache/kerby/asn1/PersonnelRecordTest.java>:[86,9] cannot access java.time.Period
class file for java.time.Period not found
[ERROR] <https://ci-builds.apache.org/job/Directory/job/dir-kerby-openjdk11/ws/kerby-common/kerby-asn1/src/test/java/org/apache/kerby/asn1/PersonnelRecordTest.java>:[88,9] cannot access java.util.concurrent.atomic.LongAdder
class file for java.util.concurrent.atomic.LongAdder not found
[ERROR] <https://ci-builds.apache.org/job/Directory/job/dir-kerby-openjdk11/ws/kerby-common/kerby-asn1/src/test/java/org/apache/kerby/asn1/PersonnelRecordTest.java>:[90,9] cannot access java.util.stream.Stream
class file for java.util.stream.Stream not found
[ERROR] <https://ci-builds.apache.org/job/Directory/job/dir-kerby-openjdk11/ws/kerby-common/kerby-asn1/src/test/java/org/apache/kerby/asn1/PersonnelRecordTest.java>:[92,9] cannot access java.util.stream.DoubleStream
class file for java.util.stream.DoubleStream not found
[ERROR] <https://ci-builds.apache.org/job/Directory/job/dir-kerby-openjdk11/ws/kerby-common/kerby-asn1/src/test/java/org/apache/kerby/asn1/PersonnelRecordTest.java>:[94,9] cannot access java.util.stream.LongStream
class file for java.util.stream.LongStream not found
[ERROR] <https://ci-builds.apache.org/job/Directory/job/dir-kerby-openjdk11/ws/kerby-common/kerby-asn1/src/test/java/org/apache/kerby/asn1/PersonnelRecordTest.java>:[96,9] cannot access java.util.stream.IntStream
class file for java.util.stream.IntStream not found
[ERROR] <https://ci-builds.apache.org/job/Directory/job/dir-kerby-openjdk11/ws/kerby-common/kerby-asn1/src/test/java/org/apache/kerby/asn1/PersonnelRecordTest.java>:[98,9] cannot access java.util.Spliterator
class file for java.util.Spliterator not found
[INFO] 27 errors
[INFO] -------------------------------------------------------------
[INFO] ------------------------------------------------------------------------
[INFO] Reactor Summary for Apache Kerby Project 2.1.0-SNAPSHOT:
[INFO]
[INFO] Apache Kerby Project ............................... SUCCESS [01:13 min]
[INFO] Apache Kerby BOM ................................... SUCCESS [ 6.549 s]
[INFO] Apache Directory Kerby Parent pom .................. SUCCESS [ 7.082 s]
[INFO] Kerby-common Project ............................... SUCCESS [ 5.966 s]
[INFO] Kerby ASN1 Project ................................. FAILURE [ 8.854 s]
[INFO] Kerby Config ....................................... SKIPPED
[INFO] Kerby Util ......................................... SKIPPED
[INFO] Kerby XDR Project .................................. SKIPPED
[INFO] Kerby PKIX Project ................................. SKIPPED
[INFO] Kerby-kerb Project ................................. SKIPPED
[INFO] Kerby-kerb core .................................... SKIPPED
[INFO] Kerby-kerb Crypto .................................. SKIPPED
[INFO] Kerby-kerb Common .................................. SKIPPED
[INFO] Kerby-kerb Util .................................... SKIPPED
[INFO] Kerby-kerb Identity ................................ SKIPPED
[INFO] Kerby-kerb Identity Test ........................... SKIPPED
[INFO] Kerby providers .................................... SKIPPED
[INFO] Token provider ..................................... SKIPPED
[INFO] Kerby-kerb Client .................................. SKIPPED
[INFO] Kerby-kerb Server .................................. SKIPPED
[INFO] Kerby-kerb Admin ................................... SKIPPED
[INFO] Kerb Simple Kdc .................................... SKIPPED
[INFO] Kerby-kerb server all .............................. SKIPPED
[INFO] Kerby KDC Server ................................... SKIPPED
[INFO] Kerb Kdc Test ...................................... SKIPPED
[INFO] Kerby-kerb GssAPI .................................. SKIPPED
[INFO] Kerb Integration Test .............................. SKIPPED
[INFO] Kerby Backend ...................................... SKIPPED
[INFO] Zookeeper identity backend ......................... SKIPPED
[INFO] Kerby-kerb Admin Server ............................ SKIPPED
[INFO] Kerby-kerb client api all .......................... SKIPPED
[INFO] Json identity backend .............................. SKIPPED
[INFO] Kerby Kdc Test ..................................... SKIPPED
[INFO] Ldap identity backend .............................. SKIPPED
[INFO] Mavibot based backend .............................. SKIPPED
[INFO] MySQL identity backend ............................. SKIPPED
[INFO] Kerby benchmark .................................... SKIPPED
[INFO] Kdc Tool Project ................................... SKIPPED
[INFO] Client Tool ........................................ SKIPPED
[INFO] KDC Tool ........................................... SKIPPED
[INFO] Kerby Distribution ................................. SKIPPED
[INFO] KDC Dist ........................................... SKIPPED
[INFO] Tool Dist .......................................... SKIPPED
[INFO] ------------------------------------------------------------------------
[INFO] BUILD FAILURE
[INFO] ------------------------------------------------------------------------
[INFO] Total time: 02:45 min
[INFO] Finished at: 2024-05-21T12:36:29Z
[INFO] ------------------------------------------------------------------------
Waiting for Jenkins to finish collecting data
[ERROR] Failed to execute goal org.apache.maven.plugins:maven-compiler-plugin:3.13.0:testCompile (default-testCompile) on project kerby-asn1: Compilation failure: Compilation failure:
[ERROR] <https://ci-builds.apache.org/job/Directory/job/dir-kerby-openjdk11/ws/kerby-common/kerby-asn1/src/test/java/org/apache/kerby/asn1/Asn1BooleanTest.java>:[48,9] cannot access java.util.function.Predicate
[ERROR] class file for java.util.function.Predicate not found
[ERROR] <https://ci-builds.apache.org/job/Directory/job/dir-kerby-openjdk11/ws/kerby-common/kerby-asn1/src/test/java/org/apache/kerby/asn1/Asn1BooleanTest.java>:[68,9] cannot access java.util.function.IntPredicate
[ERROR] class file for java.util.function.IntPredicate not found
[ERROR] <https://ci-builds.apache.org/job/Directory/job/dir-kerby-openjdk11/ws/kerby-common/kerby-asn1/src/test/java/org/apache/kerby/asn1/Asn1CollectionTest.java>:[46,9] cannot access java.util.function.LongPredicate
[ERROR] class file for java.util.function.LongPredicate not found
[ERROR] <https://ci-builds.apache.org/job/Directory/job/dir-kerby-openjdk11/ws/kerby-common/kerby-asn1/src/test/java/org/apache/kerby/asn1/Asn1CollectionTest.java>:[55,9] cannot access java.util.function.DoublePredicate
[ERROR] class file for java.util.function.DoublePredicate not found
[ERROR] <https://ci-builds.apache.org/job/Directory/job/dir-kerby-openjdk11/ws/kerby-common/kerby-asn1/src/test/java/org/apache/kerby/asn1/Asn1CollectionTest.java>:[58,9] cannot access java.util.concurrent.CompletableFuture
[ERROR] class file for java.util.concurrent.CompletableFuture not found
[ERROR] <https://ci-builds.apache.org/job/Directory/job/dir-kerby-openjdk11/ws/kerby-common/kerby-asn1/src/test/java/org/apache/kerby/asn1/Asn1DumpTest.java>:[39,23] cannot access java.util.function.Supplier
[ERROR] class file for java.util.function.Supplier not found
[ERROR] <https://ci-builds.apache.org/job/Directory/job/dir-kerby-openjdk11/ws/kerby-common/kerby-asn1/src/test/java/org/apache/kerby/asn1/Asn1FlagsTest.java>:[106,5] cannot access java.util.function.BooleanSupplier
[ERROR] class file for java.util.function.BooleanSupplier not found
[ERROR] <https://ci-builds.apache.org/job/Directory/job/dir-kerby-openjdk11/ws/kerby-common/kerby-asn1/src/test/java/org/apache/kerby/asn1/Asn1GeneralizedTimeTest.java>:[66,9] cannot access java.util.concurrent.CompletionStage
[ERROR] class file for java.util.concurrent.CompletionStage not found
[ERROR] <https://ci-builds.apache.org/job/Directory/job/dir-kerby-openjdk11/ws/kerby-common/kerby-asn1/src/test/java/org/apache/kerby/asn1/Asn1IntegerTest.java>:[50,9] cannot access java.util.Optional
[ERROR] class file for java.util.Optional not found
[ERROR] <https://ci-builds.apache.org/job/Directory/job/dir-kerby-openjdk11/ws/kerby-common/kerby-asn1/src/test/java/org/apache/kerby/asn1/Asn1IntegerTest.java>:[70,9] cannot access java.util.OptionalDouble
[ERROR] class file for java.util.OptionalDouble not found
[ERROR] <https://ci-builds.apache.org/job/Directory/job/dir-kerby-openjdk11/ws/kerby-common/kerby-asn1/src/test/java/org/apache/kerby/asn1/Asn1ObjectIdentifierTest.java>:[51,9] cannot access java.util.OptionalInt
[ERROR] class file for java.util.OptionalInt not found
[ERROR] <https://ci-builds.apache.org/job/Directory/job/dir-kerby-openjdk11/ws/kerby-common/kerby-asn1/src/test/java/org/apache/kerby/asn1/Asn1ObjectIdentifierTest.java>:[64,9] cannot access java.util.OptionalLong
[ERROR] class file for java.util.OptionalLong not found
[ERROR] <https://ci-builds.apache.org/job/Directory/job/dir-kerby-openjdk11/ws/kerby-common/kerby-asn1/src/test/java/org/apache/kerby/asn1/Asn1UtcTimeTest.java>:[76,9] cannot access java.time.ZonedDateTime
[ERROR] class file for java.time.ZonedDateTime not found
[ERROR] <https://ci-builds.apache.org/job/Directory/job/dir-kerby-openjdk11/ws/kerby-common/kerby-asn1/src/test/java/org/apache/kerby/asn1/Asn1UtcTimeTest.java>:[92,9] cannot access java.time.LocalDateTime
[ERROR] class file for java.time.LocalDateTime not found
[ERROR] <https://ci-builds.apache.org/job/Directory/job/dir-kerby-openjdk11/ws/kerby-common/kerby-asn1/src/test/java/org/apache/kerby/asn1/Asn1Utf8StringTest.java>:[43,9] cannot access java.time.OffsetDateTime
[ERROR] class file for java.time.OffsetDateTime not found
[ERROR] <https://ci-builds.apache.org/job/Directory/job/dir-kerby-openjdk11/ws/kerby-common/kerby-asn1/src/test/java/org/apache/kerby/asn1/Asn1Utf8StringTest.java>:[44,9] cannot access java.time.OffsetTime
[ERROR] class file for java.time.OffsetTime not found
[ERROR] <https://ci-builds.apache.org/job/Directory/job/dir-kerby-openjdk11/ws/kerby-common/kerby-asn1/src/test/java/org/apache/kerby/asn1/Asn1Utf8StringTest.java>:[57,9] cannot access java.time.LocalTime
[ERROR] class file for java.time.LocalTime not found
[ERROR] <https://ci-builds.apache.org/job/Directory/job/dir-kerby-openjdk11/ws/kerby-common/kerby-asn1/src/test/java/org/apache/kerby/asn1/Asn1Utf8StringTest.java>:[58,9] cannot access java.time.LocalDate
[ERROR] class file for java.time.LocalDate not found
[ERROR] <https://ci-builds.apache.org/job/Directory/job/dir-kerby-openjdk11/ws/kerby-common/kerby-asn1/src/test/java/org/apache/kerby/asn1/PersonnelRecordTest.java>:[72,9] cannot access java.time.Instant
[ERROR] class file for java.time.Instant not found
[ERROR] <https://ci-builds.apache.org/job/Directory/job/dir-kerby-openjdk11/ws/kerby-common/kerby-asn1/src/test/java/org/apache/kerby/asn1/PersonnelRecordTest.java>:[84,9] cannot access java.time.Duration
[ERROR] class file for java.time.Duration not found
[ERROR] <https://ci-builds.apache.org/job/Directory/job/dir-kerby-openjdk11/ws/kerby-common/kerby-asn1/src/test/java/org/apache/kerby/asn1/PersonnelRecordTest.java>:[86,9] cannot access java.time.Period
[ERROR] class file for java.time.Period not found
[ERROR] <https://ci-builds.apache.org/job/Directory/job/dir-kerby-openjdk11/ws/kerby-common/kerby-asn1/src/test/java/org/apache/kerby/asn1/PersonnelRecordTest.java>:[88,9] cannot access java.util.concurrent.atomic.LongAdder
[ERROR] class file for java.util.concurrent.atomic.LongAdder not found
[ERROR] <https://ci-builds.apache.org/job/Directory/job/dir-kerby-openjdk11/ws/kerby-common/kerby-asn1/src/test/java/org/apache/kerby/asn1/PersonnelRecordTest.java>:[90,9] cannot access java.util.stream.Stream
[ERROR] class file for java.util.stream.Stream not found
[ERROR] <https://ci-builds.apache.org/job/Directory/job/dir-kerby-openjdk11/ws/kerby-common/kerby-asn1/src/test/java/org/apache/kerby/asn1/PersonnelRecordTest.java>:[92,9] cannot access java.util.stream.DoubleStream
[ERROR] class file for java.util.stream.DoubleStream not found
[ERROR] <https://ci-builds.apache.org/job/Directory/job/dir-kerby-openjdk11/ws/kerby-common/kerby-asn1/src/test/java/org/apache/kerby/asn1/PersonnelRecordTest.java>:[94,9] cannot access java.util.stream.LongStream
[ERROR] class file for java.util.stream.LongStream not found
[ERROR] <https://ci-builds.apache.org/job/Directory/job/dir-kerby-openjdk11/ws/kerby-common/kerby-asn1/src/test/java/org/apache/kerby/asn1/PersonnelRecordTest.java>:[96,9] cannot access java.util.stream.IntStream
[ERROR] class file for java.util.stream.IntStream not found
[ERROR] <https://ci-builds.apache.org/job/Directory/job/dir-kerby-openjdk11/ws/kerby-common/kerby-asn1/src/test/java/org/apache/kerby/asn1/PersonnelRecordTest.java>:[98,9] cannot access java.util.Spliterator
[ERROR] class file for java.util.Spliterator not found
[ERROR] -> [Help 1]
[ERROR]
[ERROR] To see the full stack trace of the errors, re-run Maven with the -e switch.
[ERROR] Re-run Maven using the -X switch to enable full debug logging.
[ERROR]
[ERROR] For more information about the errors and possible solutions, please read the following articles:
[ERROR] [Help 1] http://cwiki.apache.org/confluence/display/MAVEN/MojoFailureException
[ERROR]
[ERROR] After correcting the problems, you can resume the build with the command
[ERROR] mvn <goals> -rf :kerby-asn1
[JENKINS] Archiving <https://ci-builds.apache.org/job/Directory/job/dir-kerby-openjdk11/ws/kerby-backend/mysql-backend/pom.xml> to org.apache.kerby/mysql-backend/2.1.0-SNAPSHOT/mysql-backend-2.1.0-SNAPSHOT.pom
[JENKINS] Archiving <https://ci-builds.apache.org/job/Directory/job/dir-kerby-openjdk11/ws/kerby-backend/json-backend/pom.xml> to org.apache.kerby/json-backend/2.1.0-SNAPSHOT/json-backend-2.1.0-SNAPSHOT.pom
[JENKINS] Archiving <https://ci-builds.apache.org/job/Directory/job/dir-kerby-openjdk11/ws/kerby-backend/ldap-backend/pom.xml> to org.apache.kerby/ldap-backend/2.1.0-SNAPSHOT/ldap-backend-2.1.0-SNAPSHOT.pom
[JENKINS] Archiving <https://ci-builds.apache.org/job/Directory/job/dir-kerby-openjdk11/ws/kerby-pkix/pom.xml> to org.apache.kerby/kerby-pkix/2.1.0-SNAPSHOT/kerby-pkix-2.1.0-SNAPSHOT.pom
[JENKINS] Archiving <https://ci-builds.apache.org/job/Directory/job/dir-kerby-openjdk11/ws/kerby-kdc-test/pom.xml> to org.apache.kerby/kerby-kdc-test/2.1.0-SNAPSHOT/kerby-kdc-test-2.1.0-SNAPSHOT.pom
[JENKINS] Archiving <https://ci-builds.apache.org/job/Directory/job/dir-kerby-openjdk11/ws/kerby-kerb/kerb-util/pom.xml> to org.apache.kerby/kerb-util/2.1.0-SNAPSHOT/kerb-util-2.1.0-SNAPSHOT.pom
[JENKINS] Archiving <https://ci-builds.apache.org/job/Directory/job/dir-kerby-openjdk11/ws/kerby-kerb/kerb-crypto/pom.xml> to org.apache.kerby/kerb-crypto/2.1.0-SNAPSHOT/kerb-crypto-2.1.0-SNAPSHOT.pom
[JENKINS] Archiving <https://ci-builds.apache.org/job/Directory/job/dir-kerby-openjdk11/ws/kerby-provider/token-provider/pom.xml> to org.apache.kerby/token-provider/2.1.0-SNAPSHOT/token-provider-2.1.0-SNAPSHOT.pom
[JENKINS] Archiving <https://ci-builds.apache.org/job/Directory/job/dir-kerby-openjdk11/ws/kerby-kerb/kerb-client-api-all/pom.xml> to org.apache.kerby/kerb-client-api-all/2.1.0-SNAPSHOT/kerb-client-api-all-2.1.0-SNAPSHOT.pom
[JENKINS] Archiving <https://ci-builds.apache.org/job/Directory/job/dir-kerby-openjdk11/ws/kerby-tool/client-tool/pom.xml> to org.apache.kerby/client-tool/2.1.0-SNAPSHOT/client-tool-2.1.0-SNAPSHOT.pom
[JENKINS] Archiving <https://ci-builds.apache.org/job/Directory/job/dir-kerby-openjdk11/ws/kerby-dist/pom.xml> to org.apache.kerby/kerby-dist/2.1.0-SNAPSHOT/kerby-dist-2.1.0-SNAPSHOT.pom
[JENKINS] Archiving <https://ci-builds.apache.org/job/Directory/job/dir-kerby-openjdk11/ws/bom/pom.xml> to org.apache.kerby/kerby-bom/2.1.0-SNAPSHOT/kerby-bom-2.1.0-SNAPSHOT.pom
[JENKINS] Archiving <https://ci-builds.apache.org/job/Directory/job/dir-kerby-openjdk11/ws/bom/target/kerby-bom-2.1.0-SNAPSHOT-bom.xml> to org.apache.kerby/kerby-bom/2.1.0-SNAPSHOT/kerby-bom-2.1.0-SNAPSHOT-cyclonedx.xml
[JENKINS] Archiving <https://ci-builds.apache.org/job/Directory/job/dir-kerby-openjdk11/ws/bom/target/kerby-bom-2.1.0-SNAPSHOT-bom.json> to org.apache.kerby/kerby-bom/2.1.0-SNAPSHOT/kerby-bom-2.1.0-SNAPSHOT-cyclonedx.json
[JENKINS] Archiving <https://ci-builds.apache.org/job/Directory/job/dir-kerby-openjdk11/ws/kerby-kerb/kerb-server/pom.xml> to org.apache.kerby/kerb-server/2.1.0-SNAPSHOT/kerb-server-2.1.0-SNAPSHOT.pom
[JENKINS] Archiving <https://ci-builds.apache.org/job/Directory/job/dir-kerby-openjdk11/ws/kerby-common/kerby-xdr/pom.xml> to org.apache.kerby/kerby-xdr/2.1.0-SNAPSHOT/kerby-xdr-2.1.0-SNAPSHOT.pom
[JENKINS] Archiving <https://ci-builds.apache.org/job/Directory/job/dir-kerby-openjdk11/ws/kerby-kerb/kerb-gssapi/pom.xml> to org.apache.kerby/kerb-gssapi/2.1.0-SNAPSHOT/kerb-gssapi-2.1.0-SNAPSHOT.pom
[JENKINS] Archiving <https://ci-builds.apache.org/job/Directory/job/dir-kerby-openjdk11/ws/kerby-tool/kdc-tool/pom.xml> to org.apache.kerby/kdc-tool/2.1.0-SNAPSHOT/kdc-tool-2.1.0-SNAPSHOT.pom
[JENKINS] Archiving <https://ci-builds.apache.org/job/Directory/job/dir-kerby-openjdk11/ws/kerby-kerb/kerb-admin-server/pom.xml> to org.apache.kerby/kerb-admin-server/2.1.0-SNAPSHOT/kerb-admin-server-2.1.0-SNAPSHOT.pom
[JENKINS] Archiving <https://ci-builds.apache.org/job/Directory/job/dir-kerby-openjdk11/ws/kerby-dist/kdc-dist/pom.xml> to org.apache.kerby/kdc-dist/2.1.0-SNAPSHOT/kdc-dist-2.1.0-SNAPSHOT.pom
[JENKINS] Archiving <https://ci-builds.apache.org/job/Directory/job/dir-kerby-openjdk11/ws/kerby-common/kerby-asn1/pom.xml> to org.apache.kerby/kerby-asn1/2.1.0-SNAPSHOT/kerby-asn1-2.1.0-SNAPSHOT.pom
[JENKINS] Archiving <https://ci-builds.apache.org/job/Directory/job/dir-kerby-openjdk11/ws/benchmark/pom.xml> to org.apache.kerby/benchmark/2.1.0-SNAPSHOT/benchmark-2.1.0-SNAPSHOT.pom
[JENKINS] Archiving <https://ci-builds.apache.org/job/Directory/job/dir-kerby-openjdk11/ws/kerby-common/pom.xml> to org.apache.kerby/kerby-common/2.1.0-SNAPSHOT/kerby-common-2.1.0-SNAPSHOT.pom
[JENKINS] Archiving <https://ci-builds.apache.org/job/Directory/job/dir-kerby-openjdk11/ws/kerby-common/target/kerby-common-2.1.0-SNAPSHOT-bom.xml> to org.apache.kerby/kerby-common/2.1.0-SNAPSHOT/kerby-common-2.1.0-SNAPSHOT-cyclonedx.xml
[JENKINS] Archiving <https://ci-builds.apache.org/job/Directory/job/dir-kerby-openjdk11/ws/kerby-common/target/kerby-common-2.1.0-SNAPSHOT-bom.json> to org.apache.kerby/kerby-common/2.1.0-SNAPSHOT/kerby-common-2.1.0-SNAPSHOT-cyclonedx.json
[JENKINS] Archiving <https://ci-builds.apache.org/job/Directory/job/dir-kerby-openjdk11/ws/kerby-provider/pom.xml> to org.apache.kerby/kerby-provider/2.1.0-SNAPSHOT/kerby-provider-2.1.0-SNAPSHOT.pom
[JENKINS] Archiving <https://ci-builds.apache.org/job/Directory/job/dir-kerby-openjdk11/ws/kerby-kerb/kerb-admin/pom.xml> to org.apache.kerby/kerb-admin/2.1.0-SNAPSHOT/kerb-admin-2.1.0-SNAPSHOT.pom
[JENKINS] Archiving <https://ci-builds.apache.org/job/Directory/job/dir-kerby-openjdk11/ws/kerby-kerb/integration-test/pom.xml> to org.apache.kerby/integration-test/2.1.0-SNAPSHOT/integration-test-2.1.0-SNAPSHOT.pom
[JENKINS] Archiving <https://ci-builds.apache.org/job/Directory/job/dir-kerby-openjdk11/ws/kerby-kerb/kerb-simplekdc/pom.xml> to org.apache.kerby/kerb-simplekdc/2.1.0-SNAPSHOT/kerb-simplekdc-2.1.0-SNAPSHOT.pom
[JENKINS] Archiving <https://ci-builds.apache.org/job/Directory/job/dir-kerby-openjdk11/ws/kerby-kerb/kerb-client/pom.xml> to org.apache.kerby/kerb-client/2.1.0-SNAPSHOT/kerb-client-2.1.0-SNAPSHOT.pom
[JENKINS] Archiving <https://ci-builds.apache.org/job/Directory/job/dir-kerby-openjdk11/ws/kerby-kerb/pom.xml> to org.apache.kerby/kerby-kerb/2.1.0-SNAPSHOT/kerby-kerb-2.1.0-SNAPSHOT.pom
[JENKINS] Archiving <https://ci-builds.apache.org/job/Directory/job/dir-kerby-openjdk11/ws/kerby-backend/mavibot-backend/pom.xml> to org.apache.kerby/mavibot-backend/2.1.0-SNAPSHOT/mavibot-backend-2.1.0-SNAPSHOT.pom
[JENKINS] Archiving <https://ci-builds.apache.org/job/Directory/job/dir-kerby-openjdk11/ws/kerby-backend/zookeeper-backend/pom.xml> to org.apache.kerby/zookeeper-backend/2.1.0-SNAPSHOT/zookeeper-backend-2.1.0-SNAPSHOT.pom
[JENKINS] Archiving <https://ci-builds.apache.org/job/Directory/job/dir-kerby-openjdk11/ws/kerby-common/kerby-config/pom.xml> to org.apache.kerby/kerby-config/2.1.0-SNAPSHOT/kerby-config-2.1.0-SNAPSHOT.pom
[JENKINS] Archiving <https://ci-builds.apache.org/job/Directory/job/dir-kerby-openjdk11/ws/kerby-common/kerby-util/pom.xml> to org.apache.kerby/kerby-util/2.1.0-SNAPSHOT/kerby-util-2.1.0-SNAPSHOT.pom
[JENKINS] Archiving <https://ci-builds.apache.org/job/Directory/job/dir-kerby-openjdk11/ws/kerby-kerb/kerb-common/pom.xml> to org.apache.kerby/kerb-common/2.1.0-SNAPSHOT/kerb-common-2.1.0-SNAPSHOT.pom
[JENKINS] Archiving <https://ci-builds.apache.org/job/Directory/job/dir-kerby-openjdk11/ws/kerby-kerb/kerb-core/pom.xml> to org.apache.kerby/kerb-core/2.1.0-SNAPSHOT/kerb-core-2.1.0-SNAPSHOT.pom
[JENKINS] Archiving <https://ci-builds.apache.org/job/Directory/job/dir-kerby-openjdk11/ws/kerby-kdc/pom.xml> to org.apache.kerby/kerby-kdc/2.1.0-SNAPSHOT/kerby-kdc-2.1.0-SNAPSHOT.pom
[JENKINS] Archiving <https://ci-builds.apache.org/job/Directory/job/dir-kerby-openjdk11/ws/kerby-kerb/kerb-identity/pom.xml> to org.apache.kerby/kerb-identity/2.1.0-SNAPSHOT/kerb-identity-2.1.0-SNAPSHOT.pom
[JENKINS] Archiving <https://ci-builds.apache.org/job/Directory/job/dir-kerby-openjdk11/ws/kerby-backend/pom.xml> to org.apache.kerby/kerby-backend/2.1.0-SNAPSHOT/kerby-backend-2.1.0-SNAPSHOT.pom
[JENKINS] Archiving <https://ci-builds.apache.org/job/Directory/job/dir-kerby-openjdk11/ws/kerby-tool/pom.xml> to org.apache.kerby/kerby-tool/2.1.0-SNAPSHOT/kerby-tool-2.1.0-SNAPSHOT.pom
[JENKINS] Archiving <https://ci-builds.apache.org/job/Directory/job/dir-kerby-openjdk11/ws/pom.xml> to org.apache.kerby/kerby-all/2.1.0-SNAPSHOT/kerby-all-2.1.0-SNAPSHOT.pom
[JENKINS] Archiving <https://ci-builds.apache.org/job/Directory/job/dir-kerby-openjdk11/ws/target/kerby-all-2.1.0-SNAPSHOT-bom.xml> to org.apache.kerby/kerby-all/2.1.0-SNAPSHOT/kerby-all-2.1.0-SNAPSHOT-cyclonedx.xml
[JENKINS] Archiving <https://ci-builds.apache.org/job/Directory/job/dir-kerby-openjdk11/ws/target/kerby-all-2.1.0-SNAPSHOT-bom.json> to org.apache.kerby/kerby-all/2.1.0-SNAPSHOT/kerby-all-2.1.0-SNAPSHOT-cyclonedx.json
[JENKINS] Archiving <https://ci-builds.apache.org/job/Directory/job/dir-kerby-openjdk11/ws/parent/pom.xml> to org.apache.kerby/kerby-parent/2.1.0-SNAPSHOT/kerby-parent-2.1.0-SNAPSHOT.pom
[JENKINS] Archiving <https://ci-builds.apache.org/job/Directory/job/dir-kerby-openjdk11/ws/parent/target/kerby-parent-2.1.0-SNAPSHOT-bom.xml> to org.apache.kerby/kerby-parent/2.1.0-SNAPSHOT/kerby-parent-2.1.0-SNAPSHOT-cyclonedx.xml
[JENKINS] Archiving <https://ci-builds.apache.org/job/Directory/job/dir-kerby-openjdk11/ws/parent/target/kerby-parent-2.1.0-SNAPSHOT-bom.json> to org.apache.kerby/kerby-parent/2.1.0-SNAPSHOT/kerby-parent-2.1.0-SNAPSHOT-cyclonedx.json
[JENKINS] Archiving <https://ci-builds.apache.org/job/Directory/job/dir-kerby-openjdk11/ws/kerby-kerb/kerb-kdc-test/pom.xml> to org.apache.kerby/kerb-kdc-test/2.1.0-SNAPSHOT/kerb-kdc-test-2.1.0-SNAPSHOT.pom
[JENKINS] Archiving <https://ci-builds.apache.org/job/Directory/job/dir-kerby-openjdk11/ws/kerby-dist/tool-dist/pom.xml> to org.apache.kerby/tool-dist/2.1.0-SNAPSHOT/tool-dist-2.1.0-SNAPSHOT.pom
[JENKINS] Archiving <https://ci-builds.apache.org/job/Directory/job/dir-kerby-openjdk11/ws/kerby-kerb/kerb-identity-test/pom.xml> to org.apache.kerby/kerb-identity-test/2.1.0-SNAPSHOT/kerb-identity-test-2.1.0-SNAPSHOT.pom
[JENKINS] Archiving <https://ci-builds.apache.org/job/Directory/job/dir-kerby-openjdk11/ws/kerby-kerb/kerb-server-api-all/pom.xml> to org.apache.kerby/kerb-server-api-all/2.1.0-SNAPSHOT/kerb-server-api-all-2.1.0-SNAPSHOT.pom
channel stopped