You are viewing a plain text version of this content. The canonical link for it is here.
Posted to builds@beam.apache.org by Apache Jenkins Server <je...@builds.apache.org> on 2023/10/26 17:34:00 UTC

Build failed in Jenkins: beam_PreCommit_Java_GCP_IO_Direct_Cron #1928

See <https://ci-beam.apache.org/job/beam_PreCommit_Java_GCP_IO_Direct_Cron/1928/display/redirect?page=changes>

Changes:

[noreply] Set correct markers for the other test scenario. (#29141)


------------------------------------------
[...truncated 3.73 MB...]
	at org.gradle.internal.event.ListenerBroadcast.dispatch(ListenerBroadcast.java:148)
	at org.gradle.internal.event.ListenerBroadcast.dispatch(ListenerBroadcast.java:37)
	at org.gradle.internal.dispatch.ProxyDispatchAdapter$DispatchingInvocationHandler.invoke(ProxyDispatchAdapter.java:94)
	at com.sun.proxy.$Proxy118.onOutput(Unknown Source)
	at org.gradle.api.internal.tasks.testing.results.TestListenerAdapter.output(TestListenerAdapter.java:56)
	at sun.reflect.GeneratedMethodAccessor622.invoke(Unknown Source)
	at sun.reflect.DelegatingMethodAccessorImpl.invoke(DelegatingMethodAccessorImpl.java:43)
	at java.lang.reflect.Method.invoke(Method.java:498)
	at org.gradle.internal.dispatch.ReflectionDispatch.dispatch(ReflectionDispatch.java:36)
	at org.gradle.internal.dispatch.ReflectionDispatch.dispatch(ReflectionDispatch.java:24)
	at org.gradle.internal.event.AbstractBroadcastDispatch.dispatch(AbstractBroadcastDispatch.java:43)
	at org.gradle.internal.event.BroadcastDispatch$SingletonDispatch.dispatch(BroadcastDispatch.java:268)
	at org.gradle.internal.event.BroadcastDispatch$SingletonDispatch.dispatch(BroadcastDispatch.java:170)
	at org.gradle.internal.event.AbstractBroadcastDispatch.dispatch(AbstractBroadcastDispatch.java:83)
	at org.gradle.internal.event.AbstractBroadcastDispatch.dispatch(AbstractBroadcastDispatch.java:69)
	at org.gradle.internal.event.BroadcastDispatch$CompositeDispatch.dispatch(BroadcastDispatch.java:381)
	at org.gradle.internal.event.BroadcastDispatch$CompositeDispatch.dispatch(BroadcastDispatch.java:272)
	at org.gradle.internal.event.ListenerBroadcast.dispatch(ListenerBroadcast.java:148)
	at org.gradle.internal.event.ListenerBroadcast.dispatch(ListenerBroadcast.java:37)
	at org.gradle.internal.dispatch.ProxyDispatchAdapter$DispatchingInvocationHandler.invoke(ProxyDispatchAdapter.java:94)
	at com.sun.proxy.$Proxy119.output(Unknown Source)
	at org.gradle.api.internal.tasks.testing.results.StateTrackingTestResultProcessor.output(StateTrackingTestResultProcessor.java:113)
	at org.gradle.api.internal.tasks.testing.results.AttachParentTestResultProcessor.output(AttachParentTestResultProcessor.java:52)
	at sun.reflect.GeneratedMethodAccessor626.invoke(Unknown Source)
	at sun.reflect.DelegatingMethodAccessorImpl.invoke(DelegatingMethodAccessorImpl.java:43)
	at java.lang.reflect.Method.invoke(Method.java:498)
	at org.gradle.internal.dispatch.ReflectionDispatch.dispatch(ReflectionDispatch.java:36)
	at org.gradle.internal.dispatch.ReflectionDispatch.dispatch(ReflectionDispatch.java:24)
	at org.gradle.internal.dispatch.FailureHandlingDispatch.dispatch(FailureHandlingDispatch.java:30)
	at org.gradle.internal.dispatch.AsyncDispatch.dispatchMessages(AsyncDispatch.java:87)
	at org.gradle.internal.dispatch.AsyncDispatch.access$000(AsyncDispatch.java:36)
	at org.gradle.internal.dispatch.AsyncDispatch$1.run(AsyncDispatch.java:71)
	at org.gradle.internal.concurrent.InterruptibleRunnable.run(InterruptibleRunnable.java:42)
	at org.gradle.internal.operations.CurrentBuildOperationRef.with(CurrentBuildOperationRef.java:80)
	at org.gradle.internal.operations.CurrentBuildOperationPreservingRunnable.run(CurrentBuildOperationPreservingRunnable.java:51)
	at org.gradle.internal.concurrent.ExecutorPolicy$CatchAndRecordFailures.onExecute(ExecutorPolicy.java:64)
	at org.gradle.internal.concurrent.AbstractManagedExecutor$1.run(AbstractManagedExecutor.java:47)
	at java.util.concurrent.ThreadPoolExecutor.runWorker(ThreadPoolExecutor.java:1149)
	at java.util.concurrent.ThreadPoolExecutor$Worker.run(ThreadPoolExecutor.java:624)
	at java.lang.Thread.run(Thread.java:750)
Caused by: java.io.IOException: No space left on device
	at java.io.FileOutputStream.writeBytes(Native Method)
	at java.io.FileOutputStream.write(FileOutputStream.java:326)
	at com.esotericsoftware.kryo.io.Output.flush(Output.java:163)
	... 57 more
java.io.IOException: No space left on device
com.esotericsoftware.kryo.KryoException: java.io.IOException: No space left on device
	at com.esotericsoftware.kryo.io.Output.flush(Output.java:165)
	at com.esotericsoftware.kryo.io.Output.require(Output.java:142)
	at com.esotericsoftware.kryo.io.Output.writeBoolean(Output.java:613)
	at org.gradle.internal.serialize.kryo.KryoBackedEncoder.writeBoolean(KryoBackedEncoder.java:73)
	at org.gradle.api.internal.tasks.testing.junit.result.TestOutputStore$Writer.onOutput(TestOutputStore.java:107)
	at org.gradle.api.internal.tasks.testing.junit.result.TestReportDataCollector.onOutput(TestReportDataCollector.java:167)
	at sun.reflect.GeneratedMethodAccessor623.invoke(Unknown Source)
	at sun.reflect.DelegatingMethodAccessorImpl.invoke(DelegatingMethodAccessorImpl.java:43)
	at java.lang.reflect.Method.invoke(Method.java:498)
	at org.gradle.internal.dispatch.ReflectionDispatch.dispatch(ReflectionDispatch.java:36)
	at org.gradle.internal.dispatch.ReflectionDispatch.dispatch(ReflectionDispatch.java:24)
	at org.gradle.internal.event.AbstractBroadcastDispatch.dispatch(AbstractBroadcastDispatch.java:43)
	at org.gradle.internal.event.BroadcastDispatch$SingletonDispatch.dispatch(BroadcastDispatch.java:268)
	at org.gradle.internal.event.BroadcastDispatch$SingletonDispatch.dispatch(BroadcastDispatch.java:170)
	at org.gradle.internal.event.AbstractBroadcastDispatch.dispatch(AbstractBroadcastDispatch.java:83)
	at org.gradle.internal.event.AbstractBroadcastDispatch.dispatch(AbstractBroadcastDispatch.java:69)
	at org.gradle.internal.event.BroadcastDispatch$CompositeDispatch.dispatch(BroadcastDispatch.java:381)
	at org.gradle.internal.event.BroadcastDispatch$CompositeDispatch.dispatch(BroadcastDispatch.java:272)
	at org.gradle.internal.event.ListenerBroadcast.dispatch(ListenerBroadcast.java:148)
	at org.gradle.internal.event.ListenerBroadcast.dispatch(ListenerBroadcast.java:37)
	at org.gradle.internal.dispatch.ProxyDispatchAdapter$DispatchingInvocationHandler.invoke(ProxyDispatchAdapter.java:94)
	at com.sun.proxy.$Proxy118.onOutput(Unknown Source)
	at org.gradle.api.internal.tasks.testing.results.TestListenerAdapter.output(TestListenerAdapter.java:56)
	at sun.reflect.GeneratedMethodAccessor622.invoke(Unknown Source)
	at sun.reflect.DelegatingMethodAccessorImpl.invoke(DelegatingMethodAccessorImpl.java:43)
	at java.lang.reflect.Method.invoke(Method.java:498)
	at org.gradle.internal.dispatch.ReflectionDispatch.dispatch(ReflectionDispatch.java:36)
	at org.gradle.internal.dispatch.ReflectionDispatch.dispatch(ReflectionDispatch.java:24)
	at org.gradle.internal.event.AbstractBroadcastDispatch.dispatch(AbstractBroadcastDispatch.java:43)
	at org.gradle.internal.event.BroadcastDispatch$SingletonDispatch.dispatch(BroadcastDispatch.java:268)
	at org.gradle.internal.event.BroadcastDispatch$SingletonDispatch.dispatch(BroadcastDispatch.java:170)
	at org.gradle.internal.event.AbstractBroadcastDispatch.dispatch(AbstractBroadcastDispatch.java:83)
	at org.gradle.internal.event.AbstractBroadcastDispatch.dispatch(AbstractBroadcastDispatch.java:69)
	at org.gradle.internal.event.BroadcastDispatch$CompositeDispatch.dispatch(BroadcastDispatch.java:381)
	at org.gradle.internal.event.BroadcastDispatch$CompositeDispatch.dispatch(BroadcastDispatch.java:272)
	at org.gradle.internal.event.ListenerBroadcast.dispatch(ListenerBroadcast.java:148)
	at org.gradle.internal.event.ListenerBroadcast.dispatch(ListenerBroadcast.java:37)
	at org.gradle.internal.dispatch.ProxyDispatchAdapter$DispatchingInvocationHandler.invoke(ProxyDispatchAdapter.java:94)
	at com.sun.proxy.$Proxy119.output(Unknown Source)
	at org.gradle.api.internal.tasks.testing.results.StateTrackingTestResultProcessor.output(StateTrackingTestResultProcessor.java:113)
	at org.gradle.api.internal.tasks.testing.results.AttachParentTestResultProcessor.output(AttachParentTestResultProcessor.java:52)
	at sun.reflect.GeneratedMethodAccessor626.invoke(Unknown Source)
	at sun.reflect.DelegatingMethodAccessorImpl.invoke(DelegatingMethodAccessorImpl.java:43)
	at java.lang.reflect.Method.invoke(Method.java:498)
	at org.gradle.internal.dispatch.ReflectionDispatch.dispatch(ReflectionDispatch.java:36)
	at org.gradle.internal.dispatch.ReflectionDispatch.dispatch(ReflectionDispatch.java:24)
	at org.gradle.internal.dispatch.FailureHandlingDispatch.dispatch(FailureHandlingDispatch.java:30)
	at org.gradle.internal.dispatch.AsyncDispatch.dispatchMessages(AsyncDispatch.java:87)
	at org.gradle.internal.dispatch.AsyncDispatch.access$000(AsyncDispatch.java:36)
	at org.gradle.internal.dispatch.AsyncDispatch$1.run(AsyncDispatch.java:71)
	at org.gradle.internal.concurrent.InterruptibleRunnable.run(InterruptibleRunnable.java:42)
	at org.gradle.internal.operations.CurrentBuildOperationRef.with(CurrentBuildOperationRef.java:80)
	at org.gradle.internal.operations.CurrentBuildOperationPreservingRunnable.run(CurrentBuildOperationPreservingRunnable.java:51)
	at org.gradle.internal.concurrent.ExecutorPolicy$CatchAndRecordFailures.onExecute(ExecutorPolicy.java:64)
	at org.gradle.internal.concurrent.AbstractManagedExecutor$1.run(AbstractManagedExecutor.java:47)
	at java.util.concurrent.ThreadPoolExecutor.runWorker(ThreadPoolExecutor.java:1149)
	at java.util.concurrent.ThreadPoolExecutor$Worker.run(ThreadPoolExecutor.java:624)
	at java.lang.Thread.run(Thread.java:750)
Caused by: java.io.IOException: No space left on device
	at java.io.FileOutputStream.writeBytes(Native Method)
	at java.io.FileOutputStream.write(FileOutputStream.java:326)
	at com.esotericsoftware.kryo.io.Output.flush(Output.java:163)
	... 57 more
java.io.IOException: No space left on device
com.esotericsoftware.kryo.KryoException: java.io.IOException: No space left on device
	at com.esotericsoftware.kryo.io.Output.flush(Output.java:165)
	at com.esotericsoftware.kryo.io.Output.require(Output.java:142)
	at com.esotericsoftware.kryo.io.Output.writeBoolean(Output.java:613)
	at org.gradle.internal.serialize.kryo.KryoBackedEncoder.writeBoolean(KryoBackedEncoder.java:73)
	at org.gradle.api.internal.tasks.testing.junit.result.TestOutputStore$Writer.onOutput(TestOutputStore.java:107)
	at org.gradle.api.internal.tasks.testing.junit.result.TestReportDataCollector.onOutput(TestReportDataCollector.java:167)
	at sun.reflect.GeneratedMethodAccessor623.invoke(Unknown Source)
	at sun.reflect.DelegatingMethodAccessorImpl.invoke(DelegatingMethodAccessorImpl.java:43)
	at java.lang.reflect.Method.invoke(Method.java:498)
	at org.gradle.internal.dispatch.ReflectionDispatch.dispatch(ReflectionDispatch.java:36)
	at org.gradle.internal.dispatch.ReflectionDispatch.dispatch(ReflectionDispatch.java:24)
	at org.gradle.internal.event.AbstractBroadcastDispatch.dispatch(AbstractBroadcastDispatch.java:43)
	at org.gradle.internal.event.BroadcastDispatch$SingletonDispatch.dispatch(BroadcastDispatch.java:268)
	at org.gradle.internal.event.BroadcastDispatch$SingletonDispatch.dispatch(BroadcastDispatch.java:170)
	at org.gradle.internal.event.AbstractBroadcastDispatch.dispatch(AbstractBroadcastDispatch.java:83)
	at org.gradle.internal.event.AbstractBroadcastDispatch.dispatch(AbstractBroadcastDispatch.java:69)
	at org.gradle.internal.event.BroadcastDispatch$CompositeDispatch.dispatch(BroadcastDispatch.java:381)
	at org.gradle.internal.event.BroadcastDispatch$CompositeDispatch.dispatch(BroadcastDispatch.java:272)
	at org.gradle.internal.event.ListenerBroadcast.dispatch(ListenerBroadcast.java:148)
	at org.gradle.internal.event.ListenerBroadcast.dispatch(ListenerBroadcast.java:37)
	at org.gradle.internal.dispatch.ProxyDispatchAdapter$DispatchingInvocationHandler.invoke(ProxyDispatchAdapter.java:94)
	at com.sun.proxy.$Proxy118.onOutput(Unknown Source)
	at org.gradle.api.internal.tasks.testing.results.TestListenerAdapter.output(TestListenerAdapter.java:56)
	at sun.reflect.GeneratedMethodAccessor622.invoke(Unknown Source)
	at sun.reflect.DelegatingMethodAccessorImpl.invoke(DelegatingMethodAccessorImpl.java:43)
	at java.lang.reflect.Method.invoke(Method.java:498)
	at org.gradle.internal.dispatch.ReflectionDispatch.dispatch(ReflectionDispatch.java:36)
	at org.gradle.internal.dispatch.ReflectionDispatch.dispatch(ReflectionDispatch.java:24)
	at org.gradle.internal.event.AbstractBroadcastDispatch.dispatch(AbstractBroadcastDispatch.java:43)
	at org.gradle.internal.event.BroadcastDispatch$SingletonDispatch.dispatch(BroadcastDispatch.java:268)
	at org.gradle.internal.event.BroadcastDispatch$SingletonDispatch.dispatch(BroadcastDispatch.java:170)
	at org.gradle.internal.event.AbstractBroadcastDispatch.dispatch(AbstractBroadcastDispatch.java:83)
	at org.gradle.internal.event.AbstractBroadcastDispatch.dispatch(AbstractBroadcastDispatch.java:69)
	at org.gradle.internal.event.BroadcastDispatch$CompositeDispatch.dispatch(BroadcastDispatch.java:381)
	at org.gradle.internal.event.BroadcastDispatch$CompositeDispatch.dispatch(BroadcastDispatch.java:272)
	at org.gradle.internal.event.ListenerBroadcast.dispatch(ListenerBroadcast.java:148)
	at org.gradle.internal.event.ListenerBroadcast.dispatch(ListenerBroadcast.java:37)
	at org.gradle.internal.dispatch.ProxyDispatchAdapter$DispatchingInvocationHandler.invoke(ProxyDispatchAdapter.java:94)
	at com.sun.proxy.$Proxy119.output(Unknown Source)
	at org.gradle.api.internal.tasks.testing.results.StateTrackingTestResultProcessor.output(StateTrackingTestResultProcessor.java:113)
	at org.gradle.api.internal.tasks.testing.results.AttachParentTestResultProcessor.output(AttachParentTestResultProcessor.java:52)
	at sun.reflect.GeneratedMethodAccessor626.invoke(Unknown Source)
	at sun.reflect.DelegatingMethodAccessorImpl.invoke(DelegatingMethodAccessorImpl.java:43)
	at java.lang.reflect.Method.invoke(Method.java:498)
	at org.gradle.internal.dispatch.ReflectionDispatch.dispatch(ReflectionDispatch.java:36)
	at org.gradle.internal.dispatch.ReflectionDispatch.dispatch(ReflectionDispatch.java:24)
	at org.gradle.internal.dispatch.FailureHandlingDispatch.dispatch(FailureHandlingDispatch.java:30)
	at org.gradle.internal.dispatch.AsyncDispatch.dispatchMessages(AsyncDispatch.java:87)
	at org.gradle.internal.dispatch.AsyncDispatch.access$000(AsyncDispatch.java:36)
	at org.gradle.internal.dispatch.AsyncDispatch$1.run(AsyncDispatch.java:71)
	at org.gradle.internal.concurrent.InterruptibleRunnable.run(InterruptibleRunnable.java:42)
	at org.gradle.internal.operations.CurrentBuildOperationRef.with(CurrentBuildOperationRef.java:80)
	at org.gradle.internal.operations.CurrentBuildOperationPreservingRunnable.run(CurrentBuildOperationPreservingRunnable.java:51)
	at org.gradle.internal.concurrent.ExecutorPolicy$CatchAndRecordFailures.onExecute(ExecutorPolicy.java:64)
	at org.gradle.internal.concurrent.AbstractManagedExecutor$1.run(AbstractManagedExecutor.java:47)
	at java.util.concurrent.ThreadPoolExecutor.runWorker(ThreadPoolExecutor.java:1149)
	at java.util.concurrent.ThreadPoolExecutor$Worker.run(ThreadPoolExecutor.java:624)
	at java.lang.Thread.run(Thread.java:750)
Caused by: java.io.IOException: No space left on device
	at java.io.FileOutputStream.writeBytes(Native Method)
	at java.io.FileOutputStream.write(FileOutputStream.java:326)
	at com.esotericsoftware.kryo.io.Output.flush(Output.java:163)
	... 57 more

1755 tests completed, 247 failed, 55 skipped

> Task :sdks:java:io:google-cloud-platform:test FAILED
> Task :sdks:java:io:google-cloud-platform:integrationTest
> Task :sdks:java:io:google-cloud-platform:integrationTestKms
> Task :sdks:java:io:google-cloud-platform:postCommit

FAILURE: Build failed with an exception.

* What went wrong:
Execution failed for task ':sdks:java:io:google-cloud-platform:test'.
> java.io.IOException: No space left on device

* Try:
> Run with --stacktrace option to get the stack trace.
> Run with --info or --debug option to get more log output.
> Get more help at https://help.gradle.org.

Deprecated Gradle features were used in this build, making it incompatible with Gradle 9.0.

You can use '--warning-mode all' to show the individual deprecation warnings and determine if they come from your own scripts or plugins.

For more on this, please refer to https://docs.gradle.org/8.4/userguide/command_line_interface.html#sec:command_line_warnings in the Gradle documentation.

BUILD FAILED in 45m 34s
136 actionable tasks: 85 executed, 51 from cache

A build scan cannot be produced as an error occurred gathering build data.
Please report this problem via https://gradle.com/help/plugin and include the following via copy/paste:

----------
Gradle version: 8.4
Plugin version: 3.13.2

com.gradle.scan.plugin.internal.m.a: Build operation dispatch of progress notification [LIFECYCLE] [TestEventLogger] <Normal>    java.nio.file.FileSystemException at UnixException.java:91
</Normal> failed.
Operation context: 
	org.gradle.launcher.exec.RunAsBuildOperationBuildActionExecutor$1 (1): {}
	org.gradle.execution.RunRootBuildWorkBuildOperationType$Details (16974): {getBuildStartTime=1698338905724}
	org.gradle.api.internal.tasks.execution.ExecuteTaskBuildOperationDetails (18590): {buildPath=:, taskPath=:sdks:java:io:google-cloud-platform:test, taskClass=org.gradle.api.tasks.testing.Test, taskId=511}
	org.gradle.internal.execution.steps.ExecuteStep$1$1 (18602): {getIdentity=org.gradle.api.internal.tasks.execution.TaskExecution$$Lambda$1501/560091964@320d7c44, getWorkType=class org.gradle.api.internal.tasks.execution.TaskExecution}
	org.gradle.api.internal.tasks.execution.ExecuteTaskActionBuildOperationType$1 (18607): {}
Caused by: java.lang.RuntimeException: Could not serialize event class 'com.gradle.scan.agent.serialization.scan.a.b'.
	at com.gradle.scan.plugin.internal.h.c.c.a(SourceFile:112)
	at com.gradle.scan.plugin.internal.h.a.a(SourceFile:42)
	at com.gradle.scan.plugin.internal.h.a.b(SourceFile:34)
	at com.gradle.scan.plugin.internal.h.b.b(SourceFile:34)
	at com.gradle.scan.plugin.internal.h.d.c(SourceFile:39)
	at com.gradle.scan.plugin.internal.c.t.b.a(SourceFile:16)
	at com.gradle.scan.plugin.internal.c.t.d.a(SourceFile:32)
	at com.gradle.scan.plugin.internal.m.b$b.a(SourceFile:108)
	at com.gradle.scan.plugin.internal.m.b$b.progress(SourceFile:98)
	at com.gradle.scan.plugin.internal.m.b.a(SourceFile:60)
	at com.gradle.scan.plugin.internal.m.n.a(SourceFile:42)
	at com.gradle.scan.plugin.internal.m.d.a(SourceFile:93)
	at com.gradle.scan.plugin.internal.m.h.a(SourceFile:45)
	at com.gradle.scan.plugin.internal.r.a$a.a(SourceFile:31)
	at com.gradle.scan.plugin.internal.r.a$a.a(SourceFile:20)
	at com.gradle.scan.plugin.internal.r.a.c(SourceFile:67)
Caused by: java.lang.RuntimeException: java.io.IOException: No space left on device
	at com.gradle.scan.agent.serialization.scan.serializer.d.flush(SourceFile:245)
	at com.gradle.scan.agent.serialization.scan.serializer.c.a(SourceFile:116)
	at com.gradle.scan.agent.serialization.scan.serializer.c.a(SourceFile:106)
	at com.gradle.scan.agent.serialization.scan.serializer.c.a(SourceFile:75)
	at com.gradle.scan.plugin.internal.h.c.c.a(SourceFile:110)
	... 15 more
Caused by: java.io.IOException: No space left on device
	at com.gradle.scan.agent.serialization.scan.serializer.d.flush(SourceFile:243)
	... 19 more
----------

Build step 'Invoke Gradle script' changed build result to FAILURE
Build step 'Invoke Gradle script' marked build as failure

---------------------------------------------------------------------
To unsubscribe, e-mail: builds-unsubscribe@beam.apache.org
For additional commands, e-mail: builds-help@beam.apache.org


Jenkins build is back to normal : beam_PreCommit_Java_GCP_IO_Direct_Cron #1929

Posted by Apache Jenkins Server <je...@builds.apache.org>.
See <https://ci-beam.apache.org/job/beam_PreCommit_Java_GCP_IO_Direct_Cron/1929/display/redirect>


---------------------------------------------------------------------
To unsubscribe, e-mail: builds-unsubscribe@beam.apache.org
For additional commands, e-mail: builds-help@beam.apache.org